{"text_format":"3","workbook":"xlsx","n_sheets":4,"sheets":["里程碑","藍圖","關於","圖表資料"],"not_rendered":{"charts":1,"defined_names":2},"read":"whole","date_system":"1900"}

{"sheet":"里程碑","index":0,"n_rows":27,"n_cols":5,"rows_kept":27}
["在此工作表中輸入重要的里程碑或活動來建立藍圖。\n儲存格 C1 為此工作表的標題。\n如何使用本工作表的相關資訊，其中包括位於 [關於] 工作表中螢幕助讀程式的指示。\n繼續往下瀏覽欄 A，以取得進一步的指示。",null,"里程碑"]
["儲存格 C2 到 E2 為表格標題。使用 [排序與篩選] 選項來排序或尋找特定項目。\n在從儲存格 C3 開始的表格中，輸入含有日期的里程碑，並設定繪製里程碑圖表的位置。\n欄 B 已設為隱藏。由此資料產生的圖表會使用捲軸來檢視時間表上的區段。欄 B 可協助判斷要在捲軸的值增加時將哪些里程碑繪製成圖表。\n警告：刪除或修改欄 B 的內容可能會干擾此活頁簿內建之圖表的完整性。","編號","位置","日期","里程碑"]
["在儲存格 C1 中輸入要繪製日期與里程碑圖表的位置。輸入 1 到 3 之間的正數以在時間表上方繪製里程碑的圖表。輸入 1 到 3 之間的負數以在時間表下方繪製里程碑的圖表。\n在表格內的欄 D 和 E 中輸入日期與里程碑或活動。\n針對右側表格中的每個新列重複此模式。\n列 3 到列 26 中會提供範例資料。修改或刪除範例內容來建立您自己的藍圖。\n繼續移至儲存格 A27 以查看下一個指示。",{"$f":"ROW($A1)","v":1},1,{"$f":"TODAY()","v":"2018-06-29"},"開始"]
[null,{"$f":"ROW($A2)","v":2},-2,{"$f":"D3+10","v":"2018-07-09"},"問題分析\n活動 1"]
[null,3,1,{"$f":"D4+20","v":"2018-07-29"},"開發業務案例\n活動 1\n活動 2"]
[null,4,-1,{"$f":"D5+30","v":"2018-08-28"},"檢閱簡報"]
[null,{"$f":"ROW($A5)","v":5},{"v":-0.5,"d":"-1"},{"$f":"D6+40","v":"2018-10-07"},"開始執行\n活動 1\n活動 2"]
[null,{"$f":"ROW($A6)","v":6},2,{"$f":"D7+50","v":"2018-11-26"},"調整執行\n活動 1\n活動 2\n活動 3"]
[null,7,{"v":0.5,"d":"1"},{"$f":"D8+60","v":"2019-01-25"},"專案關係人參與"]
[null,8,-1,{"$f":"D9+70","v":"2019-04-05"},"選取資源"]
[null,9,{"v":0.5,"d":"1"},{"$f":"D10+80","v":"2019-06-24"},"建立團隊\n活動 1 "]
[null,10,-2,{"$f":"D11+90","v":"2019-09-22"},"團隊開始運作\n活動 1\n活動 2\n活動 3\n活動 4"]
[null,11,3,{"$f":"D12+100","v":"2019-12-31"},"開始收集資料"]
[null,12,-1,{"$f":"D13+90","v":"2020-03-30"},"資料分析"]
[null,13,1,{"$f":"D14+80","v":"2020-06-18"},"設計"]
[null,14,1,{"$f":"D15+70","v":"2020-08-27"},"驗證概念"]
[null,15,-3,{"$f":"D16+60","v":"2020-10-26"},"測試與分析"]
[null,16,-2,{"$f":"D17+50","v":"2020-12-15"},"重新設計"]
[null,17,2,{"$f":"D18+40","v":"2021-01-24"},"重新開發"]
[null,18,-1,{"$f":"D19+30","v":"2021-02-23"},"測試與分析"]
[null,19,1,{"$f":"D20+20","v":"2021-03-15"},"重新設計"]
[null,20,-3,{"$f":"D21+10","v":"2021-03-25"},"重新開發"]
[null,21,2,{"$f":"D22+20","v":"2021-04-14"},"最後測試"]
[null,22,1,{"$f":"D23+30","v":"2021-05-14"},"Beta 版測試"]
[null,23,-3,{"$f":"D24+40","v":"2021-06-23"},"審查"]
[null,24,-2,{"$f":"D25+50","v":"2021-08-12"},"上市"]
["若要在 [藍圖里程碑] 表格中新增更多列，只要在此列上方插入新列即可。\n此工作表中沒有進一步的指示。",null,"若要新增更多里程碑，請在此行上方插入新列。"]

{"sheet":"藍圖","index":1,"n_rows":3,"n_cols":4,"rows_kept":3}
["此工作表為顯示來自 [里程碑] 工作表之里程碑的圖表。\n儲存格 B2、C2 和 D2 會顯示年份，並套用 [標題 3] 樣式。\n一次能繪製 10 個里程碑。\n使用儲存格 B4 到 D4 的捲軸來瀏覽藍圖。\n儲存格 B3 到 D3 為時間表的年份。\n此工作表中沒有進一步的指示。"]
[]
[null,{"$f":"圖表資料!B20","v":2018},{"$f":"圖表資料!B21","v":""},{"$f":"圖表資料!B22","v":2019}]

{"sheet":"關於","index":2,"n_rows":5,"n_cols":1,"rows_kept":5}
["關於此活頁簿"]
["螢幕助讀程式的指南"]
["此活頁簿有 4 個工作表。\n\n里程碑\n藍圖\n關於\n圖表資料 (隱藏)\n\n每個工作表的儲存格 A1 開始的 A 欄中為每個工作表的指示。指示是以隱藏文字撰寫。每個步驟都會引導您完成下一列中的資訊。除非另有明確的指示，否則每個後續步驟會繼續在儲存格 A2、A3 中，依此類推。例如，指示文字會顯示「繼續前往儲存格 A6」以進行下一個步驟。\n\n隱藏文字不會列印出來。\n\n若要移除任何工作表中的這些指示，只要刪除欄 A 即可。\n"]
["此藍圖使用位置來繪製里程碑與活動圖表。位置可用來為里程碑或活動加上權重。只要根據您的權重喜好設定來調整值。例如，里程碑/活動 3 的權重可能大於里程碑/活動 2。若要在圖表上指出，只要讓里程碑/活動 3 的 [位置] 值大於里程碑/活動 2 即可。  \n"]
["這是此工作表中的最後指示。"]

{"sheet":"圖表資料","index":3,"n_rows":26,"n_cols":4,"rows_kept":26,"hidden":true}
["建立動態圖表所需的資料位於此工作表中。請勿刪除此工作表！\n刪除此工作表可能損害活頁簿的動態功能。","請勿刪除此工作表！"]
["儲存格 B2 為表格的標題。","動態圖表內容"]
["儲存格 B3 到 D3 為表格標題。\n此表格會根據 [里程碑] 工作表中輸入的內容自動更新。\n警告：修改或刪除此表格中的內容可能會損害 [藍圖] 工作表中 [藍圖] 圖表的動態更新功能。\n繼續移至儲存格 A15 以查看下一個指示。","日期","活動","位置"]
[null,{"$f":"IFERROR(IF(LEN(里程碑!D3)=0,\"\",INDEX(藍圖里程碑[],里程碑!$B3+$B$17,3)),\"\")","v":"2018-06-29"},{"$f":"IFERROR(IF(LEN(里程碑!E3)=0,\"\",INDEX(藍圖里程碑[],里程碑!$B3+$B$17,4)),\"\")","v":"開始"},{"$f":"IFERROR(INDEX(藍圖里程碑[],里程碑!$B3+$B$17,2),\"\")","v":1}]
[null,{"$f":"IFERROR(IF(LEN(里程碑!D4)=0,\"\",INDEX(藍圖里程碑[],里程碑!$B4+$B$17,3)),\"\")","v":"2018-07-09"},{"$f":"IFERROR(IF(LEN(里程碑!E4)=0,\"\",INDEX(藍圖里程碑[],里程碑!$B4+$B$17,4)),\"\")","v":"問題分析\n活動 1"},{"$f":"IFERROR(INDEX(藍圖里程碑[],里程碑!$B4+$B$17,2),\"\")","v":-2}]
[null,{"$f":"IFERROR(IF(LEN(里程碑!D5)=0,\"\",INDEX(藍圖里程碑[],里程碑!$B5+$B$17,3)),\"\")","v":"2018-07-29"},{"$f":"IFERROR(IF(LEN(里程碑!E5)=0,\"\",INDEX(藍圖里程碑[],里程碑!$B5+$B$17,4)),\"\")","v":"開發業務案例\n活動 1\n活動 2"},{"$f":"IFERROR(INDEX(藍圖里程碑[],里程碑!$B5+$B$17,2),\"\")","v":1}]
[null,{"$f":"IFERROR(IF(LEN(里程碑!D6)=0,\"\",INDEX(藍圖里程碑[],里程碑!$B6+$B$17,3)),\"\")","v":"2018-08-28"},{"$f":"IFERROR(IF(LEN(里程碑!E6)=0,\"\",INDEX(藍圖里程碑[],里程碑!$B6+$B$17,4)),\"\")","v":"檢閱簡報"},{"$f":"IFERROR(INDEX(藍圖里程碑[],里程碑!$B6+$B$17,2),\"\")","v":-1}]
[null,{"$f":"IFERROR(IF(LEN(里程碑!D7)=0,\"\",INDEX(藍圖里程碑[],里程碑!$B7+$B$17,3)),\"\")","v":"2018-10-07"},{"$f":"IFERROR(IF(LEN(里程碑!E7)=0,\"\",INDEX(藍圖里程碑[],里程碑!$B7+$B$17,4)),\"\")","v":"開始執行\n活動 1\n活動 2"},{"$f":"IFERROR(INDEX(藍圖里程碑[],里程碑!$B7+$B$17,2),\"\")","v":-0.5}]
[null,{"$f":"IFERROR(IF(LEN(里程碑!D8)=0,\"\",INDEX(藍圖里程碑[],里程碑!$B8+$B$17,3)),\"\")","v":"2018-11-26"},{"$f":"IFERROR(IF(LEN(里程碑!E8)=0,\"\",INDEX(藍圖里程碑[],里程碑!$B8+$B$17,4)),\"\")","v":"調整執行\n活動 1\n活動 2\n活動 3"},{"$f":"IFERROR(INDEX(藍圖里程碑[],里程碑!$B8+$B$17,2),\"\")","v":2}]
[null,{"$f":"IFERROR(IF(LEN(里程碑!D9)=0,\"\",INDEX(藍圖里程碑[],里程碑!$B9+$B$17,3)),\"\")","v":"2019-01-25"},{"$f":"IFERROR(IF(LEN(里程碑!E9)=0,\"\",INDEX(藍圖里程碑[],里程碑!$B9+$B$17,4)),\"\")","v":"專案關係人參與"},{"$f":"IFERROR(INDEX(藍圖里程碑[],里程碑!$B9+$B$17,2),\"\")","v":0.5}]
[null,{"$f":"IFERROR(IF(LEN(里程碑!D10)=0,\"\",INDEX(藍圖里程碑[],里程碑!$B10+$B$17,3)),\"\")","v":"2019-04-05"},{"$f":"IFERROR(IF(LEN(里程碑!E10)=0,\"\",INDEX(藍圖里程碑[],里程碑!$B10+$B$17,4)),\"\")","v":"選取資源"},{"$f":"IFERROR(INDEX(藍圖里程碑[],里程碑!$B10+$B$17,2),\"\")","v":-1}]
[null,{"$f":"IFERROR(IF(LEN(里程碑!D11)=0,\"\",INDEX(藍圖里程碑[],里程碑!$B11+$B$17,3)),\"\")","v":"2019-06-24"},{"$f":"IFERROR(IF(LEN(里程碑!E11)=0,\"\",INDEX(藍圖里程碑[],里程碑!$B11+$B$17,4)),\"\")","v":"建立團隊\n活動 1 "},{"$f":"IFERROR(INDEX(藍圖里程碑[],里程碑!$B11+$B$17,2),\"\")","v":0.5}]
[null,{"$f":"IFERROR(IF(LEN(里程碑!D12)=0,\"\",INDEX(藍圖里程碑[],里程碑!$B12+$B$17,3)),\"\")","v":"2019-09-22"},{"$f":"IFERROR(IF(LEN(里程碑!E12)=0,\"\",INDEX(藍圖里程碑[],里程碑!$B12+$B$17,4)),\"\")","v":"團隊開始運作\n活動 1\n活動 2\n活動 3\n活動 4"},{"$f":"IFERROR(INDEX(藍圖里程碑[],里程碑!$B12+$B$17,2),\"\")","v":-2}]
[]
["透過增量值的協助，能讓您捲動瀏覽藍圖。儲存格 B15 為這項功能的標題。\n儲存格 B16 和 B17 為一個含有標題和單一值的表格。\n繼續移至儲存格 A19 以查看下一個指示。","捲動功能"]
[null,"列增量"]
[null,0]
[]
["[藍圖] 圖表會繪製時間表的年份。若要這麼做，系統必須從 [里程碑] 清單中擷取這些年份。\n此節的標題為「年份」，位於儲存格 B19 中。\n儲存格 C20 到 C22 會自動產生年份值。\n警告：刪除或修改這些年份可能會變更 [藍圖] 圖表的正確性。\n繼續移至儲存格 A24 以查看下一個指示。","年份"]
[null,{"$f":"IFERROR(YEAR(B4),\"\")","v":2018},"<-- 藍圖起始位置的年份"]
[null,{"$f":"IFERROR(IF(YEAR($B$9)=$B$20,\"\",YEAR($B$9)),\"\")","v":""},"<-- 藍圖中間位置的年份，請注意，如果此年份與藍圖起始位置的年份相同，則此儲存格可能為空白"]
[null,{"$f":"IFERROR(IF(YEAR($B$13)=$B$20,\"\",YEAR($B$13)),\"\")","v":2019},"<-- 藍圖最終位置的年份，請注意，如果此年份與藍圖起始位置的年份相同，則此儲存格可能為空白"]
[]
["[藍圖] 圖表的環圈標記中包含此工作表之動態圖表內容的日期。這些日期包括儲存格 C24 中的起始日期、儲存格 C25 中的中間日期，和儲存格 C26 中的最終日期。\n此工作表中沒有進一步的指示。","起始日期",{"$f":"B4","v":"2018-06-29"}]
[null,"中間日期",{"$f":"B9","v":"2018-11-26"}]
[null,"最終日期",{"$f":"B13","v":"2019-09-22"}]