{"text_format":"3","workbook":"xlsx","n_sheets":9,"sheets":["摘要","1 班","2 班","3 班","4 班","5 班","6 班","7 班","GPA 表格"],"not_rendered":{"defined_names":9},"read":"whole","date_system":"1900"}

{"sheet":"摘要","index":0,"n_rows":12,"n_cols":7,"rows_kept":12,"merged":[[1,1,1,2]]}
[]
[null,"學校名稱",null,"    您的姓名：",null," 學期/學年："]
[]
[null,"班級","學分數","目前百分比","成績點數","GPA","加權 GPA"]
[null,"1 班",{"v":3,"d":"3.0"},{"$f":"'1 班'!D$36","v":{"v":0.8661764705882353,"d":"86.62%"}},{"$f":"IF(D5<>\"\",HLOOKUP(D5,'GPA 表格'!$C$5:$O$7,2),\"\")","v":"B"},{"$f":"IF(D5<>\"\",HLOOKUP(D5,'GPA 表格'!$C$5:$O$7,3),\"\")","v":{"v":3,"d":"3.00"}},{"$f":"IF(F5<>\"\",F5*C5/(SUM($C$5:$C$11)), \"\")","v":{"v":0.5625,"d":"0.56"}}]
[null,"2 班",{"v":4,"d":"4.0"},{"$f":"'2 班'!D$36","v":""},{"$f":"IF(D6<>\"\",HLOOKUP(D6,'GPA 表格'!$C$5:$O$7,2),\"\")","v":""},{"$f":"IF(D6<>\"\",HLOOKUP(D6,'GPA 表格'!$C$5:$O$7,3),\"\")","v":""},""]
[null,"3 班",{"v":2,"d":"2.0"},{"$f":"'3 班'!D$36","v":""},{"$f":"IF(D7<>\"\",HLOOKUP(D7,'GPA 表格'!$C$5:$O$7,2),\"\")","v":""},{"$f":"IF(D7<>\"\",HLOOKUP(D7,'GPA 表格'!$C$5:$O$7,3),\"\")","v":""},""]
[null,"4 班",{"v":4,"d":"4.0"},{"$f":"'4 班'!D$36","v":""},{"$f":"IF(D8<>\"\",HLOOKUP(D8,'GPA 表格'!$C$5:$O$7,2),\"\")","v":""},{"$f":"IF(D8<>\"\",HLOOKUP(D8,'GPA 表格'!$C$5:$O$7,3),\"\")","v":""},""]
[null,"5 班",{"v":1,"d":"1.0"},{"$f":"'5 班'!D$36","v":""},{"$f":"IF(D9<>\"\",HLOOKUP(D9,'GPA 表格'!$C$5:$O$7,2),\"\")","v":""},{"$f":"IF(D9<>\"\",HLOOKUP(D9,'GPA 表格'!$C$5:$O$7,3),\"\")","v":""},""]
[null,"6 班",{"v":1,"d":"1.0"},{"$f":"'6 班'!D$36","v":""},{"$f":"IF(D10<>\"\",HLOOKUP(D10,'GPA 表格'!$C$5:$O$7,2),\"\")","v":""},{"$f":"IF(D10<>\"\",HLOOKUP(D10,'GPA 表格'!$C$5:$O$7,3),\"\")","v":""},""]
[null,"7 班",{"v":1,"d":"1.0"},{"$f":"'7 班'!D$36","v":""},{"$f":"IF(D11<>\"\",HLOOKUP(D11,'GPA 表格'!$C$5:$O$7,2),\"\")","v":""},{"$f":"IF(D11<>\"\",HLOOKUP(D11,'GPA 表格'!$C$5:$O$7,3),\"\")","v":""},""]
[null,"總計",{"$f":"SUM(C5:C11)","v":16},{"$f":"AVERAGE(D5:D11)","v":{"v":0.8661764705882353,"d":"86.62%"}},{"$f":"IF(D12<>\"\",HLOOKUP(D12,'GPA 表格'!$C$5:$O$7,2),\"\")","v":"B"},{"$f":"AVERAGE(F5:F11)","v":{"v":3,"d":"3.00"}},{"$f":"SUM(G5:G11)","v":{"v":0.5625,"d":"0.56"}}]

{"sheet":"1 班","index":1,"n_rows":38,"n_cols":8,"rows_kept":38,"merged":[[1,1,1,2]]}
[]
[null,{"$f":"摘要!B5","v":"1 班"}]
[null,"教師：",null,null,"最高分總計百分比",null,null,{"$f":"IF(SUM($C$35:$H$35) <> 0,SUM($C$34:$H$34)/SUM($C$35:$H$35),\"\")","v":{"v":0.8661764705882353,"d":"86.62%"}}]
[null,"電子郵件：",null,null,"目前成績",null,null,{"$f":"SUM($C$34:$H$34)","v":{"v":0.17323529411764707,"d":"17.32%"}}]
[]
[null,"作業","家庭作業","論文","測驗","專案研究","期中考","期末考"]
[null,"權重",{"v":0.1,"d":"10.0%"},{"v":0.1,"d":"10.0%"},{"v":0.15,"d":"15.0%"},{"v":0.15,"d":"15.0%"},{"v":0.2,"d":"20.0%"},{"v":0.3,"d":"30.0%"}]
[null,"第一次家庭作業",{"v":0.8823529411764706,"d":"0.88"}]
[null,"WWII 相關報告",null,0.85]
{"$rows_empty":24}
[null,"總分",{"$f":"IF(COUNT(C8:C33) <> 0,AVERAGE(C8:C33) *C7, \"\")","v":{"v":0.08823529411764706,"d":"0.0882"}},{"v":0.085,"d":"0.0850"},"","","",""]
[null,"最高分總計",{"$f":"IF(COUNT(C8:C33)<>0,C7,\"\")","v":0.1},0.1,"","","",""]
[null,"最高分總計百分比",null,{"$f":"IF(SUM($C$35:$H$35) <> 0,SUM($C$34:$H$34)/SUM($C$35:$H$35),\"\")","v":{"v":0.8661764705882353,"d":"86.62%"}}]
[null,"輸入成績：","輸入您在最高分中的得分 (例如 15/17)。"]
[null,null,"輸入您的得分百分比 (例如 85%)。"]

{"sheet":"2 班","index":2,"n_rows":38,"n_cols":8,"rows_kept":38,"merged":[[1,1,1,2]]}
[]
[null,{"$f":"摘要!B6","v":"2 班"}]
[null,"教師：",null,null,"最高分總計百分比",null,null,{"$f":"IF(SUM($C$35:$H$35) <> 0,SUM($C$34:$H$34)/SUM($C$35:$H$35),\"\")","v":""}]
[null,"電子郵件：",null,null,"目前成績",null,null,{"$f":"SUM($C$34:$H$34)","v":{"v":0,"d":"0.00%"}}]
[]
[null,"作業","家庭作業","論文","測驗","專案研究","期中考","期末考"]
[null,"權重",{"v":0.1,"d":"10.0%"},{"v":0.1,"d":"10.0%"},{"v":0.15,"d":"15.0%"},{"v":0.15,"d":"15.0%"},{"v":0.2,"d":"20.0%"},{"v":0.3,"d":"30.0%"}]
{"$rows_empty":26}
[null,"總分",{"$f":"IF(COUNT(C8:C33) <> 0,AVERAGE(C8:C33) *C7, \"\")","v":""},"","","","",""]
[null,"最高分總計",{"$f":"IF(COUNT(C8:C33)<>0,C7,\"\")","v":""},"","","","",""]
[null,"最高分總計百分比",null,{"$f":"IF(SUM($C$35:$H$35) <> 0,SUM($C$34:$H$34)/SUM($C$35:$H$35),\"\")","v":""}]
[null,"輸入成績：","輸入您在最高分中的得分 (例如 15/17)。"]
[null,null,"輸入您的得分百分比 (例如 85%)。"]

{"sheet":"3 班","index":3,"n_rows":38,"n_cols":8,"rows_kept":38,"merged":[[1,1,1,2]]}
[]
[null,{"$f":"摘要!B7","v":"3 班"}]
[null,"教師：",null,null,"最高分總計百分比",null,null,{"$f":"IF(SUM($C$35:$H$35) <> 0,SUM($C$34:$H$34)/SUM($C$35:$H$35),\"\")","v":""}]
[null,"電子郵件：",null,null,"目前成績",null,null,{"$f":"SUM($C$34:$H$34)","v":{"v":0,"d":"0.00%"}}]
[]
[null,"作業","家庭作業","論文","測驗","專案研究","期中考","期末考"]
[null,"權重",{"v":0.1,"d":"10.0%"},{"v":0.1,"d":"10.0%"},{"v":0.15,"d":"15.0%"},{"v":0.15,"d":"15.0%"},{"v":0.2,"d":"20.0%"},{"v":0.3,"d":"30.0%"}]
{"$rows_empty":26}
[null,"總分",{"$f":"IF(COUNT(C8:C33) <> 0,AVERAGE(C8:C33) *C7, \"\")","v":""},"","","","",""]
[null,"最高分總計",{"$f":"IF(COUNT(C8:C33)<>0,C7,\"\")","v":""},"","","","",""]
[null,"最高分總計百分比",null,{"$f":"IF(SUM($C$35:$H$35) <> 0,SUM($C$34:$H$34)/SUM($C$35:$H$35),\"\")","v":""}]
[null,"輸入成績：","輸入您在最高分中的得分 (例如 15/17)。"]
[null,null,"輸入您的得分百分比 (例如 85%)。"]

{"sheet":"4 班","index":4,"n_rows":38,"n_cols":8,"rows_kept":38,"merged":[[1,1,1,2]]}
[]
[null,{"$f":"摘要!B8","v":"4 班"}]
[null,"教師：",null,null,"最高分總計百分比"]
[null,"電子郵件：",null,null,"目前成績",null,null,{"$f":"SUM($C$34:$H$34)","v":{"v":0,"d":"0.00%"}}]
[]
[null,"作業","家庭作業","論文","測驗","專案研究","期中考","期末考"]
[null,"權重",{"v":0.1,"d":"10.0%"},{"v":0.1,"d":"10.0%"},{"v":0.15,"d":"15.0%"},{"v":0.15,"d":"15.0%"},{"v":0.2,"d":"20.0%"},{"v":0.3,"d":"30.0%"}]
{"$rows_empty":26}
[null,"總分",{"$f":"IF(COUNT(C8:C33) <> 0,AVERAGE(C8:C33) *C7, \"\")","v":""},"","","","",""]
[null,"最高分總計",{"$f":"IF(COUNT(C8:C33)<>0,C7,\"\")","v":""},"","","","",""]
[null,"最高分總計百分比",null,{"$f":"IF(SUM($C$35:$H$35) <> 0,SUM($C$34:$H$34)/SUM($C$35:$H$35),\"\")","v":""}]
[null,"輸入成績：","輸入您在最高分中的得分 (例如 15/17)。"]
[null,null,"輸入您的得分百分比 (例如 85%)。"]

{"sheet":"5 班","index":5,"n_rows":38,"n_cols":8,"rows_kept":38,"merged":[[1,1,1,2]]}
[]
[null,{"$f":"摘要!B9","v":"5 班"}]
[null,"教師：",null,null,"最高分總計百分比",null,null,{"$f":"IF(SUM($C$35:$H$35) <> 0,SUM($C$34:$H$34)/SUM($C$35:$H$35),\"\")","v":""}]
[null,"電子郵件：",null,null,"目前成績",null,null,{"$f":"SUM($C$34:$H$34)","v":{"v":0,"d":"0.00%"}}]
[]
[null,"作業","家庭作業","論文","測驗","專案研究","期中考","期末考"]
[null,"權重",{"v":0.1,"d":"10.0%"},{"v":0.1,"d":"10.0%"},{"v":0.15,"d":"15.0%"},{"v":0.15,"d":"15.0%"},{"v":0.2,"d":"20.0%"},{"v":0.3,"d":"30.0%"}]
{"$rows_empty":26}
[null,"總分",{"$f":"IF(COUNT(C8:C33) <> 0,AVERAGE(C8:C33) *C7, \"\")","v":""},"","","","",""]
[null,"最高分總計",{"$f":"IF(COUNT(C8:C33)<>0,C7,\"\")","v":""},"","","","",""]
[null,"最高分總計百分比",null,{"$f":"IF(SUM($C$35:$H$35) <> 0,SUM($C$34:$H$34)/SUM($C$35:$H$35),\"\")","v":""}]
[null,"輸入成績：","輸入您在最高分中的得分 (例如 15/17)。"]
[null,null,"輸入您的得分百分比 (例如 85%)。"]

{"sheet":"6 班","index":6,"n_rows":38,"n_cols":8,"rows_kept":38,"merged":[[1,1,1,2]]}
[]
[null,{"$f":"摘要!B10","v":"6 班"}]
[null,"教師：",null,null,"最高分總計百分比",null,null,{"$f":"IF(SUM($C$35:$H$35) <> 0,SUM($C$34:$H$34)/SUM($C$35:$H$35),\"\")","v":""}]
[null,"電子郵件：",null,null,"目前成績",null,null,{"$f":"SUM($C$34:$H$34)","v":{"v":0,"d":"0.00%"}}]
[]
[null,"作業","家庭作業","論文","測驗","專案研究","期中考","期末考"]
[null,"權重",{"v":0.1,"d":"10.0%"},{"v":0.1,"d":"10.0%"},{"v":0.15,"d":"15.0%"},{"v":0.15,"d":"15.0%"},{"v":0.2,"d":"20.0%"},{"v":0.3,"d":"30.0%"}]
{"$rows_empty":26}
[null,"總分",{"$f":"IF(COUNT(C8:C33) <> 0,AVERAGE(C8:C33) *C7, \"\")","v":""},"","","","",""]
[null,"最高分總計",{"$f":"IF(COUNT(C8:C33)<>0,C7,\"\")","v":""},"","","","",""]
[null,"最高分總計百分比",null,{"$f":"IF(SUM($C$35:$H$35) <> 0,SUM($C$34:$H$34)/SUM($C$35:$H$35),\"\")","v":""},{"$f":"IF(SUM($C$35:$H$35) <> 0,SUM($C$34:$H$34)/SUM($C$35:$H$35),\"\")","v":""}]
[null,"輸入成績：","輸入您在最高分中的得分 (例如 15/17)。"]
[null,null,"輸入您的得分百分比 (例如 85%)。"]

{"sheet":"7 班","index":7,"n_rows":38,"n_cols":8,"rows_kept":38,"merged":[[1,1,1,2]]}
[]
[null,{"$f":"摘要!B11","v":"7 班"}]
[null,"教師：",null,null,"最高分總計百分比",null,null,{"$f":"IF(SUM($C$35:$H$35) <> 0,SUM($C$34:$H$34)/SUM($C$35:$H$35),\"\")","v":""}]
[null,"電子郵件：",null,null,"目前成績",null,null,{"$f":"SUM($C$34:$H$34)","v":{"v":0,"d":"0.00%"}}]
[]
[null,"作業","家庭作業","論文","測驗","專案研究","期中考","期末考"]
[null,"權重",{"v":0.1,"d":"10.0%"},{"v":0.1,"d":"10.0%"},{"v":0.15,"d":"15.0%"},{"v":0.15,"d":"15.0%"},{"v":0.2,"d":"20.0%"},{"v":0.3,"d":"30.0%"}]
{"$rows_empty":26}
[null,"總分",{"$f":"IF(COUNT(C8:C33) <> 0,AVERAGE(C8:C33) *C7, \"\")","v":""},"","","","",""]
[null,"最高分總計",{"$f":"IF(COUNT(C8:C33)<>0,C7,\"\")","v":""},"","","","",""]
[null,"最高分總計百分比",null,{"$f":"IF(SUM($C$35:$H$35) <> 0,SUM($C$34:$H$34)/SUM($C$35:$H$35),\"\")","v":""}]
[null,"輸入成績：","輸入您在最高分中的得分 (例如 15/17)。"]
[null,null,"輸入您的得分百分比 (例如 85%)。"]

{"sheet":"GPA 表格","index":8,"n_rows":7,"n_cols":15,"rows_kept":7}
[]
[]
[]
[null,"成績與 GPA 表格"]
[null,"平均",{"v":0,"d":"0%"},{"v":0.6,"d":"60%"},{"v":0.63,"d":"63%"},{"v":0.67,"d":"67%"},{"v":0.7,"d":"70%"},{"v":0.73,"d":"73%"},{"v":0.77,"d":"77%"},{"v":0.8,"d":"80%"},{"v":0.83,"d":"83%"},{"v":0.87,"d":"87%"},{"v":0.9,"d":"90%"},{"v":0.93,"d":"93%"},{"v":0.97,"d":"97%"}]
[null,"成績以字母表示","F","D-","D","D+","C-","C","C+","B-","B","B+","A-","A","A+"]
[null,"GPA",{"v":0,"d":"0.00"},0.67,{"v":1,"d":"1.00"},1.33,1.67,{"v":2,"d":"2.00"},2.33,2.67,{"v":3,"d":"3.00"},3.33,3.67,{"v":4,"d":"4.00"},{"v":4,"d":"4.00"}]