{"text_format":"3","workbook":"xlsx","n_sheets":4,"sheets":["活动","日历","打印版本","管理员"],"not_rendered":{"defined_names":18},"read":"whole","date_system":"1900"}

{"sheet":"活动","index":0,"n_rows":38,"n_cols":5,"rows_kept":38}
[]
[null,"每月社区"]
[null,"活动规划器"]
[]
[]
[]
[]
[null,"日期","星期","月","活动名称"]
[null,"2016-07-01",{"$f":"IF(ISBLANK(tblEvents[[#This Row],[日期]]),\"\",UPPER(TEXT(tblEvents[[#This Row],[日期]],\"aaa\")))","v":"五"},{"$f":"IF(ISBLANK(tblEvents[[#This Row],[日期]]),\"\",LOOKUP(_xlfn.NUMBERVALUE(TEXT(tblEvents[[#This Row],[日期]],\"m\")),tblMonths[编号],tblMonths[月]))","v":"七月"},"社区花园"]
[null,"2016-07-01",{"$f":"IF(ISBLANK(tblEvents[[#This Row],[日期]]),\"\",UPPER(TEXT(tblEvents[[#This Row],[日期]],\"aaa\")))","v":"五"},{"$f":"IF(ISBLANK(tblEvents[[#This Row],[日期]]),\"\",LOOKUP(_xlfn.NUMBERVALUE(TEXT(tblEvents[[#This Row],[日期]],\"m\")),tblMonths[编号],tblMonths[月]))","v":"七月"},"市议会"]
[null,"2016-07-02",{"$f":"IF(ISBLANK(tblEvents[[#This Row],[日期]]),\"\",UPPER(TEXT(tblEvents[[#This Row],[日期]],\"aaa\")))","v":"六"},{"$f":"IF(ISBLANK(tblEvents[[#This Row],[日期]]),\"\",LOOKUP(_xlfn.NUMBERVALUE(TEXT(tblEvents[[#This Row],[日期]],\"m\")),tblMonths[编号],tblMonths[月]))","v":"七月"},"社区花园"]
[null,"2016-07-03",{"$f":"IF(ISBLANK(tblEvents[[#This Row],[日期]]),\"\",UPPER(TEXT(tblEvents[[#This Row],[日期]],\"aaa\")))","v":"日"},{"$f":"IF(ISBLANK(tblEvents[[#This Row],[日期]]),\"\",LOOKUP(_xlfn.NUMBERVALUE(TEXT(tblEvents[[#This Row],[日期]],\"m\")),tblMonths[编号],tblMonths[月]))","v":"七月"},"公园电影之夜"]
[null,"2016-07-08",{"$f":"IF(ISBLANK(tblEvents[[#This Row],[日期]]),\"\",UPPER(TEXT(tblEvents[[#This Row],[日期]],\"aaa\")))","v":"五"},{"$f":"IF(ISBLANK(tblEvents[[#This Row],[日期]]),\"\",LOOKUP(_xlfn.NUMBERVALUE(TEXT(tblEvents[[#This Row],[日期]],\"m\")),tblMonths[编号],tblMonths[月]))","v":"七月"},"市议会"]
[null,"2016-07-11",{"$f":"IF(ISBLANK(tblEvents[[#This Row],[日期]]),\"\",UPPER(TEXT(tblEvents[[#This Row],[日期]],\"aaa\")))","v":"一"},{"$f":"IF(ISBLANK(tblEvents[[#This Row],[日期]]),\"\",LOOKUP(_xlfn.NUMBERVALUE(TEXT(tblEvents[[#This Row],[日期]],\"m\")),tblMonths[编号],tblMonths[月]))","v":"七月"},"社区午宴"]
[null,"2016-07-12",{"$f":"IF(ISBLANK(tblEvents[[#This Row],[日期]]),\"\",UPPER(TEXT(tblEvents[[#This Row],[日期]],\"aaa\")))","v":"二"},{"$f":"IF(ISBLANK(tblEvents[[#This Row],[日期]]),\"\",LOOKUP(_xlfn.NUMBERVALUE(TEXT(tblEvents[[#This Row],[日期]],\"m\")),tblMonths[编号],tblMonths[月]))","v":"七月"},"古董展"]
[null,"2016-07-14",{"$f":"IF(ISBLANK(tblEvents[[#This Row],[日期]]),\"\",UPPER(TEXT(tblEvents[[#This Row],[日期]],\"aaa\")))","v":"四"},{"$f":"IF(ISBLANK(tblEvents[[#This Row],[日期]]),\"\",LOOKUP(_xlfn.NUMBERVALUE(TEXT(tblEvents[[#This Row],[日期]],\"m\")),tblMonths[编号],tblMonths[月]))","v":"七月"},"社区研讨会"]
[null,"2016-07-15",{"$f":"IF(ISBLANK(tblEvents[[#This Row],[日期]]),\"\",UPPER(TEXT(tblEvents[[#This Row],[日期]],\"aaa\")))","v":"五"},{"$f":"IF(ISBLANK(tblEvents[[#This Row],[日期]]),\"\",LOOKUP(_xlfn.NUMBERVALUE(TEXT(tblEvents[[#This Row],[日期]],\"m\")),tblMonths[编号],tblMonths[月]))","v":"七月"},"市议会"]
[null,"2016-07-19",{"$f":"IF(ISBLANK(tblEvents[[#This Row],[日期]]),\"\",UPPER(TEXT(tblEvents[[#This Row],[日期]],\"aaa\")))","v":"二"},{"$f":"IF(ISBLANK(tblEvents[[#This Row],[日期]]),\"\",LOOKUP(_xlfn.NUMBERVALUE(TEXT(tblEvents[[#This Row],[日期]],\"m\")),tblMonths[编号],tblMonths[月]))","v":"七月"},"战略规划研讨会"]
[null,"2016-07-20",{"$f":"IF(ISBLANK(tblEvents[[#This Row],[日期]]),\"\",UPPER(TEXT(tblEvents[[#This Row],[日期]],\"aaa\")))","v":"三"},{"$f":"IF(ISBLANK(tblEvents[[#This Row],[日期]]),\"\",LOOKUP(_xlfn.NUMBERVALUE(TEXT(tblEvents[[#This Row],[日期]],\"m\")),tblMonths[编号],tblMonths[月]))","v":"七月"},"公园大扫除"]
[null,"2016-07-22",{"$f":"IF(ISBLANK(tblEvents[[#This Row],[日期]]),\"\",UPPER(TEXT(tblEvents[[#This Row],[日期]],\"aaa\")))","v":"五"},{"$f":"IF(ISBLANK(tblEvents[[#This Row],[日期]]),\"\",LOOKUP(_xlfn.NUMBERVALUE(TEXT(tblEvents[[#This Row],[日期]],\"m\")),tblMonths[编号],tblMonths[月]))","v":"七月"},"市议会"]
{"$rows_left_out":19}
{"sheet":"日历","index":1,"n_rows":35,"n_cols":21,"rows_kept":35,"merged":[[1,5,1,11],[30,8,34,20]]}
[]
[null,null,{"v":2016,"d":"2016年"},null,null,{"$f":"LOOKUP(MonthNum,tblMonths[编号],tblMonths[月])","v":"七月"}]
[null,null,7,null,null,{"$f":"DATE(ViewYear,MonthNum,1)","v":"2016-07-01"},null,null,{"$f":"WEEKDAY(StartDate)","v":6}]
[null,null,"周日",null,null,"周一",null,null,"周二",null,null,"周三",null,null,"周四",null,null,"周五",null,null,"周六"]
[]
[null,null,{"$f":"StartDate-(WEEKDAY(StartDate)-1)+{0;1;2;3;4;5}*7 +{1,2,3,4,5,6,7}-3+COLUMN(B1)","v":"2016-06-26"},null,null,{"$f":"StartDate-(WEEKDAY(StartDate)-1)+{0;1;2;3;4;5}*7 +{1,2,3,4,5,6,7}-3+COLUMN(C1)","v":"2016-06-27"},null,null,{"$f":"StartDate-(WEEKDAY(StartDate)-1)+{0;1;2;3;4;5}*7 +{1,2,3,4,5,6,7}-3+COLUMN(D1)","v":"2016-06-28"},null,null,{"$f":"StartDate-(WEEKDAY(StartDate)-1)+{0;1;2;3;4;5}*7 +{1,2,3,4,5,6,7}-3+COLUMN(E1)","v":"2016-06-29"},null,null,{"$f":"StartDate-(WEEKDAY(StartDate)-1)+{0;1;2;3;4;5}*7 +{1,2,3,4,5,6,7}-3+COLUMN(F1)","v":"2016-06-30"},null,null,{"$f":"StartDate-(WEEKDAY(StartDate)-1)+{0;1;2;3;4;5}*7 +{1,2,3,4,5,6,7}-3+COLUMN(G1)","v":"2016-07-01"},null,null,{"$f":"StartDate-(WEEKDAY(StartDate)-1)+{0;1;2;3;4;5}*7 +{1,2,3,4,5,6,7}-3+COLUMN(H1)","v":"2016-07-02"}]
[null,null,{"$f":"IFERROR(INDEX(tblEvents[],SMALL(IF(Dates=C$6,ROW(Dates)),ROW(1:1))-TableRowStart,4),\"\")","v":""},null,null,{"$f":"IFERROR(INDEX(tblEvents[],SMALL(IF(Dates=F$6,ROW(Dates)),ROW(1:1))-TableRowStart,4),\"\")","v":""},null,null,{"$f":"IFERROR(INDEX(tblEvents[],SMALL(IF(Dates=I$6,ROW(Dates)),ROW(1:1))-TableRowStart,4),\"\")","v":""},null,null,{"$f":"IFERROR(INDEX(tblEvents[],SMALL(IF(Dates=L$6,ROW(Dates)),ROW(1:1))-TableRowStart,4),\"\")","v":""},null,null,{"$f":"IFERROR(INDEX(tblEvents[],SMALL(IF(Dates=O$6,ROW(Dates)),ROW(1:1))-TableRowStart,4),\"\")","v":""},null,null,{"$f":"IFERROR(INDEX(tblEvents[],SMALL(IF(Dates=R$6,ROW(Dates)),ROW(1:1))-TableRowStart,4),\"\")","v":"社区花园"},null,null,{"$f":"IFERROR(INDEX(tblEvents[],SMALL(IF(Dates=U$6,ROW(Dates)),ROW(1:1))-TableRowStart,4),\"\")","v":"社区花园"}]
[null,null,{"$f":"IFERROR(INDEX(tblEvents[],SMALL(IF(Dates=C$6,ROW(Dates)),ROW(2:2))-TableRowStart,4),\"\")","v":""},null,null,{"$f":"IFERROR(INDEX(tblEvents[],SMALL(IF(Dates=F$6,ROW(Dates)),ROW(2:2))-TableRowStart,4),\"\")","v":""},null,null,{"$f":"IFERROR(INDEX(tblEvents[],SMALL(IF(Dates=I$6,ROW(Dates)),ROW(2:2))-TableRowStart,4),\"\")","v":""},null,null,{"$f":"IFERROR(INDEX(tblEvents[],SMALL(IF(Dates=L$6,ROW(Dates)),ROW(2:2))-TableRowStart,4),\"\")","v":""},null,null,{"$f":"IFERROR(INDEX(tblEvents[],SMALL(IF(Dates=O$6,ROW(Dates)),ROW(2:2))-TableRowStart,4),\"\")","v":""},null,null,{"$f":"IFERROR(INDEX(tblEvents[],SMALL(IF(Dates=R$6,ROW(Dates)),ROW(2:2))-TableRowStart,4),\"\")","v":"市议会"},null,null,{"$f":"IFERROR(INDEX(tblEvents[],SMALL(IF(Dates=U$6,ROW(Dates)),ROW(2:2))-TableRowStart,4),\"\")","v":""}]
[null,null,{"$f":"IFERROR(INDEX(tblEvents[],SMALL(IF(Dates=C$6,ROW(Dates)),ROW(3:3))-TableRowStart,4),\"\")","v":""},null,null,{"$f":"IFERROR(INDEX(tblEvents[],SMALL(IF(Dates=F$6,ROW(Dates)),ROW(3:3))-TableRowStart,4),\"\")","v":""},null,null,{"$f":"IFERROR(INDEX(tblEvents[],SMALL(IF(Dates=I$6,ROW(Dates)),ROW(3:3))-TableRowStart,4),\"\")","v":""},null,null,{"$f":"IFERROR(INDEX(tblEvents[],SMALL(IF(Dates=L$6,ROW(Dates)),ROW(3:3))-TableRowStart,4),\"\")","v":""},null,null,{"$f":"IFERROR(INDEX(tblEvents[],SMALL(IF(Dates=O$6,ROW(Dates)),ROW(3:3))-TableRowStart,4),\"\")","v":""},null,null,{"$f":"IFERROR(INDEX(tblEvents[],SMALL(IF(Dates=R$6,ROW(Dates)),ROW(3:3))-TableRowStart,4),\"\")","v":""},null,null,{"$f":"IFERROR(INDEX(tblEvents[],SMALL(IF(Dates=U$6,ROW(Dates)),ROW(3:3))-TableRowStart,4),\"\")","v":""}]
[null,null,{"$f":"IFERROR(INDEX(tblEvents[],SMALL(IF(Dates=C$6,ROW(Dates)),ROW(#REF!))-TableRowStart,4),\"\")","v":""},null,null,{"$f":"IFERROR(INDEX(tblEvents[],SMALL(IF(Dates=F$6,ROW(Dates)),ROW(#REF!))-TableRowStart,4),\"\")","v":""},null,null,{"$f":"IFERROR(INDEX(tblEvents[],SMALL(IF(Dates=I$6,ROW(Dates)),ROW(#REF!))-TableRowStart,4),\"\")","v":""},null,null,{"$f":"IFERROR(INDEX(tblEvents[],SMALL(IF(Dates=L$6,ROW(Dates)),ROW(#REF!))-TableRowStart,4),\"\")","v":""},null,null,{"$f":"IFERROR(INDEX(tblEvents[],SMALL(IF(Dates=O$6,ROW(Dates)),ROW(#REF!))-TableRowStart,4),\"\")","v":""},null,null,{"$f":"IFERROR(INDEX(tblEvents[],SMALL(IF(Dates=R$6,ROW(Dates)),ROW(#REF!))-TableRowStart,4),\"\")","v":""},null,null,{"$f":"IFERROR(INDEX(tblEvents[],SMALL(IF(Dates=U$6,ROW(Dates)),ROW(#REF!))-TableRowStart,4),\"\")","v":""}]
[null,null,{"$f":"U6+1","v":"2016-07-03"},null,null,{"$f":"C11+1","v":"2016-07-04"},null,null,{"$f":"F11+1","v":"2016-07-05"},null,null,{"$f":"I11+1","v":"2016-07-06"},null,null,{"$f":"L11+1","v":"2016-07-07"},null,null,{"$f":"O11+1","v":"2016-07-08"},null,null,{"$f":"R11+1","v":"2016-07-09"}]
[null,null,{"$f":"IFERROR(INDEX(tblEvents[],SMALL(IF(Dates=C$11,ROW(Dates)),ROW(1:1))-TableRowStart,4),\"\")","v":"公园电影之夜"},null,null,{"$f":"IFERROR(INDEX(tblEvents[],SMALL(IF(Dates=F$11,ROW(Dates)),ROW(1:1))-TableRowStart,4),\"\")","v":""},null,null,{"$f":"IFERROR(INDEX(tblEvents[],SMALL(IF(Dates=I$11,ROW(Dates)),ROW(1:1))-TableRowStart,4),\"\")","v":""},null,null,{"$f":"IFERROR(INDEX(tblEvents[],SMALL(IF(Dates=L$11,ROW(Dates)),ROW(1:1))-TableRowStart,4),\"\")","v":""},null,null,{"$f":"IFERROR(INDEX(tblEvents[],SMALL(IF(Dates=O$11,ROW(Dates)),ROW(1:1))-TableRowStart,4),\"\")","v":""},null,null,{"$f":"IFERROR(INDEX(tblEvents[],SMALL(IF(Dates=R$11,ROW(Dates)),ROW(1:1))-TableRowStart,4),\"\")","v":"市议会"},null,null,{"$f":"IFERROR(INDEX(tblEvents[],SMALL(IF(Dates=U$11,ROW(Dates)),ROW(1:1))-TableRowStart,4),\"\")","v":""}]
[null,null,{"$f":"IFERROR(INDEX(tblEvents[],SMALL(IF(Dates=C$11,ROW(Dates)),ROW(2:2))-TableRowStart,4),\"\")","v":""},null,null,{"$f":"IFERROR(INDEX(tblEvents[],SMALL(IF(Dates=F$11,ROW(Dates)),ROW(2:2))-TableRowStart,4),\"\")","v":""},null,null,{"$f":"IFERROR(INDEX(tblEvents[],SMALL(IF(Dates=I$11,ROW(Dates)),ROW(2:2))-TableRowStart,4),\"\")","v":""},null,null,{"$f":"IFERROR(INDEX(tblEvents[],SMALL(IF(Dates=L$11,ROW(Dates)),ROW(2:2))-TableRowStart,4),\"\")","v":""},null,null,{"$f":"IFERROR(INDEX(tblEvents[],SMALL(IF(Dates=O$11,ROW(Dates)),ROW(2:2))-TableRowStart,4),\"\")","v":""},null,null,{"$f":"IFERROR(INDEX(tblEvents[],SMALL(IF(Dates=R$11,ROW(Dates)),ROW(2:2))-TableRowStart,4),\"\")","v":""},null,null,{"$f":"IFERROR(INDEX(tblEvents[],SMALL(IF(Dates=U$11,ROW(Dates)),ROW(2:2))-TableRowStart,4),\"\")","v":""}]
[null,null,{"$f":"IFERROR(INDEX(tblEvents[],SMALL(IF(Dates=C$11,ROW(Dates)),ROW(3:3))-TableRowStart,4),\"\")","v":""},null,null,{"$f":"IFERROR(INDEX(tblEvents[],SMALL(IF(Dates=F$11,ROW(Dates)),ROW(3:3))-TableRowStart,4),\"\")","v":""},null,null,{"$f":"IFERROR(INDEX(tblEvents[],SMALL(IF(Dates=I$11,ROW(Dates)),ROW(3:3))-TableRowStart,4),\"\")","v":""},null,null,{"$f":"IFERROR(INDEX(tblEvents[],SMALL(IF(Dates=L$11,ROW(Dates)),ROW(3:3))-TableRowStart,4),\"\")","v":""},null,null,{"$f":"IFERROR(INDEX(tblEvents[],SMALL(IF(Dates=O$11,ROW(Dates)),ROW(3:3))-TableRowStart,4),\"\")","v":""},null,null,{"$f":"IFERROR(INDEX(tblEvents[],SMALL(IF(Dates=R$11,ROW(Dates)),ROW(3:3))-TableRowStart,4),\"\")","v":""},null,null,{"$f":"IFERROR(INDEX(tblEvents[],SMALL(IF(Dates=U$11,ROW(Dates)),ROW(3:3))-TableRowStart,4),\"\")","v":""}]
[null,null,{"$f":"IFERROR(INDEX(tblEvents[],SMALL(IF(Dates=C$11,ROW(Dates)),ROW(#REF!))-TableRowStart,4),\"\")","v":""},null,null,{"$f":"IFERROR(INDEX(tblEvents[],SMALL(IF(Dates=F$11,ROW(Dates)),ROW(#REF!))-TableRowStart,4),\"\")","v":""},null,null,{"$f":"IFERROR(INDEX(tblEvents[],SMALL(IF(Dates=I$11,ROW(Dates)),ROW(#REF!))-TableRowStart,4),\"\")","v":""},null,null,{"$f":"IFERROR(INDEX(tblEvents[],SMALL(IF(Dates=L$11,ROW(Dates)),ROW(#REF!))-TableRowStart,4),\"\")","v":""},null,null,{"$f":"IFERROR(INDEX(tblEvents[],SMALL(IF(Dates=O$11,ROW(Dates)),ROW(#REF!))-TableRowStart,4),\"\")","v":""},null,null,{"$f":"IFERROR(INDEX(tblEvents[],SMALL(IF(Dates=R$11,ROW(Dates)),ROW(#REF!))-TableRowStart,4),\"\")","v":""},null,null,{"$f":"IFERROR(INDEX(tblEvents[],SMALL(IF(Dates=U$11,ROW(Dates)),ROW(#REF!))-TableRowStart,4),\"\")","v":""}]
[null,null,{"$f":"U11+1","v":"2016-07-10"},null,null,{"$f":"C16+1","v":"2016-07-11"},null,null,{"$f":"F16+1","v":"2016-07-12"},null,null,{"$f":"I16+1","v":"2016-07-13"},null,null,{"$f":"L16+1","v":"2016-07-14"},null,null,{"$f":"O16+1","v":"2016-07-15"},null,null,{"$f":"R16+1","v":"2016-07-16"}]
[null,null,{"$f":"IFERROR(INDEX(tblEvents[],SMALL(IF(Dates=C$16,ROW(Dates)),ROW(1:1))-TableRowStart,4),\"\")","v":""},null,null,{"$f":"IFERROR(INDEX(tblEvents[],SMALL(IF(Dates=F$16,ROW(Dates)),ROW(1:1))-TableRowStart,4),\"\")","v":"社区午宴"},null,null,{"$f":"IFERROR(INDEX(tblEvents[],SMALL(IF(Dates=I$16,ROW(Dates)),ROW(1:1))-TableRowStart,4),\"\")","v":"古董展"},null,null,{"$f":"IFERROR(INDEX(tblEvents[],SMALL(IF(Dates=L$16,ROW(Dates)),ROW(1:1))-TableRowStart,4),\"\")","v":""},null,null,{"$f":"IFERROR(INDEX(tblEvents[],SMALL(IF(Dates=O$16,ROW(Dates)),ROW(1:1))-TableRowStart,4),\"\")","v":"社区研讨会"},null,null,{"$f":"IFERROR(INDEX(tblEvents[],SMALL(IF(Dates=R$16,ROW(Dates)),ROW(1:1))-TableRowStart,4),\"\")","v":"市议会"},null,null,{"$f":"IFERROR(INDEX(tblEvents[],SMALL(IF(Dates=U$16,ROW(Dates)),ROW(1:1))-TableRowStart,4),\"\")","v":""}]
[null,null,{"$f":"IFERROR(INDEX(tblEvents[],SMALL(IF(Dates=C$16,ROW(Dates)),ROW(2:2))-TableRowStart,4),\"\")","v":""},null,null,{"$f":"IFERROR(INDEX(tblEvents[],SMALL(IF(Dates=F$16,ROW(Dates)),ROW(2:2))-TableRowStart,4),\"\")","v":""},null,null,{"$f":"IFERROR(INDEX(tblEvents[],SMALL(IF(Dates=I$16,ROW(Dates)),ROW(2:2))-TableRowStart,4),\"\")","v":""},null,null,{"$f":"IFERROR(INDEX(tblEvents[],SMALL(IF(Dates=L$16,ROW(Dates)),ROW(2:2))-TableRowStart,4),\"\")","v":""},null,null,{"$f":"IFERROR(INDEX(tblEvents[],SMALL(IF(Dates=O$16,ROW(Dates)),ROW(2:2))-TableRowStart,4),\"\")","v":""},null,null,{"$f":"IFERROR(INDEX(tblEvents[],SMALL(IF(Dates=R$16,ROW(Dates)),ROW(2:2))-TableRowStart,4),\"\")","v":""},null,null,{"$f":"IFERROR(INDEX(tblEvents[],SMALL(IF(Dates=U$16,ROW(Dates)),ROW(2:2))-TableRowStart,4),\"\")","v":""}]
[null,null,{"$f":"IFERROR(INDEX(tblEvents[],SMALL(IF(Dates=C$16,ROW(Dates)),ROW(3:3))-TableRowStart,4),\"\")","v":""},null,null,{"$f":"IFERROR(INDEX(tblEvents[],SMALL(IF(Dates=F$16,ROW(Dates)),ROW(3:3))-TableRowStart,4),\"\")","v":""},null,null,{"$f":"IFERROR(INDEX(tblEvents[],SMALL(IF(Dates=I$16,ROW(Dates)),ROW(3:3))-TableRowStart,4),\"\")","v":""},null,null,{"$f":"IFERROR(INDEX(tblEvents[],SMALL(IF(Dates=L$16,ROW(Dates)),ROW(3:3))-TableRowStart,4),\"\")","v":""},null,null,{"$f":"IFERROR(INDEX(tblEvents[],SMALL(IF(Dates=O$16,ROW(Dates)),ROW(3:3))-TableRowStart,4),\"\")","v":""},null,null,{"$f":"IFERROR(INDEX(tblEvents[],SMALL(IF(Dates=R$16,ROW(Dates)),ROW(3:3))-TableRowStart,4),\"\")","v":""},null,null,{"$f":"IFERROR(INDEX(tblEvents[],SMALL(IF(Dates=U$16,ROW(Dates)),ROW(3:3))-TableRowStart,4),\"\")","v":""}]
[null,null,{"$f":"IFERROR(INDEX(tblEvents[],SMALL(IF(Dates=C$16,ROW(Dates)),ROW(#REF!))-TableRowStart,4),\"\")","v":""},null,null,{"$f":"IFERROR(INDEX(tblEvents[],SMALL(IF(Dates=F$16,ROW(Dates)),ROW(#REF!))-TableRowStart,4),\"\")","v":""},null,null,{"$f":"IFERROR(INDEX(tblEvents[],SMALL(IF(Dates=I$16,ROW(Dates)),ROW(#REF!))-TableRowStart,4),\"\")","v":""},null,null,{"$f":"IFERROR(INDEX(tblEvents[],SMALL(IF(Dates=L$16,ROW(Dates)),ROW(#REF!))-TableRowStart,4),\"\")","v":""},null,null,{"$f":"IFERROR(INDEX(tblEvents[],SMALL(IF(Dates=O$16,ROW(Dates)),ROW(#REF!))-TableRowStart,4),\"\")","v":""},null,null,{"$f":"IFERROR(INDEX(tblEvents[],SMALL(IF(Dates=R$16,ROW(Dates)),ROW(#REF!))-TableRowStart,4),\"\")","v":""},null,null,{"$f":"IFERROR(INDEX(tblEvents[],SMALL(IF(Dates=U$16,ROW(Dates)),ROW(#REF!))-TableRowStart,4),\"\")","v":""}]
{"$rows_left_out":16}
{"sheet":"打印版本","index":2,"n_rows":35,"n_cols":21,"rows_kept":35,"merged":[[1,5,1,11],[30,8,34,20]]}
[]
[null,null,{"$f":"ViewYear","v":{"v":2016,"d":"2016年"}},null,null,{"$f":"ViewMonth","v":"七月"},{"$f":"日历!G2","v":0},{"$f":"日历!H2","v":0},{"$f":"日历!I2","v":0},{"$f":"日历!J2","v":0},{"$f":"日历!K2","v":0},{"$f":"日历!L2","v":0}]
[]
[null,null,"周日",null,null,"周一",null,null,"周二",null,null,"周三",null,null,"周四",null,null,"周五",null,null,"周六"]
[]
[null,null,{"$f":"日历!C6","v":"2016-06-26"},{"$f":"日历!D6","v":0},{"$f":"日历!E6","v":0},{"$f":"日历!F6","v":"2016-06-27"},{"$f":"日历!G6","v":0},{"$f":"日历!H6","v":0},{"$f":"日历!I6","v":"2016-06-28"},{"$f":"日历!J6","v":0},{"$f":"日历!K6","v":0},{"$f":"日历!L6","v":"2016-06-29"},{"$f":"日历!M6","v":0},{"$f":"日历!N6","v":0},{"$f":"日历!O6","v":"2016-06-30"},{"$f":"日历!P6","v":0},{"$f":"日历!Q6","v":0},{"$f":"日历!R6","v":"2016-07-01"},{"$f":"日历!S6","v":0},{"$f":"日历!T6","v":0},{"$f":"日历!U6","v":"2016-07-02"}]
[null,null,{"$f":"日历!C7","v":""},{"$f":"日历!D7","v":0},{"$f":"日历!E7","v":0},{"$f":"日历!F7","v":""},{"$f":"日历!G7","v":0},{"$f":"日历!H7","v":0},{"$f":"日历!I7","v":""},{"$f":"日历!J7","v":0},{"$f":"日历!K7","v":0},{"$f":"日历!L7","v":""},{"$f":"日历!M7","v":0},{"$f":"日历!N7","v":0},{"$f":"日历!O7","v":""},{"$f":"日历!P7","v":0},{"$f":"日历!Q7","v":0},{"$f":"日历!R7","v":"社区花园"},{"$f":"日历!S7","v":0},{"$f":"日历!T7","v":0},{"$f":"日历!U7","v":"社区花园"}]
[null,null,{"$f":"日历!C8","v":""},{"$f":"日历!D8","v":"00:00:00"},{"$f":"日历!E8","v":"00:00:00"},{"$f":"日历!F8","v":""},{"$f":"日历!G8","v":"00:00:00"},{"$f":"日历!H8","v":"00:00:00"},{"$f":"日历!I8","v":""},{"$f":"日历!J8","v":"00:00:00"},{"$f":"日历!K8","v":"00:00:00"},{"$f":"日历!L8","v":""},{"$f":"日历!M8","v":"00:00:00"},{"$f":"日历!N8","v":"00:00:00"},{"$f":"日历!O8","v":""},{"$f":"日历!P8","v":"00:00:00"},{"$f":"日历!Q8","v":"00:00:00"},{"$f":"日历!R8","v":"市议会"},{"$f":"日历!S8","v":"00:00:00"},{"$f":"日历!T8","v":"00:00:00"},{"$f":"日历!U8","v":""}]
[null,null,{"$f":"日历!C9","v":""},{"$f":"日历!D9","v":0},{"$f":"日历!E9","v":0},{"$f":"日历!F9","v":""},{"$f":"日历!G9","v":0},{"$f":"日历!H9","v":0},{"$f":"日历!I9","v":""},{"$f":"日历!J9","v":0},{"$f":"日历!K9","v":0},{"$f":"日历!L9","v":""},{"$f":"日历!M9","v":0},{"$f":"日历!N9","v":0},{"$f":"日历!O9","v":""},{"$f":"日历!P9","v":0},{"$f":"日历!Q9","v":0},{"$f":"日历!R9","v":""},{"$f":"日历!S9","v":0},{"$f":"日历!T9","v":0},{"$f":"日历!U9","v":""}]
[null,null,{"$f":"日历!C10","v":""},{"$f":"日历!D10","v":0},{"$f":"日历!E10","v":0},{"$f":"日历!F10","v":""},{"$f":"日历!G10","v":0},{"$f":"日历!H10","v":0},{"$f":"日历!I10","v":""},{"$f":"日历!J10","v":0},{"$f":"日历!K10","v":0},{"$f":"日历!L10","v":""},{"$f":"日历!M10","v":0},{"$f":"日历!N10","v":0},{"$f":"日历!O10","v":""},{"$f":"日历!P10","v":0},{"$f":"日历!Q10","v":0},{"$f":"日历!R10","v":""},{"$f":"日历!S10","v":0},{"$f":"日历!T10","v":0},{"$f":"日历!U10","v":""}]
[null,null,{"$f":"日历!C11","v":"2016-07-03"},{"$f":"日历!D11","v":0},{"$f":"日历!E11","v":0},{"$f":"日历!F11","v":"2016-07-04"},{"$f":"日历!G11","v":0},{"$f":"日历!H11","v":0},{"$f":"日历!I11","v":"2016-07-05"},{"$f":"日历!J11","v":0},{"$f":"日历!K11","v":0},{"$f":"日历!L11","v":"2016-07-06"},{"$f":"日历!M11","v":0},{"$f":"日历!N11","v":0},{"$f":"日历!O11","v":"2016-07-07"},{"$f":"日历!P11","v":0},{"$f":"日历!Q11","v":0},{"$f":"日历!R11","v":"2016-07-08"},{"$f":"日历!S11","v":0},{"$f":"日历!T11","v":0},{"$f":"日历!U11","v":"2016-07-09"}]
[null,null,{"$f":"日历!C12","v":"公园电影之夜"},{"$f":"日历!D12","v":0},{"$f":"日历!E12","v":0},{"$f":"日历!F12","v":""},{"$f":"日历!G12","v":0},{"$f":"日历!H12","v":0},{"$f":"日历!I12","v":""},{"$f":"日历!J12","v":0},{"$f":"日历!K12","v":0},{"$f":"日历!L12","v":""},{"$f":"日历!M12","v":0},{"$f":"日历!N12","v":0},{"$f":"日历!O12","v":""},{"$f":"日历!P12","v":0},{"$f":"日历!Q12","v":0},{"$f":"日历!R12","v":"市议会"},{"$f":"日历!S12","v":0},{"$f":"日历!T12","v":0},{"$f":"日历!U12","v":""}]
[null,null,{"$f":"日历!C13","v":""},{"$f":"日历!D13","v":0},{"$f":"日历!E13","v":0},{"$f":"日历!F13","v":""},{"$f":"日历!G13","v":0},{"$f":"日历!H13","v":0},{"$f":"日历!I13","v":""},{"$f":"日历!J13","v":0},{"$f":"日历!K13","v":0},{"$f":"日历!L13","v":""},{"$f":"日历!M13","v":0},{"$f":"日历!N13","v":0},{"$f":"日历!O13","v":""},{"$f":"日历!P13","v":0},{"$f":"日历!Q13","v":0},{"$f":"日历!R13","v":""},{"$f":"日历!S13","v":0},{"$f":"日历!T13","v":0},{"$f":"日历!U13","v":""}]
[null,null,{"$f":"日历!C14","v":""},{"$f":"日历!D14","v":0},{"$f":"日历!E14","v":0},{"$f":"日历!F14","v":""},{"$f":"日历!G14","v":0},{"$f":"日历!H14","v":0},{"$f":"日历!I14","v":""},{"$f":"日历!J14","v":0},{"$f":"日历!K14","v":0},{"$f":"日历!L14","v":""},{"$f":"日历!M14","v":0},{"$f":"日历!N14","v":0},{"$f":"日历!O14","v":""},{"$f":"日历!P14","v":0},{"$f":"日历!Q14","v":0},{"$f":"日历!R14","v":""},{"$f":"日历!S14","v":0},{"$f":"日历!T14","v":0},{"$f":"日历!U14","v":""}]
[null,null,{"$f":"日历!C15","v":""},{"$f":"日历!D15","v":0},{"$f":"日历!E15","v":0},{"$f":"日历!F15","v":""},{"$f":"日历!G15","v":0},{"$f":"日历!H15","v":0},{"$f":"日历!I15","v":""},{"$f":"日历!J15","v":0},{"$f":"日历!K15","v":0},{"$f":"日历!L15","v":""},{"$f":"日历!M15","v":0},{"$f":"日历!N15","v":0},{"$f":"日历!O15","v":""},{"$f":"日历!P15","v":0},{"$f":"日历!Q15","v":0},{"$f":"日历!R15","v":""},{"$f":"日历!S15","v":0},{"$f":"日历!T15","v":0},{"$f":"日历!U15","v":""}]
[null,null,{"$f":"日历!C16","v":"2016-07-10"},{"$f":"日历!D16","v":0},{"$f":"日历!E16","v":0},{"$f":"日历!F16","v":"2016-07-11"},{"$f":"日历!G16","v":0},{"$f":"日历!H16","v":0},{"$f":"日历!I16","v":"2016-07-12"},{"$f":"日历!J16","v":0},{"$f":"日历!K16","v":0},{"$f":"日历!L16","v":"2016-07-13"},{"$f":"日历!M16","v":0},{"$f":"日历!N16","v":0},{"$f":"日历!O16","v":"2016-07-14"},{"$f":"日历!P16","v":0},{"$f":"日历!Q16","v":0},{"$f":"日历!R16","v":"2016-07-15"},{"$f":"日历!S16","v":0},{"$f":"日历!T16","v":0},{"$f":"日历!U16","v":"2016-07-16"}]
[null,null,{"$f":"日历!C17","v":""},{"$f":"日历!D17","v":0},{"$f":"日历!E17","v":0},{"$f":"日历!F17","v":"社区午宴"},{"$f":"日历!G17","v":0},{"$f":"日历!H17","v":0},{"$f":"日历!I17","v":"古董展"},{"$f":"日历!J17","v":0},{"$f":"日历!K17","v":0},{"$f":"日历!L17","v":""},{"$f":"日历!M17","v":0},{"$f":"日历!N17","v":0},{"$f":"日历!O17","v":"社区研讨会"},{"$f":"日历!P17","v":0},{"$f":"日历!Q17","v":0},{"$f":"日历!R17","v":"市议会"},{"$f":"日历!S17","v":0},{"$f":"日历!T17","v":0},{"$f":"日历!U17","v":""}]
[null,null,{"$f":"日历!C18","v":""},{"$f":"日历!D18","v":0},{"$f":"日历!E18","v":0},{"$f":"日历!F18","v":""},{"$f":"日历!G18","v":0},{"$f":"日历!H18","v":0},{"$f":"日历!I18","v":""},{"$f":"日历!J18","v":0},{"$f":"日历!K18","v":0},{"$f":"日历!L18","v":""},{"$f":"日历!M18","v":0},{"$f":"日历!N18","v":0},{"$f":"日历!O18","v":""},{"$f":"日历!P18","v":0},{"$f":"日历!Q18","v":0},{"$f":"日历!R18","v":""},{"$f":"日历!S18","v":0},{"$f":"日历!T18","v":0},{"$f":"日历!U18","v":""}]
[null,null,{"$f":"日历!C19","v":""},{"$f":"日历!D19","v":0},{"$f":"日历!E19","v":0},{"$f":"日历!F19","v":""},{"$f":"日历!G19","v":0},{"$f":"日历!H19","v":0},{"$f":"日历!I19","v":""},{"$f":"日历!J19","v":0},{"$f":"日历!K19","v":0},{"$f":"日历!L19","v":""},{"$f":"日历!M19","v":0},{"$f":"日历!N19","v":0},{"$f":"日历!O19","v":""},{"$f":"日历!P19","v":0},{"$f":"日历!Q19","v":0},{"$f":"日历!R19","v":""},{"$f":"日历!S19","v":0},{"$f":"日历!T19","v":0},{"$f":"日历!U19","v":""}]
[null,null,{"$f":"日历!C20","v":""},{"$f":"日历!D20","v":0},{"$f":"日历!E20","v":0},{"$f":"日历!F20","v":""},{"$f":"日历!G20","v":0},{"$f":"日历!H20","v":0},{"$f":"日历!I20","v":""},{"$f":"日历!J20","v":0},{"$f":"日历!K20","v":0},{"$f":"日历!L20","v":""},{"$f":"日历!M20","v":0},{"$f":"日历!N20","v":0},{"$f":"日历!O20","v":""},{"$f":"日历!P20","v":0},{"$f":"日历!Q20","v":0},{"$f":"日历!R20","v":""},{"$f":"日历!S20","v":0},{"$f":"日历!T20","v":0},{"$f":"日历!U20","v":""}]
{"$rows_left_out":16}
{"sheet":"管理员","index":3,"n_rows":14,"n_cols":3,"rows_kept":14,"hidden":true}
[]
[null,"月","编号"]
[null,"一月",1]
[null,"二月",2]
[null,"三月",3]
[null,"四月",4]
[null,"五月",5]
[null,"六月",6]
[null,"七月",7]
[null,"八月",8]
[null,"九月",9]
[null,"十月",10]
[null,"十一月",11]
[null,"十二月",12]