{"text_format":"3","workbook":"xlsx","n_sheets":2,"sheets":["员工考勤表","工作日_查找"],"not_rendered":{"defined_names":27},"read":"whole","date_system":"1900"}

{"sheet":"员工考勤表","index":0,"n_rows":36,"n_cols":26,"rows_kept":36,"merged":[[0,1,2,4],[0,5,2,9],[0,10,2,14],[0,15,3,23],[0,24,3,24],[3,1,3,3],[3,5,3,9],[3,10,3,14],[4,1,6,3],[4,4,6,6],[5,14,7,14],[5,22,7,22],[5,23,7,23],[5,24,7,24],[21,1,21,6],[22,1,23,3],[22,4,23,6],[23,14,24,14],[23,22,24,22],[23,23,24,23],[23,24,24,24],[32,1,32,6],[32,24,33,24],[32,25,33,25],[33,1,33,6],[34,1,34,6],[35,1,35,3],[35,4,35,5],[35,6,35,7],[35,8,35,14],[35,15,35,16],[35,17,35,23]]}
[null,"操作员考勤表",{"$nulls":3},"员工姓名",{"$nulls":9},"若需要加班授权，\n则在右侧单元格中选择“是”"]
[]
[]
[null,"工资单结束日期",null,null,{"$f":"V7","v":"2025-06-14"},"员工编号"]
[null,"正常工时：",null,null,"日期："]
[{"$nulls":14},"总计\n第 1 周\n正常",{"$nulls":7},"总计\n第 2 周\n正常","总计\n正常\n小时数","工资单\n仅使用\n工资代码"]
[{"$nulls":7},"2025-06-01",{"$f":"第一_天+1","v":"2025-06-02"},{"$f":"第一_天+2","v":"2025-06-03"},{"$f":"第一_天+3","v":"2025-06-04"},{"$f":"第一_天+4","v":"2025-06-05"},{"$f":"第一_天+5","v":"2025-06-06"},{"$f":"第一_天+6","v":"2025-06-07"},null,{"$f":"第一_天+7","v":"2025-06-08"},{"$f":"第一_天+8","v":"2025-06-09"},{"$f":"第一_天+9","v":"2025-06-10"},{"$f":"第一_天+10","v":"2025-06-11"},{"$f":"第一_天+11","v":"2025-06-12"},{"$f":"第一_天+12","v":"2025-06-13"},{"$f":"第一_天+13","v":"2025-06-14"}]
[null,"任务","地点","工单编号","工作说明","职务","职务编号",{"$f":"VLOOKUP(WEEKDAY(第一_天),'工作日_查找'!$B$2:$C$8,2)","v":"周日"},{"$f":"VLOOKUP(WEEKDAY(I7),'工作日_查找'!$B$2:$C$8,2)","v":"周一"},{"$f":"VLOOKUP(WEEKDAY(J7),'工作日_查找'!$B$2:$C$8,2)","v":"周二"},{"$f":"VLOOKUP(WEEKDAY(K7),'工作日_查找'!$B$2:$C$8,2)","v":"周三"},{"$f":"VLOOKUP(WEEKDAY(L7),'工作日_查找'!$B$2:$C$8,2)","v":"周四"},{"$f":"VLOOKUP(WEEKDAY(M7),'工作日_查找'!$B$2:$C$8,2)","v":"周五"},{"$f":"VLOOKUP(WEEKDAY(N7),'工作日_查找'!$B$2:$C$8,2)","v":"周六"},null,{"$f":"VLOOKUP(WEEKDAY(P7),'工作日_查找'!$B$2:$C$8,2)","v":"周日"},{"$f":"VLOOKUP(WEEKDAY(Q7),'工作日_查找'!$B$2:$C$8,2)","v":"周一"},{"$f":"VLOOKUP(WEEKDAY(R7),'工作日_查找'!$B$2:$C$8,2)","v":"周二"},{"$f":"VLOOKUP(WEEKDAY(S7),'工作日_查找'!$B$2:$C$8,2)","v":"周三"},{"$f":"VLOOKUP(WEEKDAY(T7),'工作日_查找'!$B$2:$C$8,2)","v":"周四"},{"$f":"VLOOKUP(WEEKDAY(U7),'工作日_查找'!$B$2:$C$8,2)","v":"周五"},{"$f":"VLOOKUP(WEEKDAY(V7),'工作日_查找'!$B$2:$C$8,2)","v":"周六"}]
[{"$nulls":14},{"$f":"SUM(H9:N9)","v":{"v":0,"d":"0.00"}},{"$nulls":7},{"$f":"SUM(P9:V9)","v":{"v":0,"d":"0.00"}},{"$f":"O9+W9","v":{"v":0,"d":"0.00"}}]
[{"$nulls":14},{"v":0,"d":"0.00"},{"$nulls":7},{"v":0,"d":"0.00"},{"v":0,"d":"0.00"}]
[{"$nulls":14},{"v":0,"d":"0.00"},{"$nulls":7},{"v":0,"d":"0.00"},{"v":0,"d":"0.00"}]
[{"$nulls":14},{"v":0,"d":"0.00"},{"$nulls":7},{"v":0,"d":"0.00"},{"v":0,"d":"0.00"}]
[{"$nulls":14},{"v":0,"d":"0.00"},{"$nulls":7},{"v":0,"d":"0.00"},{"v":0,"d":"0.00"}]
[{"$nulls":14},{"v":0,"d":"0.00"},{"$nulls":7},{"v":0,"d":"0.00"},{"v":0,"d":"0.00"}]
[{"$nulls":14},{"v":0,"d":"0.00"},{"$nulls":7},{"v":0,"d":"0.00"},{"v":0,"d":"0.00"}]
[{"$nulls":14},{"$f":"SUM(H16:N16)","v":{"v":0,"d":"0.00"}},{"$nulls":7},{"$f":"SUM(P16:V16)","v":{"v":0,"d":"0.00"}},{"$f":"O16+W16","v":{"v":0,"d":"0.00"}}]
[{"$nulls":14},{"v":0,"d":"0.00"},{"$nulls":7},{"v":0,"d":"0.00"},{"v":0,"d":"0.00"}]
[{"$nulls":14},{"v":0,"d":"0.00"},{"$nulls":7},{"v":0,"d":"0.00"},{"v":0,"d":"0.00"}]
[{"$nulls":14},{"v":0,"d":"0.00"},{"$nulls":7},{"v":0,"d":"0.00"},{"v":0,"d":"0.00"}]
[{"$nulls":14},{"v":0,"d":"0.00"},{"$nulls":7},{"v":0,"d":"0.00"},{"v":0,"d":"0.00"}]
[{"$nulls":14},{"v":0,"d":"0.00"},{"$nulls":7},{"v":0,"d":"0.00"},{"v":0,"d":"0.00"}]
[null,"正常总工时   ",{"$nulls":5},{"$f":"SUM(H9:H21)","v":{"v":0,"d":"0.00"}},{"v":0,"d":"0.00"},{"v":0,"d":"0.00"},{"v":0,"d":"0.00"},{"v":0,"d":"0.00"},{"v":0,"d":"0.00"},{"v":0,"d":"0.00"},{"v":0,"d":"0.00"},{"v":0,"d":"0.00"},{"$f":"SUM(Q9:Q21)","v":{"v":0,"d":"0.00"}},{"v":0,"d":"0.00"},{"v":0,"d":"0.00"},{"v":0,"d":"0.00"},{"v":0,"d":"0.00"},{"v":0,"d":"0.00"},{"$f":"SUM(W9:W21)","v":{"v":0,"d":"0.00"}},{"$f":"SUM(X9:X21)","v":{"v":0,"d":"0.00"}}]
[null,"加班工时：",null,null,"日期："]
[{"$nulls":7},{"$f":"第一_天","v":"2025-06-01"},{"$f":"第一_天+1","v":"2025-06-02"},{"$f":"第一_天+2","v":"2025-06-03"},{"$f":"第一_天+3","v":"2025-06-04"},{"$f":"第一_天+4","v":"2025-06-05"},{"$f":"第一_天+5","v":"2025-06-06"},{"$f":"第一_天+6","v":"2025-06-07"},"第 1 周加班时间",{"$f":"第一_天+7","v":"2025-06-08"},{"$f":"第一_天+8","v":"2025-06-09"},{"$f":"第一_天+9","v":"2025-06-10"},{"$f":"第一_天+10","v":"2025-06-11"},{"$f":"第一_天+11","v":"2025-06-12"},{"$f":"第一_天+12","v":"2025-06-13"},{"$f":"第一_天+13","v":"2025-06-14"},"第 2 周加班时间","总加班时间","加班\n代码"]
[null,"任务","地点","工单编号","工作说明","职务","职务编号",{"$f":"VLOOKUP(WEEKDAY(第一_天),'工作日_查找'!$B$2:$C$8,2)","v":"周日"},{"$f":"VLOOKUP(WEEKDAY(I24),'工作日_查找'!$B$2:$C$8,2)","v":"周一"},{"$f":"VLOOKUP(WEEKDAY(J24),'工作日_查找'!$B$2:$C$8,2)","v":"周二"},{"$f":"VLOOKUP(WEEKDAY(K24),'工作日_查找'!$B$2:$C$8,2)","v":"周三"},{"$f":"VLOOKUP(WEEKDAY(L24),'工作日_查找'!$B$2:$C$8,2)","v":"周四"},{"$f":"VLOOKUP(WEEKDAY(M24),'工作日_查找'!$B$2:$C$8,2)","v":"周五"},{"$f":"VLOOKUP(WEEKDAY(N24),'工作日_查找'!$B$2:$C$8,2)","v":"周六"},null,{"$f":"VLOOKUP(WEEKDAY(P24),'工作日_查找'!$B$2:$C$8,2)","v":"周日"},{"$f":"VLOOKUP(WEEKDAY(Q24),'工作日_查找'!$B$2:$C$8,2)","v":"周一"},{"$f":"VLOOKUP(WEEKDAY(R24),'工作日_查找'!$B$2:$C$8,2)","v":"周二"},{"$f":"VLOOKUP(WEEKDAY(S24),'工作日_查找'!$B$2:$C$8,2)","v":"周三"},{"$f":"VLOOKUP(WEEKDAY(T24),'工作日_查找'!$B$2:$C$8,2)","v":"周四"},{"$f":"VLOOKUP(WEEKDAY(U24),'工作日_查找'!$B$2:$C$8,2)","v":"周五"},{"$f":"VLOOKUP(WEEKDAY(V24),'工作日_查找'!$B$2:$C$8,2)","v":"周六"}]
[{"$nulls":14},{"$f":"SUM(H26:N26)","v":{"v":0,"d":"0.00"}},{"$nulls":7},{"$f":"SUM(P26:V26)","v":{"v":0,"d":"0.00"}},{"$f":"O26+W26","v":{"v":0,"d":"0.00"}}]
[{"$nulls":14},{"v":0,"d":"0.00"},{"$nulls":7},{"v":0,"d":"0.00"},{"v":0,"d":"0.00"}]
[{"$nulls":14},{"v":0,"d":"0.00"},{"$nulls":7},{"v":0,"d":"0.00"},{"v":0,"d":"0.00"}]
[{"$nulls":14},{"v":0,"d":"0.00"},{"$nulls":7},{"v":0,"d":"0.00"},{"v":0,"d":"0.00"}]
[{"$nulls":14},{"v":0,"d":"0.00"},{"$nulls":7},{"v":0,"d":"0.00"},{"v":0,"d":"0.00"}]
[{"$nulls":14},{"v":0,"d":"0.00"},{"$nulls":7},{"v":0,"d":"0.00"},{"v":0,"d":"0.00"}]
[{"$nulls":14},{"v":0,"d":"0.00"},{"$nulls":7},{"v":0,"d":"0.00"},{"v":0,"d":"0.00"}]
[null,"加班总工时     ",{"$nulls":5},{"$f":"SUM(H26:H32)","v":{"v":0,"d":"0.00"}},{"v":0,"d":"0.00"},{"v":0,"d":"0.00"},{"v":0,"d":"0.00"},{"v":0,"d":"0.00"},{"v":0,"d":"0.00"},{"v":0,"d":"0.00"},{"$f":"SUM(O26:O32)","v":{"v":0,"d":"0.00"}},{"v":0,"d":"0.00"},{"v":0,"d":"0.00"},{"v":0,"d":"0.00"},{"v":0,"d":"0.00"},{"v":0,"d":"0.00"},{"v":0,"d":"0.00"},{"v":0,"d":"0.00"},{"$f":"SUM(P33:V33)","v":{"v":0,"d":"0.00"}},{"$f":"SUM(X26:X32)","v":{"v":0,"d":"0.00"}},"总\n工作\n时数","总\n付费\n时数"]
[null,"加班费     ",{"$nulls":12},{"$f":"IF(SUM(H34:N34)<=O33,SUM(H34:N34),O33)","v":{"v":0,"d":"0.00"}},{"$nulls":7},{"$f":"IF(SUM(P34:V34)<=W33,SUM(P34:V34),W33)","v":{"v":0,"d":"0.00"}},{"$f":"IF(SUM(Q34:W34)<=X33,SUM(Q34:W34),X33)","v":{"v":0,"d":"0.00"}}]
[null,"已支付的加班工资     ",{"$nulls":5},{"$f":"IF(H33>=H34,H33-H34,H33)","v":{"v":0,"d":"0.00"}},{"$f":"IF(I33>=I34,I33-I34,I33)","v":{"v":0,"d":"0.00"}},{"v":0,"d":"0.00"},{"v":0,"d":"0.00"},{"v":0,"d":"0.00"},{"v":0,"d":"0.00"},{"v":0,"d":"0.00"},{"v":0,"d":"0.00"},{"v":0,"d":"0.00"},{"v":0,"d":"0.00"},{"v":0,"d":"0.00"},{"v":0,"d":"0.00"},{"v":0,"d":"0.00"},{"v":0,"d":"0.00"},{"v":0,"d":"0.00"},{"$f":"IF(W33>=W34,W33-W34,W33)","v":{"v":0,"d":"0.00"}},{"$f":"IF(X33>=X34,X33-X34,X33)","v":{"v":0,"d":"0.00"}},{"$f":"$X$22+$X$33","v":{"v":0,"d":"0.00"}},{"$f":"X22+X35","v":{"v":0,"d":"0.00"}}]
[null,"员工 ",{"$nulls":4},"主管 ",{"$nulls":8},"主管 "]

{"sheet":"工作日_查找","index":1,"n_rows":8,"n_cols":3,"rows_kept":8}
[null,"星期名称\n整数","星期名称\n缩写"]
[null,1,"周日"]
[null,2,"周一"]
[null,3,"周二"]
[null,4,"周三"]
[null,5,"周四"]
[null,6,"周五"]
[null,7,"周六"]