{"text_format":"3","workbook":"xlsx","n_sheets":4,"sheets":["SỰ KIỆN","LỊCH","PHIÊN BẢN IN","QUẢN TRỊ"],"not_rendered":{"defined_names":18},"read":"whole","date_system":"1900"}

{"sheet":"SỰ KIỆN","index":0,"n_rows":38,"n_cols":5,"rows_kept":38}
[]
[null,"TRÌNH LẬP KẾ HOẠCH SỰ KIỆN "]
[null,"CỘNG ĐỒNG HÀNG THÁNG"]
[]
[]
[]
[]
[null,"NGÀY THÁNG","NGÀY","THÁNG","TÊN SỰ KIỆN"]
[null,"2016-07-01",{"$f":"IF(ISBLANK(tblEvents[[#This Row],[NGÀY THÁNG]]),\"\",UPPER(TEXT(tblEvents[[#This Row],[NGÀY THÁNG]],\"[$-42A]ddd\")))","v":"SÁU"},{"$f":"IF(ISBLANK(tblEvents[[#This Row],[NGÀY THÁNG]]),\"\",UPPER(TEXT(tblEvents[[#This Row],[NGÀY THÁNG]],\"[$-42A]mmm\")))","v":"THG7"},"Vườn Cộng đồng"]
[null,"2016-07-01",{"$f":"IF(ISBLANK(tblEvents[[#This Row],[NGÀY THÁNG]]),\"\",UPPER(TEXT(tblEvents[[#This Row],[NGÀY THÁNG]],\"[$-42A]ddd\")))","v":"SÁU"},{"$f":"IF(ISBLANK(tblEvents[[#This Row],[NGÀY THÁNG]]),\"\",UPPER(TEXT(tblEvents[[#This Row],[NGÀY THÁNG]],\"[$-42A]mmm\")))","v":"THG7"},"Hội đồng Thành phố"]
[null,"2016-07-02",{"$f":"IF(ISBLANK(tblEvents[[#This Row],[NGÀY THÁNG]]),\"\",UPPER(TEXT(tblEvents[[#This Row],[NGÀY THÁNG]],\"[$-42A]ddd\")))","v":"BẢY"},{"$f":"IF(ISBLANK(tblEvents[[#This Row],[NGÀY THÁNG]]),\"\",UPPER(TEXT(tblEvents[[#This Row],[NGÀY THÁNG]],\"[$-42A]mmm\")))","v":"THG7"},"Vườn Cộng đồng"]
[null,"2016-07-03",{"$f":"IF(ISBLANK(tblEvents[[#This Row],[NGÀY THÁNG]]),\"\",UPPER(TEXT(tblEvents[[#This Row],[NGÀY THÁNG]],\"[$-42A]ddd\")))","v":"CN"},{"$f":"IF(ISBLANK(tblEvents[[#This Row],[NGÀY THÁNG]]),\"\",UPPER(TEXT(tblEvents[[#This Row],[NGÀY THÁNG]],\"[$-42A]mmm\")))","v":"THG7"},"Xem phim ở Công viên"]
[null,"2016-07-08",{"$f":"IF(ISBLANK(tblEvents[[#This Row],[NGÀY THÁNG]]),\"\",UPPER(TEXT(tblEvents[[#This Row],[NGÀY THÁNG]],\"[$-42A]ddd\")))","v":"SÁU"},{"$f":"IF(ISBLANK(tblEvents[[#This Row],[NGÀY THÁNG]]),\"\",UPPER(TEXT(tblEvents[[#This Row],[NGÀY THÁNG]],\"[$-42A]mmm\")))","v":"THG7"},"Hội đồng Thành phố"]
[null,"2016-07-11",{"$f":"IF(ISBLANK(tblEvents[[#This Row],[NGÀY THÁNG]]),\"\",UPPER(TEXT(tblEvents[[#This Row],[NGÀY THÁNG]],\"[$-42A]ddd\")))","v":"HAI"},{"$f":"IF(ISBLANK(tblEvents[[#This Row],[NGÀY THÁNG]]),\"\",UPPER(TEXT(tblEvents[[#This Row],[NGÀY THÁNG]],\"[$-42A]mmm\")))","v":"THG7"},"Phòng Thương mại Ăn trưa"]
[null,"2016-07-12",{"$f":"IF(ISBLANK(tblEvents[[#This Row],[NGÀY THÁNG]]),\"\",UPPER(TEXT(tblEvents[[#This Row],[NGÀY THÁNG]],\"[$-42A]ddd\")))","v":"BA"},{"$f":"IF(ISBLANK(tblEvents[[#This Row],[NGÀY THÁNG]]),\"\",UPPER(TEXT(tblEvents[[#This Row],[NGÀY THÁNG]],\"[$-42A]mmm\")))","v":"THG7"},"Triển lãm Đồ cổ"]
[null,"2016-07-14",{"$f":"IF(ISBLANK(tblEvents[[#This Row],[NGÀY THÁNG]]),\"\",UPPER(TEXT(tblEvents[[#This Row],[NGÀY THÁNG]],\"[$-42A]ddd\")))","v":"NĂM"},{"$f":"IF(ISBLANK(tblEvents[[#This Row],[NGÀY THÁNG]]),\"\",UPPER(TEXT(tblEvents[[#This Row],[NGÀY THÁNG]],\"[$-42A]mmm\")))","v":"THG7"},"Hội thảo Cộng đồng"]
[null,"2016-07-15",{"$f":"IF(ISBLANK(tblEvents[[#This Row],[NGÀY THÁNG]]),\"\",UPPER(TEXT(tblEvents[[#This Row],[NGÀY THÁNG]],\"[$-42A]ddd\")))","v":"SÁU"},{"$f":"IF(ISBLANK(tblEvents[[#This Row],[NGÀY THÁNG]]),\"\",UPPER(TEXT(tblEvents[[#This Row],[NGÀY THÁNG]],\"[$-42A]mmm\")))","v":"THG7"},"Hội đồng Thành phố"]
[null,"2016-07-19",{"$f":"IF(ISBLANK(tblEvents[[#This Row],[NGÀY THÁNG]]),\"\",UPPER(TEXT(tblEvents[[#This Row],[NGÀY THÁNG]],\"[$-42A]ddd\")))","v":"BA"},{"$f":"IF(ISBLANK(tblEvents[[#This Row],[NGÀY THÁNG]]),\"\",UPPER(TEXT(tblEvents[[#This Row],[NGÀY THÁNG]],\"[$-42A]mmm\")))","v":"THG7"},"Hội thảo Lập kế hoạch Chiến lược"]
[null,"2016-07-20",{"$f":"IF(ISBLANK(tblEvents[[#This Row],[NGÀY THÁNG]]),\"\",UPPER(TEXT(tblEvents[[#This Row],[NGÀY THÁNG]],\"[$-42A]ddd\")))","v":"TƯ"},{"$f":"IF(ISBLANK(tblEvents[[#This Row],[NGÀY THÁNG]]),\"\",UPPER(TEXT(tblEvents[[#This Row],[NGÀY THÁNG]],\"[$-42A]mmm\")))","v":"THG7"},"Dọn Công viên"]
[null,"2016-07-22",{"$f":"IF(ISBLANK(tblEvents[[#This Row],[NGÀY THÁNG]]),\"\",UPPER(TEXT(tblEvents[[#This Row],[NGÀY THÁNG]],\"[$-42A]ddd\")))","v":"SÁU"},{"$f":"IF(ISBLANK(tblEvents[[#This Row],[NGÀY THÁNG]]),\"\",UPPER(TEXT(tblEvents[[#This Row],[NGÀY THÁNG]],\"[$-42A]mmm\")))","v":"THG7"},"Hội đồng Thành phố"]
[null,"2016-07-26",{"$f":"IF(ISBLANK(tblEvents[[#This Row],[NGÀY THÁNG]]),\"\",UPPER(TEXT(tblEvents[[#This Row],[NGÀY THÁNG]],\"[$-42A]ddd\")))","v":"BA"},{"$f":"IF(ISBLANK(tblEvents[[#This Row],[NGÀY THÁNG]]),\"\",UPPER(TEXT(tblEvents[[#This Row],[NGÀY THÁNG]],\"[$-42A]mmm\")))","v":"THG7"},"Đi dạo Thành phố"]
[null,"2016-07-26",{"$f":"IF(ISBLANK(tblEvents[[#This Row],[NGÀY THÁNG]]),\"\",UPPER(TEXT(tblEvents[[#This Row],[NGÀY THÁNG]],\"[$-42A]ddd\")))","v":"BA"},{"$f":"IF(ISBLANK(tblEvents[[#This Row],[NGÀY THÁNG]]),\"\",UPPER(TEXT(tblEvents[[#This Row],[NGÀY THÁNG]],\"[$-42A]mmm\")))","v":"THG7"},"Nhậu"]
[null,"2016-07-29",{"$f":"IF(ISBLANK(tblEvents[[#This Row],[NGÀY THÁNG]]),\"\",UPPER(TEXT(tblEvents[[#This Row],[NGÀY THÁNG]],\"[$-42A]ddd\")))","v":"SÁU"},{"$f":"IF(ISBLANK(tblEvents[[#This Row],[NGÀY THÁNG]]),\"\",UPPER(TEXT(tblEvents[[#This Row],[NGÀY THÁNG]],\"[$-42A]mmm\")))","v":"THG7"},"Hội đồng Thành phố"]
[null,"2016-08-05",{"$f":"IF(ISBLANK(tblEvents[[#This Row],[NGÀY THÁNG]]),\"\",UPPER(TEXT(tblEvents[[#This Row],[NGÀY THÁNG]],\"[$-42A]ddd\")))","v":"SÁU"},{"$f":"IF(ISBLANK(tblEvents[[#This Row],[NGÀY THÁNG]]),\"\",UPPER(TEXT(tblEvents[[#This Row],[NGÀY THÁNG]],\"[$-42A]mmm\")))","v":"THG8"},"Hội đồng Thành phố"]
[null,"2016-08-10",{"$f":"IF(ISBLANK(tblEvents[[#This Row],[NGÀY THÁNG]]),\"\",UPPER(TEXT(tblEvents[[#This Row],[NGÀY THÁNG]],\"[$-42A]ddd\")))","v":"TƯ"},{"$f":"IF(ISBLANK(tblEvents[[#This Row],[NGÀY THÁNG]]),\"\",UPPER(TEXT(tblEvents[[#This Row],[NGÀY THÁNG]],\"[$-42A]mmm\")))","v":"THG8"},"Dọn Công viên"]
[null,"2016-08-12",{"$f":"IF(ISBLANK(tblEvents[[#This Row],[NGÀY THÁNG]]),\"\",UPPER(TEXT(tblEvents[[#This Row],[NGÀY THÁNG]],\"[$-42A]ddd\")))","v":"SÁU"},{"$f":"IF(ISBLANK(tblEvents[[#This Row],[NGÀY THÁNG]]),\"\",UPPER(TEXT(tblEvents[[#This Row],[NGÀY THÁNG]],\"[$-42A]mmm\")))","v":"THG8"},"Hội đồng Thành phố"]
[null,"2016-08-13",{"$f":"IF(ISBLANK(tblEvents[[#This Row],[NGÀY THÁNG]]),\"\",UPPER(TEXT(tblEvents[[#This Row],[NGÀY THÁNG]],\"[$-42A]ddd\")))","v":"BẢY"},{"$f":"IF(ISBLANK(tblEvents[[#This Row],[NGÀY THÁNG]]),\"\",UPPER(TEXT(tblEvents[[#This Row],[NGÀY THÁNG]],\"[$-42A]mmm\")))","v":"THG8"},"Vườn Cộng đồng"]
[null,"2016-09-01",{"$f":"IF(ISBLANK(tblEvents[[#This Row],[NGÀY THÁNG]]),\"\",UPPER(TEXT(tblEvents[[#This Row],[NGÀY THÁNG]],\"[$-42A]ddd\")))","v":"NĂM"},{"$f":"IF(ISBLANK(tblEvents[[#This Row],[NGÀY THÁNG]]),\"\",UPPER(TEXT(tblEvents[[#This Row],[NGÀY THÁNG]],\"[$-42A]mmm\")))","v":"THG9"},"Ban Ngân sách"]
[null,"2016-10-01",{"$f":"IF(ISBLANK(tblEvents[[#This Row],[NGÀY THÁNG]]),\"\",UPPER(TEXT(tblEvents[[#This Row],[NGÀY THÁNG]],\"[$-42A]ddd\")))","v":"BẢY"},{"$f":"IF(ISBLANK(tblEvents[[#This Row],[NGÀY THÁNG]]),\"\",UPPER(TEXT(tblEvents[[#This Row],[NGÀY THÁNG]],\"[$-42A]mmm\")))","v":"THG10"},"Ban Ngân sách"]
[null,"2016-11-03",{"$f":"IF(ISBLANK(tblEvents[[#This Row],[NGÀY THÁNG]]),\"\",UPPER(TEXT(tblEvents[[#This Row],[NGÀY THÁNG]],\"[$-42A]ddd\")))","v":"NĂM"},{"$f":"IF(ISBLANK(tblEvents[[#This Row],[NGÀY THÁNG]]),\"\",UPPER(TEXT(tblEvents[[#This Row],[NGÀY THÁNG]],\"[$-42A]mmm\")))","v":"THG11"},"Ban Ngân sách"]
[null,"2016-12-01",{"$f":"IF(ISBLANK(tblEvents[[#This Row],[NGÀY THÁNG]]),\"\",UPPER(TEXT(tblEvents[[#This Row],[NGÀY THÁNG]],\"[$-42A]ddd\")))","v":"NĂM"},{"$f":"IF(ISBLANK(tblEvents[[#This Row],[NGÀY THÁNG]]),\"\",UPPER(TEXT(tblEvents[[#This Row],[NGÀY THÁNG]],\"[$-42A]mmm\")))","v":"THG12"},"Ban Ngân sách"]
[null,"2017-01-01",{"$f":"IF(ISBLANK(tblEvents[[#This Row],[NGÀY THÁNG]]),\"\",UPPER(TEXT(tblEvents[[#This Row],[NGÀY THÁNG]],\"[$-42A]ddd\")))","v":"CN"},{"$f":"IF(ISBLANK(tblEvents[[#This Row],[NGÀY THÁNG]]),\"\",UPPER(TEXT(tblEvents[[#This Row],[NGÀY THÁNG]],\"[$-42A]mmm\")))","v":"THG1"},"Ban Ngân sách"]
[null,"2017-02-02",{"$f":"IF(ISBLANK(tblEvents[[#This Row],[NGÀY THÁNG]]),\"\",UPPER(TEXT(tblEvents[[#This Row],[NGÀY THÁNG]],\"[$-42A]ddd\")))","v":"NĂM"},{"$f":"IF(ISBLANK(tblEvents[[#This Row],[NGÀY THÁNG]]),\"\",UPPER(TEXT(tblEvents[[#This Row],[NGÀY THÁNG]],\"[$-42A]mmm\")))","v":"THG2"},"Ban Ngân sách"]
[null,"2017-03-02",{"$f":"IF(ISBLANK(tblEvents[[#This Row],[NGÀY THÁNG]]),\"\",UPPER(TEXT(tblEvents[[#This Row],[NGÀY THÁNG]],\"[$-42A]ddd\")))","v":"NĂM"},{"$f":"IF(ISBLANK(tblEvents[[#This Row],[NGÀY THÁNG]]),\"\",UPPER(TEXT(tblEvents[[#This Row],[NGÀY THÁNG]],\"[$-42A]mmm\")))","v":"THG3"},"Ban Ngân sách"]
[null,"2017-04-01",{"$f":"IF(ISBLANK(tblEvents[[#This Row],[NGÀY THÁNG]]),\"\",UPPER(TEXT(tblEvents[[#This Row],[NGÀY THÁNG]],\"[$-42A]ddd\")))","v":"BẢY"},{"$f":"IF(ISBLANK(tblEvents[[#This Row],[NGÀY THÁNG]]),\"\",UPPER(TEXT(tblEvents[[#This Row],[NGÀY THÁNG]],\"[$-42A]mmm\")))","v":"THG4"},"Ban Ngân sách"]
[null,"2017-05-01",{"$f":"IF(ISBLANK(tblEvents[[#This Row],[NGÀY THÁNG]]),\"\",UPPER(TEXT(tblEvents[[#This Row],[NGÀY THÁNG]],\"[$-42A]ddd\")))","v":"HAI"},{"$f":"IF(ISBLANK(tblEvents[[#This Row],[NGÀY THÁNG]]),\"\",UPPER(TEXT(tblEvents[[#This Row],[NGÀY THÁNG]],\"[$-42A]mmm\")))","v":"THG5"},"Ban Ngân sách"]
[null,"2017-06-01",{"$f":"IF(ISBLANK(tblEvents[[#This Row],[NGÀY THÁNG]]),\"\",UPPER(TEXT(tblEvents[[#This Row],[NGÀY THÁNG]],\"[$-42A]ddd\")))","v":"NĂM"},{"$f":"IF(ISBLANK(tblEvents[[#This Row],[NGÀY THÁNG]]),\"\",UPPER(TEXT(tblEvents[[#This Row],[NGÀY THÁNG]],\"[$-42A]mmm\")))","v":"THG6"},"Ban Ngân sách"]
[null,"2017-06-02",{"$f":"IF(ISBLANK(tblEvents[[#This Row],[NGÀY THÁNG]]),\"\",UPPER(TEXT(tblEvents[[#This Row],[NGÀY THÁNG]],\"[$-42A]ddd\")))","v":"SÁU"},{"$f":"IF(ISBLANK(tblEvents[[#This Row],[NGÀY THÁNG]]),\"\",UPPER(TEXT(tblEvents[[#This Row],[NGÀY THÁNG]],\"[$-42A]mmm\")))","v":"THG6"},"Hội đồng Thành phố"]

{"sheet":"LỊCH","index":1,"n_rows":35,"n_cols":21,"rows_kept":35,"merged":[[1,5,1,11],[30,8,34,20]]}
[]
[null,null,2016,null,null,{"$f":"LOOKUP(MonthNum,tblMonths[SỐ],tblMonths[THÁNG])","v":"THÁNG 7"}]
[null,null,7,null,null,{"$f":"DATE(ViewYear,MonthNum,1)","v":"2016-07-01"},null,null,{"$f":"WEEKDAY(StartDate)","v":6}]
[null,null,"T2",null,null,"T3",null,null,"T4",null,null,"T5",null,null,"T6",null,null,"T7",null,null,"CN"]
[]
[null,null,{"$f":"StartDate-(WEEKDAY(StartDate,2))+{0;1;2;3;4;5}*7 +{2,3,4,5,6,7,1}-3+COLUMN(B1)","v":"2016-06-27"},null,null,{"$f":"StartDate-(WEEKDAY(StartDate,2))+{0;1;2;3;4;5}*7 +{2,3,4,5,6,7,1}-3+COLUMN(C1)","v":"2016-06-28"},null,null,{"$f":"StartDate-(WEEKDAY(StartDate,2))+{0;1;2;3;4;5}*7 +{2,3,4,5,6,7,1}-3+COLUMN(D1)","v":"2016-06-29"},null,null,{"$f":"StartDate-(WEEKDAY(StartDate,2))+{0;1;2;3;4;5}*7 +{2,3,4,5,6,7,1}-3+COLUMN(E1)","v":"2016-06-30"},null,null,{"$f":"StartDate-(WEEKDAY(StartDate,2))+{0;1;2;3;4;5}*7 +{2,3,4,5,6,7,1}-3+COLUMN(F1)","v":"2016-07-01"},null,null,{"$f":"StartDate-(WEEKDAY(StartDate,2))+{0;1;2;3;4;5}*7 +{2,3,4,5,6,7,1}-3+COLUMN(G1)","v":"2016-07-02"},null,null,{"$f":"StartDate-(WEEKDAY(StartDate,2))+{0;1;2;3;4;5}*7 +{2,3,4,5,6,7,1}-3+COLUMN(H1)","v":"2016-07-03"}]
[null,null,{"$f":"IFERROR(INDEX(tblEvents[],SMALL(IF(Dates=C$6,ROW(Dates)),ROW(1:1))-TableRowStart,4),\"\")","v":""},null,null,{"$f":"IFERROR(INDEX(tblEvents[],SMALL(IF(Dates=F$6,ROW(Dates)),ROW(1:1))-TableRowStart,4),\"\")","v":""},null,null,{"$f":"IFERROR(INDEX(tblEvents[],SMALL(IF(Dates=I$6,ROW(Dates)),ROW(1:1))-TableRowStart,4),\"\")","v":""},null,null,{"$f":"IFERROR(INDEX(tblEvents[],SMALL(IF(Dates=L$6,ROW(Dates)),ROW(1:1))-TableRowStart,4),\"\")","v":""},null,null,{"$f":"IFERROR(INDEX(tblEvents[],SMALL(IF(Dates=O$6,ROW(Dates)),ROW(1:1))-TableRowStart,4),\"\")","v":"Vườn Cộng đồng"},null,null,{"$f":"IFERROR(INDEX(tblEvents[],SMALL(IF(Dates=R$6,ROW(Dates)),ROW(1:1))-TableRowStart,4),\"\")","v":"Vườn Cộng đồng"},null,null,{"$f":"IFERROR(INDEX(tblEvents[],SMALL(IF(Dates=U$6,ROW(Dates)),ROW(1:1))-TableRowStart,4),\"\")","v":"Xem phim ở Công viên"}]
[null,null,{"$f":"IFERROR(INDEX(tblEvents[],SMALL(IF(Dates=C$6,ROW(Dates)),ROW(2:2))-TableRowStart,4),\"\")","v":""},null,null,{"$f":"IFERROR(INDEX(tblEvents[],SMALL(IF(Dates=F$6,ROW(Dates)),ROW(2:2))-TableRowStart,4),\"\")","v":""},null,null,{"$f":"IFERROR(INDEX(tblEvents[],SMALL(IF(Dates=I$6,ROW(Dates)),ROW(2:2))-TableRowStart,4),\"\")","v":""},null,null,{"$f":"IFERROR(INDEX(tblEvents[],SMALL(IF(Dates=L$6,ROW(Dates)),ROW(2:2))-TableRowStart,4),\"\")","v":""},null,null,{"$f":"IFERROR(INDEX(tblEvents[],SMALL(IF(Dates=O$6,ROW(Dates)),ROW(2:2))-TableRowStart,4),\"\")","v":"Hội đồng Thành phố"},null,null,{"$f":"IFERROR(INDEX(tblEvents[],SMALL(IF(Dates=R$6,ROW(Dates)),ROW(2:2))-TableRowStart,4),\"\")","v":""},null,null,{"$f":"IFERROR(INDEX(tblEvents[],SMALL(IF(Dates=U$6,ROW(Dates)),ROW(2:2))-TableRowStart,4),\"\")","v":""}]
[null,null,{"$f":"IFERROR(INDEX(tblEvents[],SMALL(IF(Dates=C$6,ROW(Dates)),ROW(3:3))-TableRowStart,4),\"\")","v":""},null,null,{"$f":"IFERROR(INDEX(tblEvents[],SMALL(IF(Dates=F$6,ROW(Dates)),ROW(3:3))-TableRowStart,4),\"\")","v":""},null,null,{"$f":"IFERROR(INDEX(tblEvents[],SMALL(IF(Dates=I$6,ROW(Dates)),ROW(3:3))-TableRowStart,4),\"\")","v":""},null,null,{"$f":"IFERROR(INDEX(tblEvents[],SMALL(IF(Dates=L$6,ROW(Dates)),ROW(3:3))-TableRowStart,4),\"\")","v":""},null,null,{"$f":"IFERROR(INDEX(tblEvents[],SMALL(IF(Dates=O$6,ROW(Dates)),ROW(3:3))-TableRowStart,4),\"\")","v":""},null,null,{"$f":"IFERROR(INDEX(tblEvents[],SMALL(IF(Dates=R$6,ROW(Dates)),ROW(3:3))-TableRowStart,4),\"\")","v":""},null,null,{"$f":"IFERROR(INDEX(tblEvents[],SMALL(IF(Dates=U$6,ROW(Dates)),ROW(3:3))-TableRowStart,4),\"\")","v":""}]
[null,null,{"$f":"IFERROR(INDEX(tblEvents[],SMALL(IF(Dates=C$6,ROW(Dates)),ROW(#REF!))-TableRowStart,4),\"\")","v":""},null,null,{"$f":"IFERROR(INDEX(tblEvents[],SMALL(IF(Dates=F$6,ROW(Dates)),ROW(#REF!))-TableRowStart,4),\"\")","v":""},null,null,{"$f":"IFERROR(INDEX(tblEvents[],SMALL(IF(Dates=I$6,ROW(Dates)),ROW(#REF!))-TableRowStart,4),\"\")","v":""},null,null,{"$f":"IFERROR(INDEX(tblEvents[],SMALL(IF(Dates=L$6,ROW(Dates)),ROW(#REF!))-TableRowStart,4),\"\")","v":""},null,null,{"$f":"IFERROR(INDEX(tblEvents[],SMALL(IF(Dates=O$6,ROW(Dates)),ROW(#REF!))-TableRowStart,4),\"\")","v":""},null,null,{"$f":"IFERROR(INDEX(tblEvents[],SMALL(IF(Dates=R$6,ROW(Dates)),ROW(#REF!))-TableRowStart,4),\"\")","v":""},null,null,{"$f":"IFERROR(INDEX(tblEvents[],SMALL(IF(Dates=U$6,ROW(Dates)),ROW(#REF!))-TableRowStart,4),\"\")","v":""}]
[null,null,{"$f":"U6+1","v":"2016-07-04"},null,null,{"$f":"C11+1","v":"2016-07-05"},null,null,{"$f":"F11+1","v":"2016-07-06"},null,null,{"$f":"I11+1","v":"2016-07-07"},null,null,{"$f":"L11+1","v":"2016-07-08"},null,null,{"$f":"O11+1","v":"2016-07-09"},null,null,{"$f":"R11+1","v":"2016-07-10"}]
[null,null,{"$f":"IFERROR(INDEX(tblEvents[],SMALL(IF(Dates=C$11,ROW(Dates)),ROW(1:1))-TableRowStart,4),\"\")","v":""},null,null,{"$f":"IFERROR(INDEX(tblEvents[],SMALL(IF(Dates=F$11,ROW(Dates)),ROW(1:1))-TableRowStart,4),\"\")","v":""},null,null,{"$f":"IFERROR(INDEX(tblEvents[],SMALL(IF(Dates=I$11,ROW(Dates)),ROW(1:1))-TableRowStart,4),\"\")","v":""},null,null,{"$f":"IFERROR(INDEX(tblEvents[],SMALL(IF(Dates=L$11,ROW(Dates)),ROW(1:1))-TableRowStart,4),\"\")","v":""},null,null,{"$f":"IFERROR(INDEX(tblEvents[],SMALL(IF(Dates=O$11,ROW(Dates)),ROW(1:1))-TableRowStart,4),\"\")","v":"Hội đồng Thành phố"},null,null,{"$f":"IFERROR(INDEX(tblEvents[],SMALL(IF(Dates=R$11,ROW(Dates)),ROW(1:1))-TableRowStart,4),\"\")","v":""},null,null,{"$f":"IFERROR(INDEX(tblEvents[],SMALL(IF(Dates=U$11,ROW(Dates)),ROW(1:1))-TableRowStart,4),\"\")","v":""}]
[null,null,{"$f":"IFERROR(INDEX(tblEvents[],SMALL(IF(Dates=C$11,ROW(Dates)),ROW(2:2))-TableRowStart,4),\"\")","v":""},null,null,{"$f":"IFERROR(INDEX(tblEvents[],SMALL(IF(Dates=F$11,ROW(Dates)),ROW(2:2))-TableRowStart,4),\"\")","v":""},null,null,{"$f":"IFERROR(INDEX(tblEvents[],SMALL(IF(Dates=I$11,ROW(Dates)),ROW(2:2))-TableRowStart,4),\"\")","v":""},null,null,{"$f":"IFERROR(INDEX(tblEvents[],SMALL(IF(Dates=L$11,ROW(Dates)),ROW(2:2))-TableRowStart,4),\"\")","v":""},null,null,{"$f":"IFERROR(INDEX(tblEvents[],SMALL(IF(Dates=O$11,ROW(Dates)),ROW(2:2))-TableRowStart,4),\"\")","v":""},null,null,{"$f":"IFERROR(INDEX(tblEvents[],SMALL(IF(Dates=R$11,ROW(Dates)),ROW(2:2))-TableRowStart,4),\"\")","v":""},null,null,{"$f":"IFERROR(INDEX(tblEvents[],SMALL(IF(Dates=U$11,ROW(Dates)),ROW(2:2))-TableRowStart,4),\"\")","v":""}]
[null,null,{"$f":"IFERROR(INDEX(tblEvents[],SMALL(IF(Dates=C$11,ROW(Dates)),ROW(3:3))-TableRowStart,4),\"\")","v":""},null,null,{"$f":"IFERROR(INDEX(tblEvents[],SMALL(IF(Dates=F$11,ROW(Dates)),ROW(3:3))-TableRowStart,4),\"\")","v":""},null,null,{"$f":"IFERROR(INDEX(tblEvents[],SMALL(IF(Dates=I$11,ROW(Dates)),ROW(3:3))-TableRowStart,4),\"\")","v":""},null,null,{"$f":"IFERROR(INDEX(tblEvents[],SMALL(IF(Dates=L$11,ROW(Dates)),ROW(3:3))-TableRowStart,4),\"\")","v":""},null,null,{"$f":"IFERROR(INDEX(tblEvents[],SMALL(IF(Dates=O$11,ROW(Dates)),ROW(3:3))-TableRowStart,4),\"\")","v":""},null,null,{"$f":"IFERROR(INDEX(tblEvents[],SMALL(IF(Dates=R$11,ROW(Dates)),ROW(3:3))-TableRowStart,4),\"\")","v":""},null,null,{"$f":"IFERROR(INDEX(tblEvents[],SMALL(IF(Dates=U$11,ROW(Dates)),ROW(3:3))-TableRowStart,4),\"\")","v":""}]
[null,null,{"$f":"IFERROR(INDEX(tblEvents[],SMALL(IF(Dates=C$11,ROW(Dates)),ROW(#REF!))-TableRowStart,4),\"\")","v":""},null,null,{"$f":"IFERROR(INDEX(tblEvents[],SMALL(IF(Dates=F$11,ROW(Dates)),ROW(#REF!))-TableRowStart,4),\"\")","v":""},null,null,{"$f":"IFERROR(INDEX(tblEvents[],SMALL(IF(Dates=I$11,ROW(Dates)),ROW(#REF!))-TableRowStart,4),\"\")","v":""},null,null,{"$f":"IFERROR(INDEX(tblEvents[],SMALL(IF(Dates=L$11,ROW(Dates)),ROW(#REF!))-TableRowStart,4),\"\")","v":""},null,null,{"$f":"IFERROR(INDEX(tblEvents[],SMALL(IF(Dates=O$11,ROW(Dates)),ROW(#REF!))-TableRowStart,4),\"\")","v":""},null,null,{"$f":"IFERROR(INDEX(tblEvents[],SMALL(IF(Dates=R$11,ROW(Dates)),ROW(#REF!))-TableRowStart,4),\"\")","v":""},null,null,{"$f":"IFERROR(INDEX(tblEvents[],SMALL(IF(Dates=U$11,ROW(Dates)),ROW(#REF!))-TableRowStart,4),\"\")","v":""}]
[null,null,{"$f":"U11+1","v":"2016-07-11"},null,null,{"$f":"C16+1","v":"2016-07-12"},null,null,{"$f":"F16+1","v":"2016-07-13"},null,null,{"$f":"I16+1","v":"2016-07-14"},null,null,{"$f":"L16+1","v":"2016-07-15"},null,null,{"$f":"O16+1","v":"2016-07-16"},null,null,{"$f":"R16+1","v":"2016-07-17"}]
[null,null,{"$f":"IFERROR(INDEX(tblEvents[],SMALL(IF(Dates=C$16,ROW(Dates)),ROW(1:1))-TableRowStart,4),\"\")","v":"Phòng Thương mại Ăn trưa"},null,null,{"$f":"IFERROR(INDEX(tblEvents[],SMALL(IF(Dates=F$16,ROW(Dates)),ROW(1:1))-TableRowStart,4),\"\")","v":"Triển lãm Đồ cổ"},null,null,{"$f":"IFERROR(INDEX(tblEvents[],SMALL(IF(Dates=I$16,ROW(Dates)),ROW(1:1))-TableRowStart,4),\"\")","v":""},null,null,{"$f":"IFERROR(INDEX(tblEvents[],SMALL(IF(Dates=L$16,ROW(Dates)),ROW(1:1))-TableRowStart,4),\"\")","v":"Hội thảo Cộng đồng"},null,null,{"$f":"IFERROR(INDEX(tblEvents[],SMALL(IF(Dates=O$16,ROW(Dates)),ROW(1:1))-TableRowStart,4),\"\")","v":"Hội đồng Thành phố"},null,null,{"$f":"IFERROR(INDEX(tblEvents[],SMALL(IF(Dates=R$16,ROW(Dates)),ROW(1:1))-TableRowStart,4),\"\")","v":""},null,null,{"$f":"IFERROR(INDEX(tblEvents[],SMALL(IF(Dates=U$16,ROW(Dates)),ROW(1:1))-TableRowStart,4),\"\")","v":""}]
[null,null,{"$f":"IFERROR(INDEX(tblEvents[],SMALL(IF(Dates=C$16,ROW(Dates)),ROW(2:2))-TableRowStart,4),\"\")","v":""},null,null,{"$f":"IFERROR(INDEX(tblEvents[],SMALL(IF(Dates=F$16,ROW(Dates)),ROW(2:2))-TableRowStart,4),\"\")","v":""},null,null,{"$f":"IFERROR(INDEX(tblEvents[],SMALL(IF(Dates=I$16,ROW(Dates)),ROW(2:2))-TableRowStart,4),\"\")","v":""},null,null,{"$f":"IFERROR(INDEX(tblEvents[],SMALL(IF(Dates=L$16,ROW(Dates)),ROW(2:2))-TableRowStart,4),\"\")","v":""},null,null,{"$f":"IFERROR(INDEX(tblEvents[],SMALL(IF(Dates=O$16,ROW(Dates)),ROW(2:2))-TableRowStart,4),\"\")","v":""},null,null,{"$f":"IFERROR(INDEX(tblEvents[],SMALL(IF(Dates=R$16,ROW(Dates)),ROW(2:2))-TableRowStart,4),\"\")","v":""},null,null,{"$f":"IFERROR(INDEX(tblEvents[],SMALL(IF(Dates=U$16,ROW(Dates)),ROW(2:2))-TableRowStart,4),\"\")","v":""}]
[null,null,{"$f":"IFERROR(INDEX(tblEvents[],SMALL(IF(Dates=C$16,ROW(Dates)),ROW(3:3))-TableRowStart,4),\"\")","v":""},null,null,{"$f":"IFERROR(INDEX(tblEvents[],SMALL(IF(Dates=F$16,ROW(Dates)),ROW(3:3))-TableRowStart,4),\"\")","v":""},null,null,{"$f":"IFERROR(INDEX(tblEvents[],SMALL(IF(Dates=I$16,ROW(Dates)),ROW(3:3))-TableRowStart,4),\"\")","v":""},null,null,{"$f":"IFERROR(INDEX(tblEvents[],SMALL(IF(Dates=L$16,ROW(Dates)),ROW(3:3))-TableRowStart,4),\"\")","v":""},null,null,{"$f":"IFERROR(INDEX(tblEvents[],SMALL(IF(Dates=O$16,ROW(Dates)),ROW(3:3))-TableRowStart,4),\"\")","v":""},null,null,{"$f":"IFERROR(INDEX(tblEvents[],SMALL(IF(Dates=R$16,ROW(Dates)),ROW(3:3))-TableRowStart,4),\"\")","v":""},null,null,{"$f":"IFERROR(INDEX(tblEvents[],SMALL(IF(Dates=U$16,ROW(Dates)),ROW(3:3))-TableRowStart,4),\"\")","v":""}]
[null,null,{"$f":"IFERROR(INDEX(tblEvents[],SMALL(IF(Dates=C$16,ROW(Dates)),ROW(#REF!))-TableRowStart,4),\"\")","v":""},null,null,{"$f":"IFERROR(INDEX(tblEvents[],SMALL(IF(Dates=F$16,ROW(Dates)),ROW(#REF!))-TableRowStart,4),\"\")","v":""},null,null,{"$f":"IFERROR(INDEX(tblEvents[],SMALL(IF(Dates=I$16,ROW(Dates)),ROW(#REF!))-TableRowStart,4),\"\")","v":""},null,null,{"$f":"IFERROR(INDEX(tblEvents[],SMALL(IF(Dates=L$16,ROW(Dates)),ROW(#REF!))-TableRowStart,4),\"\")","v":""},null,null,{"$f":"IFERROR(INDEX(tblEvents[],SMALL(IF(Dates=O$16,ROW(Dates)),ROW(#REF!))-TableRowStart,4),\"\")","v":""},null,null,{"$f":"IFERROR(INDEX(tblEvents[],SMALL(IF(Dates=R$16,ROW(Dates)),ROW(#REF!))-TableRowStart,4),\"\")","v":""},null,null,{"$f":"IFERROR(INDEX(tblEvents[],SMALL(IF(Dates=U$16,ROW(Dates)),ROW(#REF!))-TableRowStart,4),\"\")","v":""}]
[null,null,{"$f":"U16+1","v":"2016-07-18"},null,null,{"$f":"C21+1","v":"2016-07-19"},null,null,{"$f":"F21+1","v":"2016-07-20"},null,null,{"$f":"I21+1","v":"2016-07-21"},null,null,{"$f":"L21+1","v":"2016-07-22"},null,null,{"$f":"O21+1","v":"2016-07-23"},null,null,{"$f":"R21+1","v":"2016-07-24"}]
[null,null,{"$f":"IFERROR(INDEX(tblEvents[],SMALL(IF(Dates=C$21,ROW(Dates)),ROW(1:1))-TableRowStart,4),\"\")","v":""},null,null,{"$f":"IFERROR(INDEX(tblEvents[],SMALL(IF(Dates=F$21,ROW(Dates)),ROW(1:1))-TableRowStart,4),\"\")","v":"Hội thảo Lập kế hoạch Chiến lược"},null,null,{"$f":"IFERROR(INDEX(tblEvents[],SMALL(IF(Dates=I$21,ROW(Dates)),ROW(1:1))-TableRowStart,4),\"\")","v":"Dọn Công viên"},null,null,{"$f":"IFERROR(INDEX(tblEvents[],SMALL(IF(Dates=L$21,ROW(Dates)),ROW(1:1))-TableRowStart,4),\"\")","v":""},null,null,{"$f":"IFERROR(INDEX(tblEvents[],SMALL(IF(Dates=O$21,ROW(Dates)),ROW(1:1))-TableRowStart,4),\"\")","v":"Hội đồng Thành phố"},null,null,{"$f":"IFERROR(INDEX(tblEvents[],SMALL(IF(Dates=R$21,ROW(Dates)),ROW(1:1))-TableRowStart,4),\"\")","v":""},null,null,{"$f":"IFERROR(INDEX(tblEvents[],SMALL(IF(Dates=U$21,ROW(Dates)),ROW(1:1))-TableRowStart,4),\"\")","v":""}]
[null,null,{"$f":"IFERROR(INDEX(tblEvents[],SMALL(IF(Dates=C$21,ROW(Dates)),ROW(2:2))-TableRowStart,4),\"\")","v":""},null,null,{"$f":"IFERROR(INDEX(tblEvents[],SMALL(IF(Dates=F$21,ROW(Dates)),ROW(2:2))-TableRowStart,4),\"\")","v":""},null,null,{"$f":"IFERROR(INDEX(tblEvents[],SMALL(IF(Dates=I$21,ROW(Dates)),ROW(2:2))-TableRowStart,4),\"\")","v":""},null,null,{"$f":"IFERROR(INDEX(tblEvents[],SMALL(IF(Dates=L$21,ROW(Dates)),ROW(2:2))-TableRowStart,4),\"\")","v":""},null,null,{"$f":"IFERROR(INDEX(tblEvents[],SMALL(IF(Dates=O$21,ROW(Dates)),ROW(2:2))-TableRowStart,4),\"\")","v":""},null,null,{"$f":"IFERROR(INDEX(tblEvents[],SMALL(IF(Dates=R$21,ROW(Dates)),ROW(2:2))-TableRowStart,4),\"\")","v":""},null,null,{"$f":"IFERROR(INDEX(tblEvents[],SMALL(IF(Dates=U$21,ROW(Dates)),ROW(2:2))-TableRowStart,4),\"\")","v":""}]
[null,null,{"$f":"IFERROR(INDEX(tblEvents[],SMALL(IF(Dates=C$21,ROW(Dates)),ROW(3:3))-TableRowStart,4),\"\")","v":""},null,null,{"$f":"IFERROR(INDEX(tblEvents[],SMALL(IF(Dates=F$21,ROW(Dates)),ROW(3:3))-TableRowStart,4),\"\")","v":""},null,null,{"$f":"IFERROR(INDEX(tblEvents[],SMALL(IF(Dates=I$21,ROW(Dates)),ROW(3:3))-TableRowStart,4),\"\")","v":""},null,null,{"$f":"IFERROR(INDEX(tblEvents[],SMALL(IF(Dates=L$21,ROW(Dates)),ROW(3:3))-TableRowStart,4),\"\")","v":""},null,null,{"$f":"IFERROR(INDEX(tblEvents[],SMALL(IF(Dates=O$21,ROW(Dates)),ROW(3:3))-TableRowStart,4),\"\")","v":""},null,null,{"$f":"IFERROR(INDEX(tblEvents[],SMALL(IF(Dates=R$21,ROW(Dates)),ROW(3:3))-TableRowStart,4),\"\")","v":""},null,null,{"$f":"IFERROR(INDEX(tblEvents[],SMALL(IF(Dates=U$21,ROW(Dates)),ROW(3:3))-TableRowStart,4),\"\")","v":""}]
[null,null,{"$f":"IFERROR(INDEX(tblEvents[],SMALL(IF(Dates=C$21,ROW(Dates)),ROW(#REF!))-TableRowStart,4),\"\")","v":""},null,null,{"$f":"IFERROR(INDEX(tblEvents[],SMALL(IF(Dates=F$21,ROW(Dates)),ROW(#REF!))-TableRowStart,4),\"\")","v":""},null,null,{"$f":"IFERROR(INDEX(tblEvents[],SMALL(IF(Dates=I$21,ROW(Dates)),ROW(#REF!))-TableRowStart,4),\"\")","v":""},null,null,{"$f":"IFERROR(INDEX(tblEvents[],SMALL(IF(Dates=L$21,ROW(Dates)),ROW(#REF!))-TableRowStart,4),\"\")","v":""},null,null,{"$f":"IFERROR(INDEX(tblEvents[],SMALL(IF(Dates=O$21,ROW(Dates)),ROW(#REF!))-TableRowStart,4),\"\")","v":""},null,null,{"$f":"IFERROR(INDEX(tblEvents[],SMALL(IF(Dates=R$21,ROW(Dates)),ROW(#REF!))-TableRowStart,4),\"\")","v":""},null,null,{"$f":"IFERROR(INDEX(tblEvents[],SMALL(IF(Dates=U$21,ROW(Dates)),ROW(#REF!))-TableRowStart,4),\"\")","v":""}]
[null,null,{"$f":"U21+1","v":"2016-07-25"},null,null,{"$f":"C26+1","v":"2016-07-26"},null,null,{"$f":"F26+1","v":"2016-07-27"},null,null,{"$f":"I26+1","v":"2016-07-28"},null,null,{"$f":"L26+1","v":"2016-07-29"},null,null,{"$f":"O26+1","v":"2016-07-30"},null,null,{"$f":"R26+1","v":"2016-07-31"}]
[null,null,{"$f":"IFERROR(INDEX(tblEvents[],SMALL(IF(Dates=C$26,ROW(Dates)),ROW(1:1))-TableRowStart,4),\"\")","v":""},null,null,{"$f":"IFERROR(INDEX(tblEvents[],SMALL(IF(Dates=F$26,ROW(Dates)),ROW(1:1))-TableRowStart,4),\"\")","v":"Đi dạo Thành phố"},null,null,{"$f":"IFERROR(INDEX(tblEvents[],SMALL(IF(Dates=I$26,ROW(Dates)),ROW(1:1))-TableRowStart,4),\"\")","v":""},null,null,{"$f":"IFERROR(INDEX(tblEvents[],SMALL(IF(Dates=L$26,ROW(Dates)),ROW(1:1))-TableRowStart,4),\"\")","v":""},null,null,{"$f":"IFERROR(INDEX(tblEvents[],SMALL(IF(Dates=O$26,ROW(Dates)),ROW(1:1))-TableRowStart,4),\"\")","v":"Hội đồng Thành phố"},null,null,{"$f":"IFERROR(INDEX(tblEvents[],SMALL(IF(Dates=R$26,ROW(Dates)),ROW(1:1))-TableRowStart,4),\"\")","v":""},null,null,{"$f":"IFERROR(INDEX(tblEvents[],SMALL(IF(Dates=U$26,ROW(Dates)),ROW(1:1))-TableRowStart,4),\"\")","v":""}]
[null,null,{"$f":"IFERROR(INDEX(tblEvents[],SMALL(IF(Dates=C$26,ROW(Dates)),ROW(2:2))-TableRowStart,4),\"\")","v":""},null,null,{"$f":"IFERROR(INDEX(tblEvents[],SMALL(IF(Dates=F$26,ROW(Dates)),ROW(2:2))-TableRowStart,4),\"\")","v":"Nhậu"},null,null,{"$f":"IFERROR(INDEX(tblEvents[],SMALL(IF(Dates=I$26,ROW(Dates)),ROW(2:2))-TableRowStart,4),\"\")","v":""},null,null,{"$f":"IFERROR(INDEX(tblEvents[],SMALL(IF(Dates=L$26,ROW(Dates)),ROW(2:2))-TableRowStart,4),\"\")","v":""},null,null,{"$f":"IFERROR(INDEX(tblEvents[],SMALL(IF(Dates=O$26,ROW(Dates)),ROW(2:2))-TableRowStart,4),\"\")","v":""},null,null,{"$f":"IFERROR(INDEX(tblEvents[],SMALL(IF(Dates=R$26,ROW(Dates)),ROW(2:2))-TableRowStart,4),\"\")","v":""},null,null,{"$f":"IFERROR(INDEX(tblEvents[],SMALL(IF(Dates=U$26,ROW(Dates)),ROW(2:2))-TableRowStart,4),\"\")","v":""}]
[null,null,{"$f":"IFERROR(INDEX(tblEvents[],SMALL(IF(Dates=C$26,ROW(Dates)),ROW(3:3))-TableRowStart,4),\"\")","v":""},null,null,{"$f":"IFERROR(INDEX(tblEvents[],SMALL(IF(Dates=F$26,ROW(Dates)),ROW(3:3))-TableRowStart,4),\"\")","v":""},null,null,{"$f":"IFERROR(INDEX(tblEvents[],SMALL(IF(Dates=I$26,ROW(Dates)),ROW(3:3))-TableRowStart,4),\"\")","v":""},null,null,{"$f":"IFERROR(INDEX(tblEvents[],SMALL(IF(Dates=L$26,ROW(Dates)),ROW(3:3))-TableRowStart,4),\"\")","v":""},null,null,{"$f":"IFERROR(INDEX(tblEvents[],SMALL(IF(Dates=O$26,ROW(Dates)),ROW(3:3))-TableRowStart,4),\"\")","v":""},null,null,{"$f":"IFERROR(INDEX(tblEvents[],SMALL(IF(Dates=R$26,ROW(Dates)),ROW(3:3))-TableRowStart,4),\"\")","v":""},null,null,{"$f":"IFERROR(INDEX(tblEvents[],SMALL(IF(Dates=U$26,ROW(Dates)),ROW(3:3))-TableRowStart,4),\"\")","v":""}]
[null,null,{"$f":"IFERROR(INDEX(tblEvents[],SMALL(IF(Dates=C$26,ROW(Dates)),ROW(#REF!))-TableRowStart,4),\"\")","v":""},null,null,{"$f":"IFERROR(INDEX(tblEvents[],SMALL(IF(Dates=F$26,ROW(Dates)),ROW(#REF!))-TableRowStart,4),\"\")","v":""},null,null,{"$f":"IFERROR(INDEX(tblEvents[],SMALL(IF(Dates=I$26,ROW(Dates)),ROW(#REF!))-TableRowStart,4),\"\")","v":""},null,null,{"$f":"IFERROR(INDEX(tblEvents[],SMALL(IF(Dates=L$26,ROW(Dates)),ROW(#REF!))-TableRowStart,4),\"\")","v":""},null,null,{"$f":"IFERROR(INDEX(tblEvents[],SMALL(IF(Dates=O$26,ROW(Dates)),ROW(#REF!))-TableRowStart,4),\"\")","v":""},null,null,{"$f":"IFERROR(INDEX(tblEvents[],SMALL(IF(Dates=R$26,ROW(Dates)),ROW(#REF!))-TableRowStart,4),\"\")","v":""},null,null,{"$f":"IFERROR(INDEX(tblEvents[],SMALL(IF(Dates=U$26,ROW(Dates)),ROW(#REF!))-TableRowStart,4),\"\")","v":""}]
[null,null,{"$f":"U26+1","v":"2016-08-01"},null,null,{"$f":"C31+1","v":"2016-08-02"},null,null,"GHI CHÚ:"]
[null,null,{"$f":"IFERROR(INDEX(tblEvents[],SMALL(IF(Dates=C$31,ROW(Dates)),ROW(1:1))-TableRowStart,4),\"\")","v":""},null,null,{"$f":"IFERROR(INDEX(tblEvents[],SMALL(IF(Dates=F$31,ROW(Dates)),ROW(1:1))-TableRowStart,4),\"\")","v":""}]
[null,null,{"$f":"IFERROR(INDEX(tblEvents[],SMALL(IF(Dates=C$31,ROW(Dates)),ROW(2:2))-TableRowStart,4),\"\")","v":""},null,null,{"$f":"IFERROR(INDEX(tblEvents[],SMALL(IF(Dates=F$31,ROW(Dates)),ROW(2:2))-TableRowStart,4),\"\")","v":""}]
[null,null,{"$f":"IFERROR(INDEX(tblEvents[],SMALL(IF(Dates=C$31,ROW(Dates)),ROW(3:3))-TableRowStart,4),\"\")","v":""},null,null,{"$f":"IFERROR(INDEX(tblEvents[],SMALL(IF(Dates=F$31,ROW(Dates)),ROW(3:3))-TableRowStart,4),\"\")","v":""}]
[null,null,{"$f":"IFERROR(INDEX(tblEvents[],SMALL(IF(Dates=C$31,ROW(Dates)),ROW(#REF!))-TableRowStart,4),\"\")","v":""},null,null,{"$f":"IFERROR(INDEX(tblEvents[],SMALL(IF(Dates=F$31,ROW(Dates)),ROW(#REF!))-TableRowStart,4),\"\")","v":""}]

{"sheet":"PHIÊN BẢN IN","index":2,"n_rows":35,"n_cols":21,"rows_kept":35,"merged":[[1,5,1,11],[30,8,34,20]]}
[]
[null,null,{"$f":"ViewYear","v":2016},null,null,{"$f":"ViewMonth","v":"THÁNG 7"},{"$f":"LỊCH!G2","v":0},{"$f":"LỊCH!H2","v":0},{"$f":"LỊCH!I2","v":0},{"$f":"LỊCH!J2","v":0},{"$f":"LỊCH!K2","v":0},{"$f":"LỊCH!L2","v":0}]
[]
[null,null,"T2",null,null,"T3",null,null,"T4",null,null,"T5",null,null,"T6",null,null,"T7",null,null,"CN"]
[]
[null,null,{"$f":"LỊCH!C6","v":"2016-06-27"},{"$f":"LỊCH!D6","v":0},{"$f":"LỊCH!E6","v":0},{"$f":"LỊCH!F6","v":"2016-06-28"},{"$f":"LỊCH!G6","v":0},{"$f":"LỊCH!H6","v":0},{"$f":"LỊCH!I6","v":"2016-06-29"},{"$f":"LỊCH!J6","v":0},{"$f":"LỊCH!K6","v":0},{"$f":"LỊCH!L6","v":"2016-06-30"},{"$f":"LỊCH!M6","v":0},{"$f":"LỊCH!N6","v":0},{"$f":"LỊCH!O6","v":"2016-07-01"},{"$f":"LỊCH!P6","v":0},{"$f":"LỊCH!Q6","v":0},{"$f":"LỊCH!R6","v":"2016-07-02"},{"$f":"LỊCH!S6","v":0},{"$f":"LỊCH!T6","v":0},{"$f":"LỊCH!U6","v":"2016-07-03"}]
[null,null,{"$f":"LỊCH!C7","v":""},{"$f":"LỊCH!D7","v":0},{"$f":"LỊCH!E7","v":0},{"$f":"LỊCH!F7","v":""},{"$f":"LỊCH!G7","v":0},{"$f":"LỊCH!H7","v":0},{"$f":"LỊCH!I7","v":""},{"$f":"LỊCH!J7","v":0},{"$f":"LỊCH!K7","v":0},{"$f":"LỊCH!L7","v":""},{"$f":"LỊCH!M7","v":0},{"$f":"LỊCH!N7","v":0},{"$f":"LỊCH!O7","v":"Vườn Cộng đồng"},{"$f":"LỊCH!P7","v":0},{"$f":"LỊCH!Q7","v":0},{"$f":"LỊCH!R7","v":"Vườn Cộng đồng"},{"$f":"LỊCH!S7","v":0},{"$f":"LỊCH!T7","v":0},{"$f":"LỊCH!U7","v":"Xem phim ở Công viên"}]
[null,null,{"$f":"LỊCH!C8","v":""},{"$f":"LỊCH!D8","v":"00:00:00"},{"$f":"LỊCH!E8","v":"00:00:00"},{"$f":"LỊCH!F8","v":""},{"$f":"LỊCH!G8","v":"00:00:00"},{"$f":"LỊCH!H8","v":"00:00:00"},{"$f":"LỊCH!I8","v":""},{"$f":"LỊCH!J8","v":"00:00:00"},{"$f":"LỊCH!K8","v":"00:00:00"},{"$f":"LỊCH!L8","v":""},{"$f":"LỊCH!M8","v":"00:00:00"},{"$f":"LỊCH!N8","v":"00:00:00"},{"$f":"LỊCH!O8","v":"Hội đồng Thành phố"},{"$f":"LỊCH!P8","v":"00:00:00"},{"$f":"LỊCH!Q8","v":"00:00:00"},{"$f":"LỊCH!R8","v":""},{"$f":"LỊCH!S8","v":"00:00:00"},{"$f":"LỊCH!T8","v":"00:00:00"},{"$f":"LỊCH!U8","v":""}]
[null,null,{"$f":"LỊCH!C9","v":""},{"$f":"LỊCH!D9","v":0},{"$f":"LỊCH!E9","v":0},{"$f":"LỊCH!F9","v":""},{"$f":"LỊCH!G9","v":0},{"$f":"LỊCH!H9","v":0},{"$f":"LỊCH!I9","v":""},{"$f":"LỊCH!J9","v":0},{"$f":"LỊCH!K9","v":0},{"$f":"LỊCH!L9","v":""},{"$f":"LỊCH!M9","v":0},{"$f":"LỊCH!N9","v":0},{"$f":"LỊCH!O9","v":""},{"$f":"LỊCH!P9","v":0},{"$f":"LỊCH!Q9","v":0},{"$f":"LỊCH!R9","v":""},{"$f":"LỊCH!S9","v":0},{"$f":"LỊCH!T9","v":0},{"$f":"LỊCH!U9","v":""}]
[null,null,{"$f":"LỊCH!C10","v":""},{"$f":"LỊCH!D10","v":0},{"$f":"LỊCH!E10","v":0},{"$f":"LỊCH!F10","v":""},{"$f":"LỊCH!G10","v":0},{"$f":"LỊCH!H10","v":0},{"$f":"LỊCH!I10","v":""},{"$f":"LỊCH!J10","v":0},{"$f":"LỊCH!K10","v":0},{"$f":"LỊCH!L10","v":""},{"$f":"LỊCH!M10","v":0},{"$f":"LỊCH!N10","v":0},{"$f":"LỊCH!O10","v":""},{"$f":"LỊCH!P10","v":0},{"$f":"LỊCH!Q10","v":0},{"$f":"LỊCH!R10","v":""},{"$f":"LỊCH!S10","v":0},{"$f":"LỊCH!T10","v":0},{"$f":"LỊCH!U10","v":""}]
[null,null,{"$f":"LỊCH!C11","v":"2016-07-04"},{"$f":"LỊCH!D11","v":0},{"$f":"LỊCH!E11","v":0},{"$f":"LỊCH!F11","v":"2016-07-05"},{"$f":"LỊCH!G11","v":0},{"$f":"LỊCH!H11","v":0},{"$f":"LỊCH!I11","v":"2016-07-06"},{"$f":"LỊCH!J11","v":0},{"$f":"LỊCH!K11","v":0},{"$f":"LỊCH!L11","v":"2016-07-07"},{"$f":"LỊCH!M11","v":0},{"$f":"LỊCH!N11","v":0},{"$f":"LỊCH!O11","v":"2016-07-08"},{"$f":"LỊCH!P11","v":0},{"$f":"LỊCH!Q11","v":0},{"$f":"LỊCH!R11","v":"2016-07-09"},{"$f":"LỊCH!S11","v":0},{"$f":"LỊCH!T11","v":0},{"$f":"LỊCH!U11","v":"2016-07-10"}]
[null,null,{"$f":"LỊCH!C12","v":""},{"$f":"LỊCH!D12","v":0},{"$f":"LỊCH!E12","v":0},{"$f":"LỊCH!F12","v":""},{"$f":"LỊCH!G12","v":0},{"$f":"LỊCH!H12","v":0},{"$f":"LỊCH!I12","v":""},{"$f":"LỊCH!J12","v":0},{"$f":"LỊCH!K12","v":0},{"$f":"LỊCH!L12","v":""},{"$f":"LỊCH!M12","v":0},{"$f":"LỊCH!N12","v":0},{"$f":"LỊCH!O12","v":"Hội đồng Thành phố"},{"$f":"LỊCH!P12","v":0},{"$f":"LỊCH!Q12","v":0},{"$f":"LỊCH!R12","v":""},{"$f":"LỊCH!S12","v":0},{"$f":"LỊCH!T12","v":0},{"$f":"LỊCH!U12","v":""}]
[null,null,{"$f":"LỊCH!C13","v":""},{"$f":"LỊCH!D13","v":0},{"$f":"LỊCH!E13","v":0},{"$f":"LỊCH!F13","v":""},{"$f":"LỊCH!G13","v":0},{"$f":"LỊCH!H13","v":0},{"$f":"LỊCH!I13","v":""},{"$f":"LỊCH!J13","v":0},{"$f":"LỊCH!K13","v":0},{"$f":"LỊCH!L13","v":""},{"$f":"LỊCH!M13","v":0},{"$f":"LỊCH!N13","v":0},{"$f":"LỊCH!O13","v":""},{"$f":"LỊCH!P13","v":0},{"$f":"LỊCH!Q13","v":0},{"$f":"LỊCH!R13","v":""},{"$f":"LỊCH!S13","v":0},{"$f":"LỊCH!T13","v":0},{"$f":"LỊCH!U13","v":""}]
[null,null,{"$f":"LỊCH!C14","v":""},{"$f":"LỊCH!D14","v":0},{"$f":"LỊCH!E14","v":0},{"$f":"LỊCH!F14","v":""},{"$f":"LỊCH!G14","v":0},{"$f":"LỊCH!H14","v":0},{"$f":"LỊCH!I14","v":""},{"$f":"LỊCH!J14","v":0},{"$f":"LỊCH!K14","v":0},{"$f":"LỊCH!L14","v":""},{"$f":"LỊCH!M14","v":0},{"$f":"LỊCH!N14","v":0},{"$f":"LỊCH!O14","v":""},{"$f":"LỊCH!P14","v":0},{"$f":"LỊCH!Q14","v":0},{"$f":"LỊCH!R14","v":""},{"$f":"LỊCH!S14","v":0},{"$f":"LỊCH!T14","v":0},{"$f":"LỊCH!U14","v":""}]
[null,null,{"$f":"LỊCH!C15","v":""},{"$f":"LỊCH!D15","v":0},{"$f":"LỊCH!E15","v":0},{"$f":"LỊCH!F15","v":""},{"$f":"LỊCH!G15","v":0},{"$f":"LỊCH!H15","v":0},{"$f":"LỊCH!I15","v":""},{"$f":"LỊCH!J15","v":0},{"$f":"LỊCH!K15","v":0},{"$f":"LỊCH!L15","v":""},{"$f":"LỊCH!M15","v":0},{"$f":"LỊCH!N15","v":0},{"$f":"LỊCH!O15","v":""},{"$f":"LỊCH!P15","v":0},{"$f":"LỊCH!Q15","v":0},{"$f":"LỊCH!R15","v":""},{"$f":"LỊCH!S15","v":0},{"$f":"LỊCH!T15","v":0},{"$f":"LỊCH!U15","v":""}]
[null,null,{"$f":"LỊCH!C16","v":"2016-07-11"},{"$f":"LỊCH!D16","v":0},{"$f":"LỊCH!E16","v":0},{"$f":"LỊCH!F16","v":"2016-07-12"},{"$f":"LỊCH!G16","v":0},{"$f":"LỊCH!H16","v":0},{"$f":"LỊCH!I16","v":"2016-07-13"},{"$f":"LỊCH!J16","v":0},{"$f":"LỊCH!K16","v":0},{"$f":"LỊCH!L16","v":"2016-07-14"},{"$f":"LỊCH!M16","v":0},{"$f":"LỊCH!N16","v":0},{"$f":"LỊCH!O16","v":"2016-07-15"},{"$f":"LỊCH!P16","v":0},{"$f":"LỊCH!Q16","v":0},{"$f":"LỊCH!R16","v":"2016-07-16"},{"$f":"LỊCH!S16","v":0},{"$f":"LỊCH!T16","v":0},{"$f":"LỊCH!U16","v":"2016-07-17"}]
[null,null,{"$f":"LỊCH!C17","v":"Phòng Thương mại Ăn trưa"},{"$f":"LỊCH!D17","v":0},{"$f":"LỊCH!E17","v":0},{"$f":"LỊCH!F17","v":"Triển lãm Đồ cổ"},{"$f":"LỊCH!G17","v":0},{"$f":"LỊCH!H17","v":0},{"$f":"LỊCH!I17","v":""},{"$f":"LỊCH!J17","v":0},{"$f":"LỊCH!K17","v":0},{"$f":"LỊCH!L17","v":"Hội thảo Cộng đồng"},{"$f":"LỊCH!M17","v":0},{"$f":"LỊCH!N17","v":0},{"$f":"LỊCH!O17","v":"Hội đồng Thành phố"},{"$f":"LỊCH!P17","v":0},{"$f":"LỊCH!Q17","v":0},{"$f":"LỊCH!R17","v":""},{"$f":"LỊCH!S17","v":0},{"$f":"LỊCH!T17","v":0},{"$f":"LỊCH!U17","v":""}]
[null,null,{"$f":"LỊCH!C18","v":""},{"$f":"LỊCH!D18","v":0},{"$f":"LỊCH!E18","v":0},{"$f":"LỊCH!F18","v":""},{"$f":"LỊCH!G18","v":0},{"$f":"LỊCH!H18","v":0},{"$f":"LỊCH!I18","v":""},{"$f":"LỊCH!J18","v":0},{"$f":"LỊCH!K18","v":0},{"$f":"LỊCH!L18","v":""},{"$f":"LỊCH!M18","v":0},{"$f":"LỊCH!N18","v":0},{"$f":"LỊCH!O18","v":""},{"$f":"LỊCH!P18","v":0},{"$f":"LỊCH!Q18","v":0},{"$f":"LỊCH!R18","v":""},{"$f":"LỊCH!S18","v":0},{"$f":"LỊCH!T18","v":0},{"$f":"LỊCH!U18","v":""}]
[null,null,{"$f":"LỊCH!C19","v":""},{"$f":"LỊCH!D19","v":0},{"$f":"LỊCH!E19","v":0},{"$f":"LỊCH!F19","v":""},{"$f":"LỊCH!G19","v":0},{"$f":"LỊCH!H19","v":0},{"$f":"LỊCH!I19","v":""},{"$f":"LỊCH!J19","v":0},{"$f":"LỊCH!K19","v":0},{"$f":"LỊCH!L19","v":""},{"$f":"LỊCH!M19","v":0},{"$f":"LỊCH!N19","v":0},{"$f":"LỊCH!O19","v":""},{"$f":"LỊCH!P19","v":0},{"$f":"LỊCH!Q19","v":0},{"$f":"LỊCH!R19","v":""},{"$f":"LỊCH!S19","v":0},{"$f":"LỊCH!T19","v":0},{"$f":"LỊCH!U19","v":""}]
[null,null,{"$f":"LỊCH!C20","v":""},{"$f":"LỊCH!D20","v":0},{"$f":"LỊCH!E20","v":0},{"$f":"LỊCH!F20","v":""},{"$f":"LỊCH!G20","v":0},{"$f":"LỊCH!H20","v":0},{"$f":"LỊCH!I20","v":""},{"$f":"LỊCH!J20","v":0},{"$f":"LỊCH!K20","v":0},{"$f":"LỊCH!L20","v":""},{"$f":"LỊCH!M20","v":0},{"$f":"LỊCH!N20","v":0},{"$f":"LỊCH!O20","v":""},{"$f":"LỊCH!P20","v":0},{"$f":"LỊCH!Q20","v":0},{"$f":"LỊCH!R20","v":""},{"$f":"LỊCH!S20","v":0},{"$f":"LỊCH!T20","v":0},{"$f":"LỊCH!U20","v":""}]
[null,null,{"$f":"LỊCH!C21","v":"2016-07-18"},{"$f":"LỊCH!D21","v":0},{"$f":"LỊCH!E21","v":0},{"$f":"LỊCH!F21","v":"2016-07-19"},{"$f":"LỊCH!G21","v":0},{"$f":"LỊCH!H21","v":0},{"$f":"LỊCH!I21","v":"2016-07-20"},{"$f":"LỊCH!J21","v":0},{"$f":"LỊCH!K21","v":0},{"$f":"LỊCH!L21","v":"2016-07-21"},{"$f":"LỊCH!M21","v":0},{"$f":"LỊCH!N21","v":0},{"$f":"LỊCH!O21","v":"2016-07-22"},{"$f":"LỊCH!P21","v":0},{"$f":"LỊCH!Q21","v":0},{"$f":"LỊCH!R21","v":"2016-07-23"},{"$f":"LỊCH!S21","v":0},{"$f":"LỊCH!T21","v":0},{"$f":"LỊCH!U21","v":"2016-07-24"}]
[null,null,{"$f":"LỊCH!C22","v":""},{"$f":"LỊCH!D22","v":0},{"$f":"LỊCH!E22","v":0},{"$f":"LỊCH!F22","v":"Hội thảo Lập kế hoạch Chiến lược"},{"$f":"LỊCH!G22","v":0},{"$f":"LỊCH!H22","v":0},{"$f":"LỊCH!I22","v":"Dọn Công viên"},{"$f":"LỊCH!J22","v":0},{"$f":"LỊCH!K22","v":0},{"$f":"LỊCH!L22","v":""},{"$f":"LỊCH!M22","v":0},{"$f":"LỊCH!N22","v":0},{"$f":"LỊCH!O22","v":"Hội đồng Thành phố"},{"$f":"LỊCH!P22","v":0},{"$f":"LỊCH!Q22","v":0},{"$f":"LỊCH!R22","v":""},{"$f":"LỊCH!S22","v":0},{"$f":"LỊCH!T22","v":0},{"$f":"LỊCH!U22","v":""}]
[null,null,{"$f":"LỊCH!C23","v":""},{"$f":"LỊCH!D23","v":0},{"$f":"LỊCH!E23","v":0},{"$f":"LỊCH!F23","v":""},{"$f":"LỊCH!G23","v":0},{"$f":"LỊCH!H23","v":0},{"$f":"LỊCH!I23","v":""},{"$f":"LỊCH!J23","v":0},{"$f":"LỊCH!K23","v":0},{"$f":"LỊCH!L23","v":""},{"$f":"LỊCH!M23","v":0},{"$f":"LỊCH!N23","v":0},{"$f":"LỊCH!O23","v":""},{"$f":"LỊCH!P23","v":0},{"$f":"LỊCH!Q23","v":0},{"$f":"LỊCH!R23","v":""},{"$f":"LỊCH!S23","v":0},{"$f":"LỊCH!T23","v":0},{"$f":"LỊCH!U23","v":""}]
[null,null,{"$f":"LỊCH!C24","v":""},{"$f":"LỊCH!D24","v":0},{"$f":"LỊCH!E24","v":0},{"$f":"LỊCH!F24","v":""},{"$f":"LỊCH!G24","v":0},{"$f":"LỊCH!H24","v":0},{"$f":"LỊCH!I24","v":""},{"$f":"LỊCH!J24","v":0},{"$f":"LỊCH!K24","v":0},{"$f":"LỊCH!L24","v":""},{"$f":"LỊCH!M24","v":0},{"$f":"LỊCH!N24","v":0},{"$f":"LỊCH!O24","v":""},{"$f":"LỊCH!P24","v":0},{"$f":"LỊCH!Q24","v":0},{"$f":"LỊCH!R24","v":""},{"$f":"LỊCH!S24","v":0},{"$f":"LỊCH!T24","v":0},{"$f":"LỊCH!U24","v":""}]
[null,null,{"$f":"LỊCH!C25","v":""},{"$f":"LỊCH!D25","v":0},{"$f":"LỊCH!E25","v":0},{"$f":"LỊCH!F25","v":""},{"$f":"LỊCH!G25","v":0},{"$f":"LỊCH!H25","v":0},{"$f":"LỊCH!I25","v":""},{"$f":"LỊCH!J25","v":0},{"$f":"LỊCH!K25","v":0},{"$f":"LỊCH!L25","v":""},{"$f":"LỊCH!M25","v":0},{"$f":"LỊCH!N25","v":0},{"$f":"LỊCH!O25","v":""},{"$f":"LỊCH!P25","v":0},{"$f":"LỊCH!Q25","v":0},{"$f":"LỊCH!R25","v":""},{"$f":"LỊCH!S25","v":0},{"$f":"LỊCH!T25","v":0},{"$f":"LỊCH!U25","v":""}]
[null,null,{"$f":"LỊCH!C26","v":"2016-07-25"},{"$f":"LỊCH!D26","v":0},{"$f":"LỊCH!E26","v":0},{"$f":"LỊCH!F26","v":"2016-07-26"},{"$f":"LỊCH!G26","v":0},{"$f":"LỊCH!H26","v":0},{"$f":"LỊCH!I26","v":"2016-07-27"},{"$f":"LỊCH!J26","v":0},{"$f":"LỊCH!K26","v":0},{"$f":"LỊCH!L26","v":"2016-07-28"},{"$f":"LỊCH!M26","v":0},{"$f":"LỊCH!N26","v":0},{"$f":"LỊCH!O26","v":"2016-07-29"},{"$f":"LỊCH!P26","v":0},{"$f":"LỊCH!Q26","v":0},{"$f":"LỊCH!R26","v":"2016-07-30"},{"$f":"LỊCH!S26","v":0},{"$f":"LỊCH!T26","v":0},{"$f":"LỊCH!U26","v":"2016-07-31"}]
[null,null,{"$f":"LỊCH!C27","v":""},{"$f":"LỊCH!D27","v":0},{"$f":"LỊCH!E27","v":0},{"$f":"LỊCH!F27","v":"Đi dạo Thành phố"},{"$f":"LỊCH!G27","v":0},{"$f":"LỊCH!H27","v":0},{"$f":"LỊCH!I27","v":""},{"$f":"LỊCH!J27","v":0},{"$f":"LỊCH!K27","v":0},{"$f":"LỊCH!L27","v":""},{"$f":"LỊCH!M27","v":0},{"$f":"LỊCH!N27","v":0},{"$f":"LỊCH!O27","v":"Hội đồng Thành phố"},{"$f":"LỊCH!P27","v":0},{"$f":"LỊCH!Q27","v":0},{"$f":"LỊCH!R27","v":""},{"$f":"LỊCH!S27","v":0},{"$f":"LỊCH!T27","v":0},{"$f":"LỊCH!U27","v":""}]
[null,null,{"$f":"LỊCH!C28","v":""},{"$f":"LỊCH!D28","v":0},{"$f":"LỊCH!E28","v":0},{"$f":"LỊCH!F28","v":"Nhậu"},{"$f":"LỊCH!G28","v":0},{"$f":"LỊCH!H28","v":0},{"$f":"LỊCH!I28","v":""},{"$f":"LỊCH!J28","v":0},{"$f":"LỊCH!K28","v":0},{"$f":"LỊCH!L28","v":""},{"$f":"LỊCH!M28","v":0},{"$f":"LỊCH!N28","v":0},{"$f":"LỊCH!O28","v":""},{"$f":"LỊCH!P28","v":0},{"$f":"LỊCH!Q28","v":0},{"$f":"LỊCH!R28","v":""},{"$f":"LỊCH!S28","v":0},{"$f":"LỊCH!T28","v":0},{"$f":"LỊCH!U28","v":""}]
[null,null,{"$f":"LỊCH!C29","v":""},{"$f":"LỊCH!D29","v":0},{"$f":"LỊCH!E29","v":0},{"$f":"LỊCH!F29","v":""},{"$f":"LỊCH!G29","v":0},{"$f":"LỊCH!H29","v":0},{"$f":"LỊCH!I29","v":""},{"$f":"LỊCH!J29","v":0},{"$f":"LỊCH!K29","v":0},{"$f":"LỊCH!L29","v":""},{"$f":"LỊCH!M29","v":0},{"$f":"LỊCH!N29","v":0},{"$f":"LỊCH!O29","v":""},{"$f":"LỊCH!P29","v":0},{"$f":"LỊCH!Q29","v":0},{"$f":"LỊCH!R29","v":""},{"$f":"LỊCH!S29","v":0},{"$f":"LỊCH!T29","v":0},{"$f":"LỊCH!U29","v":""}]
[null,null,{"$f":"LỊCH!C30","v":""},{"$f":"LỊCH!D30","v":0},{"$f":"LỊCH!E30","v":0},{"$f":"LỊCH!F30","v":""},{"$f":"LỊCH!G30","v":0},{"$f":"LỊCH!H30","v":0},{"$f":"LỊCH!I30","v":""},{"$f":"LỊCH!J30","v":0},{"$f":"LỊCH!K30","v":0},{"$f":"LỊCH!L30","v":""},{"$f":"LỊCH!M30","v":0},{"$f":"LỊCH!N30","v":0},{"$f":"LỊCH!O30","v":""},{"$f":"LỊCH!P30","v":0},{"$f":"LỊCH!Q30","v":0},{"$f":"LỊCH!R30","v":""},{"$f":"LỊCH!S30","v":0},{"$f":"LỊCH!T30","v":0},{"$f":"LỊCH!U30","v":""}]
[null,null,{"$f":"LỊCH!C31","v":"2016-08-01"},{"$f":"LỊCH!D31","v":0},{"$f":"LỊCH!E31","v":0},{"$f":"LỊCH!F31","v":"2016-08-02"},null,null,{"$f":"LỊCH!I31","v":"GHI CHÚ:"}]
[null,null,{"$f":"LỊCH!C32","v":""},{"$f":"LỊCH!D32","v":0},{"$f":"LỊCH!E32","v":0},{"$f":"LỊCH!F32","v":""}]
[null,null,{"$f":"LỊCH!C33","v":""},{"$f":"LỊCH!D33","v":0},{"$f":"LỊCH!E33","v":0},{"$f":"LỊCH!F33","v":""}]
[null,null,{"$f":"LỊCH!C34","v":""},{"$f":"LỊCH!D34","v":0},{"$f":"LỊCH!E34","v":0},{"$f":"LỊCH!F34","v":""}]
[null,null,{"$f":"LỊCH!C35","v":""},{"$f":"LỊCH!D35","v":0},{"$f":"LỊCH!E35","v":0},{"$f":"LỊCH!F35","v":""}]

{"sheet":"QUẢN TRỊ","index":3,"n_rows":14,"n_cols":3,"rows_kept":14,"hidden":true}
[]
[null,"THÁNG","SỐ"]
[null,"THÁNG 1",1]
[null,"THÁNG 2",2]
[null,"THÁNG 3",3]
[null,"THÁNG 4",4]
[null,"THÁNG 5",5]
[null,"THÁNG 6",6]
[null,"THÁNG 7",7]
[null,"THÁNG 8",8]
[null,"THÁNG 9",9]
[null,"THÁNG 10",10]
[null,"THÁNG 11",11]
[null,"THÁNG 12",12]