{"text_format":"3","workbook":"xlsx","n_sheets":3,"sheets":["Dữ liệu Bán hàng","Báo cáo Bán hàng","Hàng tồn kho"],"not_rendered":{"defined_names":10,"pivot_tables":1},"read":"whole","date_system":"1900"}

{"sheet":"Dữ liệu Bán hàng","index":0,"n_rows":13,"n_cols":11,"rows_kept":13,"merged":[[1,1,1,4]]}
[]
[null,"DOANH THU ĐĂNG KÝ TIỀN MẶT HÀNG NGÀY"]
[]
[]
[]
[{"$nulls":10}," "]
[{"$nulls":10}," "]
[null,"NGÀY","THỜI GIAN","SỐ GIAO DỊCH","SỐ SẢN PHẨM/SKU","MÔ TẢ","DOANH THU","THUẾ %","THUẾ BÁN HÀNG","TỔNG CỘNG"]
[null,"2012-02-01","10:30:00",1001,90001,{"$f":"IFERROR(IF(ISNA(VLOOKUP(BảngDữliệuBánhàng[[#This Row],[SỐ SẢN PHẨM/SKU]],BảngHàngtồnkho[],2,0)),\"\",VLOOKUP(BảngDữliệuBánhàng[[#This Row],[SỐ SẢN PHẨM/SKU]],BảngHàngtồnkho[],2,0)),\"No description found\")","v":"Chăn"},{"v":1558960,"d":"1,558,960.00 ₫"},{"v":0.05,"d":"5.00%"},{"$f":"BảngDữliệuBánhàng[[#This Row],[DOANH THU]]*BảngDữliệuBánhàng[[#This Row],[THUẾ %]]","v":{"v":77948,"d":"77,948.00 ₫"}},{"$f":"BảngDữliệuBánhàng[[#This Row],[DOANH THU]]+BảngDữliệuBánhàng[[#This Row],[THUẾ BÁN HÀNG]]","v":{"v":1636908,"d":"1,636,908.00 ₫"}}]
[null,"2012-02-01","10:33:00",1002,90023,{"$f":"IFERROR(IF(ISNA(VLOOKUP(BảngDữliệuBánhàng[[#This Row],[SỐ SẢN PHẨM/SKU]],BảngHàngtồnkho[],2,0)),\"\",VLOOKUP(BảngDữliệuBánhàng[[#This Row],[SỐ SẢN PHẨM/SKU]],BảngHàngtồnkho[],2,0)),\"No description found\")","v":"Khăn bàn, tròn 6'"},{"v":727792,"d":"727,792.00 ₫"},{"v":0.05,"d":"5.00%"},{"$f":"BảngDữliệuBánhàng[[#This Row],[DOANH THU]]*BảngDữliệuBánhàng[[#This Row],[THUẾ %]]","v":{"v":36389.6,"d":"36,389.60 ₫"}},{"$f":"BảngDữliệuBánhàng[[#This Row],[DOANH THU]]+BảngDữliệuBánhàng[[#This Row],[THUẾ BÁN HÀNG]]","v":{"v":764181.6,"d":"764,181.60 ₫"}}]
[null,"2012-02-01","10:45:00",1003,90005,{"$f":"IFERROR(IF(ISNA(VLOOKUP(BảngDữliệuBánhàng[[#This Row],[SỐ SẢN PHẨM/SKU]],BảngHàngtồnkho[],2,0)),\"\",VLOOKUP(BảngDữliệuBánhàng[[#This Row],[SỐ SẢN PHẨM/SKU]],BảngHàngtồnkho[],2,0)),\"No description found\")","v":"Dĩa tròn"},{"v":1163760,"d":"1,163,760.00 ₫"},{"v":0.05,"d":"5.00%"},{"$f":"BảngDữliệuBánhàng[[#This Row],[DOANH THU]]*BảngDữliệuBánhàng[[#This Row],[THUẾ %]]","v":{"v":58188,"d":"58,188.00 ₫"}},{"$f":"BảngDữliệuBánhàng[[#This Row],[DOANH THU]]+BảngDữliệuBánhàng[[#This Row],[THUẾ BÁN HÀNG]]","v":{"v":1221948,"d":"1,221,948.00 ₫"}}]
[null,"2012-02-01","10:55:00",1004,90004,{"$f":"IFERROR(IF(ISNA(VLOOKUP(BảngDữliệuBánhàng[[#This Row],[SỐ SẢN PHẨM/SKU]],BảngHàngtồnkho[],2,0)),\"\",VLOOKUP(BảngDữliệuBánhàng[[#This Row],[SỐ SẢN PHẨM/SKU]],BảngHàngtồnkho[],2,0)),\"No description found\")","v":"Dĩa vuông"},{"v":61360,"d":"61,360.00 ₫"},{"v":0.05,"d":"5.00%"},{"$f":"BảngDữliệuBánhàng[[#This Row],[DOANH THU]]*BảngDữliệuBánhàng[[#This Row],[THUẾ %]]","v":{"v":3068,"d":"3,068.00 ₫"}},{"$f":"BảngDữliệuBánhàng[[#This Row],[DOANH THU]]+BảngDữliệuBánhàng[[#This Row],[THUẾ BÁN HÀNG]]","v":{"v":64428,"d":"64,428.00 ₫"}}]
[null,"2012-02-01","11:45:00",1005,90002,{"$f":"IFERROR(IF(ISNA(VLOOKUP(BảngDữliệuBánhàng[[#This Row],[SỐ SẢN PHẨM/SKU]],BảngHàngtồnkho[],2,0)),\"\",VLOOKUP(BảngDữliệuBánhàng[[#This Row],[SỐ SẢN PHẨM/SKU]],BảngHàngtồnkho[],2,0)),\"No description found\")","v":"Gối"},{"v":311584,"d":"311,584.00 ₫"},{"v":0.05,"d":"5.00%"},{"$f":"BảngDữliệuBánhàng[[#This Row],[DOANH THU]]*BảngDữliệuBánhàng[[#This Row],[THUẾ %]]","v":{"v":15579.2,"d":"15,579.20 ₫"}},{"$f":"BảngDữliệuBánhàng[[#This Row],[DOANH THU]]+BảngDữliệuBánhàng[[#This Row],[THUẾ BÁN HÀNG]]","v":{"v":327163.2,"d":"327,163.20 ₫"}}]

{"sheet":"Báo cáo Bán hàng","index":1,"n_rows":14,"n_cols":7,"rows_kept":14,"merged":[[1,1,1,3]]}
[]
[null,"DOANH THU ĐĂNG KÝ TIỀN MẶT HÀNG NGÀY"]
[]
[]
[]
[]
[]
[null,"SỐ SẢN PHẨM/SKU","MÔ TẢ","NGÀY","Doanh thu","Thuế trên Doanh thu","Tổng cộng"]
[null,90001,"Chăn","2012-02-01",{"v":1558960,"d":"1,558,960.00 ₫"},{"v":77948,"d":"77,948.00 ₫"},{"v":1636908,"d":"1,636,908.00 ₫"}]
[null,90002,"Gối","2012-02-01",{"v":311584,"d":"311,584.00 ₫"},{"v":15579.2,"d":"15,579.20 ₫"},{"v":327163.2,"d":"327,163.20 ₫"}]
[null,90004,"Dĩa vuông","2012-02-01",{"v":61360,"d":"61,360.00 ₫"},{"v":3068,"d":"3,068.00 ₫"},{"v":64428,"d":"64,428.00 ₫"}]
[null,90005,"Dĩa tròn","2012-02-01",{"v":1163760,"d":"1,163,760.00 ₫"},{"v":58188,"d":"58,188.00 ₫"},{"v":1221948,"d":"1,221,948.00 ₫"}]
[null,90023,"Khăn bàn, tròn 6'","2012-02-01",{"v":727792,"d":"727,792.00 ₫"},{"v":36389.6,"d":"36,389.60 ₫"},{"v":764181.6,"d":"764,181.60 ₫"}]
[null,"Tổng Cộng",null,null,{"v":3823456,"d":"3,823,456.00 ₫"},{"v":191172.80000000002,"d":"191,172.80 ₫"},{"v":4014628.8000000003,"d":"4,014,628.80 ₫"}]

{"sheet":"Hàng tồn kho","index":2,"n_rows":31,"n_cols":3,"rows_kept":31,"merged":[[1,1,1,2]]}
[]
[null,"DOANH THU ĐĂNG KÝ TIỀN MẶT HÀNG NGÀY"]
[]
[]
[]
[]
[]
[null,"SỐ SẢN PHẨM/SKU","MÔ TẢ"]
[null,90001,"Chăn"]
[null,90002,"Gối"]
[null,90003,"Khăn trải giường"]
[null,90004,"Dĩa vuông"]
[null,90005,"Dĩa tròn"]
[null,90006,"Chén, lớn"]
[null,90007,"Chén, nhỏ"]
[null,90008,"Dĩa tròn, nhỏ"]
[null,90009,"Nĩa, nhỏ"]
[null,90010,"Nĩa, lớn"]
[null,90011,"Muỗng, nhỏ"]
[null,90012,"Muỗng, lớn"]
[null,90013,"Dao dùng bơ, nhỏ"]
[null,90014,"Dao dùng bơ, lớn"]
[null,90015,"Khăn bàn, 10x5"]
[null,90016,"Khăn bàn, 8x5"]
[null,90017,"Khăn bàn, 8x8"]
[null,90018,"Khăn bàn, 6x6"]
[null,90019,"Khăn bàn, 6x4"]
[null,90020,"Khăn bàn, 4x4"]
[null,90021,"Khăn bàn, tròn 10'"]
[null,90022,"Khăn bàn, tròn 8'"]
[null,90023,"Khăn bàn, tròn 6'"]