{"text_format":"3","workbook":"xlsx","n_sheets":5,"sheets":["Tóm tắt từ đầu năm đến nay","Q1","Q2","Q3","Q4"],"not_rendered":{"defined_names":12},"read":"whole","date_system":"1900"}

{"sheet":"Tóm tắt từ đầu năm đến nay","index":0,"n_rows":36,"n_cols":12,"rows_kept":36,"merged":[[3,0,3,6]]}
["Tên công ty"]
["Bảng theo dõi chấm công, Tóm tắt từ đầu năm đến nay"]
["Ngày"]
[{"$f":"Tên_công_ty","v":"Tên công ty"},{"$nulls":6},"BÍ MẬT"]
["Họ","Tên","Nghỉ phép","Nghỉ vì lý do cá nhân","Nghỉ ốm","Số an sinh xã hội","Vị trí","Giám sát viên","Ngày tuyển dụng","Chú thích","Số ngày nghỉ phép \nmỗi năm","Số ngày nghỉ phép \ncòn lại"]
["Họ","Tên",{"$f":"SUM('Q1:Q4'!C6)","v":3},{"$f":"SUM('Q1:Q4'!D6)","v":0},{"$f":"SUM('Q1:Q4'!E6)","v":1},"xxx-xx-xxxx","Người quản lý","Tên",null,null,10,{"$f":"K6-C6","v":7}]
[null,null,{"$f":"SUM('Q1:Q4'!C7)","v":0},{"$f":"SUM('Q1:Q4'!D7)","v":0},{"$f":"SUM('Q1:Q4'!E7)","v":0},{"$nulls":6},{"$f":"K7-C7","v":0}]
[null,null,{"$f":"SUM('Q1:Q4'!C8)","v":0},{"$f":"SUM('Q1:Q4'!D8)","v":0},{"$f":"SUM('Q1:Q4'!E8)","v":0},{"$nulls":6},0]
[null,null,{"$f":"SUM('Q1:Q4'!C9)","v":0},{"$f":"SUM('Q1:Q4'!D9)","v":0},{"$f":"SUM('Q1:Q4'!E9)","v":0},{"$nulls":6},0]
[null,null,{"$f":"SUM('Q1:Q4'!C10)","v":0},{"$f":"SUM('Q1:Q4'!D10)","v":0},{"$f":"SUM('Q1:Q4'!E10)","v":0},{"$nulls":6},0]
[null,null,{"$f":"SUM('Q1:Q4'!C11)","v":0},{"$f":"SUM('Q1:Q4'!D11)","v":0},{"$f":"SUM('Q1:Q4'!E11)","v":0},{"$nulls":6},0]
[null,null,{"$f":"SUM('Q1:Q4'!C12)","v":0},{"$f":"SUM('Q1:Q4'!D12)","v":0},{"$f":"SUM('Q1:Q4'!E12)","v":0},{"$nulls":6},0]
[null,null,{"$f":"SUM('Q1:Q4'!C13)","v":0},{"$f":"SUM('Q1:Q4'!D13)","v":0},{"$f":"SUM('Q1:Q4'!E13)","v":0},{"$nulls":6},0]
[null,null,{"$f":"SUM('Q1:Q4'!C14)","v":0},{"$f":"SUM('Q1:Q4'!D14)","v":0},{"$f":"SUM('Q1:Q4'!E14)","v":0},{"$nulls":6},0]
[null,null,{"$f":"SUM('Q1:Q4'!C15)","v":0},{"$f":"SUM('Q1:Q4'!D15)","v":0},{"$f":"SUM('Q1:Q4'!E15)","v":0},{"$nulls":6},0]
[null,null,{"$f":"SUM('Q1:Q4'!C16)","v":0},{"$f":"SUM('Q1:Q4'!D16)","v":0},{"$f":"SUM('Q1:Q4'!E16)","v":0},{"$nulls":6},0]
[null,null,{"$f":"SUM('Q1:Q4'!C17)","v":0},{"$f":"SUM('Q1:Q4'!D17)","v":0},{"$f":"SUM('Q1:Q4'!E17)","v":0},{"$nulls":6},0]
[null,null,{"$f":"SUM('Q1:Q4'!C18)","v":0},{"$f":"SUM('Q1:Q4'!D18)","v":0},{"$f":"SUM('Q1:Q4'!E18)","v":0},{"$nulls":6},0]
[null,null,{"$f":"SUM('Q1:Q4'!C19)","v":0},{"$f":"SUM('Q1:Q4'!D19)","v":0},{"$f":"SUM('Q1:Q4'!E19)","v":0},{"$nulls":6},0]
[null,null,{"$f":"SUM('Q1:Q4'!C20)","v":0},{"$f":"SUM('Q1:Q4'!D20)","v":0},{"$f":"SUM('Q1:Q4'!E20)","v":0},{"$nulls":6},0]
[null,null,{"$f":"SUM('Q1:Q4'!C21)","v":0},{"$f":"SUM('Q1:Q4'!D21)","v":0},{"$f":"SUM('Q1:Q4'!E21)","v":0},{"$nulls":6},0]
[null,null,{"$f":"SUM('Q1:Q4'!C22)","v":0},{"$f":"SUM('Q1:Q4'!D22)","v":0},{"$f":"SUM('Q1:Q4'!E22)","v":0},{"$nulls":6},0]
[null,null,{"$f":"SUM('Q1:Q4'!C23)","v":0},{"$f":"SUM('Q1:Q4'!D23)","v":0},{"$f":"SUM('Q1:Q4'!E23)","v":0},{"$nulls":6},0]
[null,null,{"$f":"SUM('Q1:Q4'!C24)","v":0},{"$f":"SUM('Q1:Q4'!D24)","v":0},{"$f":"SUM('Q1:Q4'!E24)","v":0},{"$nulls":6},0]
[null,null,{"$f":"SUM('Q1:Q4'!C25)","v":0},{"$f":"SUM('Q1:Q4'!D25)","v":0},{"$f":"SUM('Q1:Q4'!E25)","v":0},{"$nulls":6},0]
[null,null,{"$f":"SUM('Q1:Q4'!C26)","v":0},{"$f":"SUM('Q1:Q4'!D26)","v":0},{"$f":"SUM('Q1:Q4'!E26)","v":0},{"$nulls":6},0]
[null,null,{"$f":"SUM('Q1:Q4'!C27)","v":0},{"$f":"SUM('Q1:Q4'!D27)","v":0},{"$f":"SUM('Q1:Q4'!E27)","v":0},{"$nulls":6},0]
[null,null,{"$f":"SUM('Q1:Q4'!C28)","v":0},{"$f":"SUM('Q1:Q4'!D28)","v":0},{"$f":"SUM('Q1:Q4'!E28)","v":0},{"$nulls":6},0]
[null,null,{"$f":"SUM('Q1:Q4'!C29)","v":0},{"$f":"SUM('Q1:Q4'!D29)","v":0},{"$f":"SUM('Q1:Q4'!E29)","v":0},{"$nulls":6},0]
[null,null,{"$f":"SUM('Q1:Q4'!C30)","v":0},{"$f":"SUM('Q1:Q4'!D30)","v":0},{"$f":"SUM('Q1:Q4'!E30)","v":0},{"$nulls":6},0]
[null,null,{"$f":"SUM('Q1:Q4'!C31)","v":0},{"$f":"SUM('Q1:Q4'!D31)","v":0},{"$f":"SUM('Q1:Q4'!E31)","v":0},{"$nulls":6},0]
[null,null,{"$f":"SUM('Q1:Q4'!C32)","v":0},{"$f":"SUM('Q1:Q4'!D32)","v":0},{"$f":"SUM('Q1:Q4'!E32)","v":0},{"$nulls":6},0]
[null,null,{"$f":"SUM('Q1:Q4'!C33)","v":0},{"$f":"SUM('Q1:Q4'!D33)","v":0},{"$f":"SUM('Q1:Q4'!E33)","v":0},{"$nulls":6},0]
[null,null,{"$f":"SUM('Q1:Q4'!C34)","v":0},{"$f":"SUM('Q1:Q4'!D34)","v":0},{"$f":"SUM('Q1:Q4'!E34)","v":0},{"$nulls":6},0]
[null,null,{"$f":"SUM('Q1:Q4'!C35)","v":0},{"$f":"SUM('Q1:Q4'!D35)","v":0},{"$f":"SUM('Q1:Q4'!E35)","v":0},{"$nulls":6},0]
[null,null,{"$f":"SUM('Q1:Q4'!C36)","v":0},{"$f":"SUM('Q1:Q4'!D36)","v":0},{"$f":"SUM('Q1:Q4'!E36)","v":0},{"$nulls":6},0]

{"sheet":"Q1","index":1,"n_rows":36,"n_cols":95,"rows_kept":36,"merged":[[3,0,3,6]]}
[{"$f":"Tên_công_ty","v":"Tên công ty"}]
["Theo dõi chấm công, Quý 1"]
["Ngày"]
[{"$f":"Tên_công_ty","v":"Tên công ty"},{"$nulls":6},"BÍ MẬT"]
["Họ","Tên","Nghỉ phép","Nghỉ vì lý do cá nhân","Nghỉ ốm","01/01","02/01","03/01","04/01","05/01","06/01","07/01","08/01","09/01","10/01","11/01","12/01","13/01","14/01","15/01","16/01","17/01","18/01","19/01","20/01","21/01","22/01","23/01","24/01","25/01","26/01","27/01","28/01","29/01","30/01","31/01","01/02","02/02","03/02","04/02","05/02","06/02","07/02","08/02","09/02","10/02","11/02","12/02","13/02","14/02","15/02","16/02","17/02","18/02","19/02","20/02","21/02","22/02","23/02","24/02","25/02","26/02","27/02","28/02","01/03","02/03","03/03","04/03","05/03","06/03","07/03","08/03","09/03","10/03","11/03","12/03","13/03","14/03","15/03","16/03","17/03","18/03","19/03","20/03","21/03","22/03","23/03","24/03","25/03","26/03","27/03","28/03","29/03","30/03","31/03"]
[{"$f":"IF(ISBLANK('Tóm tắt từ đầu năm đến nay'!A6),\"\",'Tóm tắt từ đầu năm đến nay'!A6)","v":"Họ"},{"$f":"IF(ISBLANK('Tóm tắt từ đầu năm đến nay'!B6),\"\",'Tóm tắt từ đầu năm đến nay'!B6)","v":"Tên"},{"$f":"COUNTIF($F6:$CQ6, \"Nghỉ\")","v":3},{"$f":"COUNTIF($F6:$CQ6, \"Nghỉ v\")","v":0},{"$f":"COUNTIF($F6:$CQ6, \"Nghỉ ố\")","v":1},"nghỉ","nghỉ","nghỉ",{"$nulls":4},"nghỉ ố"]
[{"$f":"IF(ISBLANK('Tóm tắt từ đầu năm đến nay'!A7),\"\",'Tóm tắt từ đầu năm đến nay'!A7)","v":""},{"$f":"IF(ISBLANK('Tóm tắt từ đầu năm đến nay'!B7),\"\",'Tóm tắt từ đầu năm đến nay'!B7)","v":""},0,0,0]
[{"$f":"IF(ISBLANK('Tóm tắt từ đầu năm đến nay'!A8),\"\",'Tóm tắt từ đầu năm đến nay'!A8)","v":""},{"$f":"IF(ISBLANK('Tóm tắt từ đầu năm đến nay'!B8),\"\",'Tóm tắt từ đầu năm đến nay'!B8)","v":""},0,0,0]
[{"$f":"IF(ISBLANK('Tóm tắt từ đầu năm đến nay'!A9),\"\",'Tóm tắt từ đầu năm đến nay'!A9)","v":""},{"$f":"IF(ISBLANK('Tóm tắt từ đầu năm đến nay'!B9),\"\",'Tóm tắt từ đầu năm đến nay'!B9)","v":""},0,0,0]
[{"$f":"IF(ISBLANK('Tóm tắt từ đầu năm đến nay'!A10),\"\",'Tóm tắt từ đầu năm đến nay'!A10)","v":""},{"$f":"IF(ISBLANK('Tóm tắt từ đầu năm đến nay'!B10),\"\",'Tóm tắt từ đầu năm đến nay'!B10)","v":""},0,0,0]
[{"$f":"IF(ISBLANK('Tóm tắt từ đầu năm đến nay'!A11),\"\",'Tóm tắt từ đầu năm đến nay'!A11)","v":""},{"$f":"IF(ISBLANK('Tóm tắt từ đầu năm đến nay'!B11),\"\",'Tóm tắt từ đầu năm đến nay'!B11)","v":""},0,0,0]
[{"$f":"IF(ISBLANK('Tóm tắt từ đầu năm đến nay'!A12),\"\",'Tóm tắt từ đầu năm đến nay'!A12)","v":""},{"$f":"IF(ISBLANK('Tóm tắt từ đầu năm đến nay'!B12),\"\",'Tóm tắt từ đầu năm đến nay'!B12)","v":""},0,0,0]
[{"$f":"IF(ISBLANK('Tóm tắt từ đầu năm đến nay'!A13),\"\",'Tóm tắt từ đầu năm đến nay'!A13)","v":""},{"$f":"IF(ISBLANK('Tóm tắt từ đầu năm đến nay'!B13),\"\",'Tóm tắt từ đầu năm đến nay'!B13)","v":""},0,0,0]
[{"$f":"IF(ISBLANK('Tóm tắt từ đầu năm đến nay'!A14),\"\",'Tóm tắt từ đầu năm đến nay'!A14)","v":""},{"$f":"IF(ISBLANK('Tóm tắt từ đầu năm đến nay'!B14),\"\",'Tóm tắt từ đầu năm đến nay'!B14)","v":""},0,0,0]
[{"$f":"IF(ISBLANK('Tóm tắt từ đầu năm đến nay'!A15),\"\",'Tóm tắt từ đầu năm đến nay'!A15)","v":""},{"$f":"IF(ISBLANK('Tóm tắt từ đầu năm đến nay'!B15),\"\",'Tóm tắt từ đầu năm đến nay'!B15)","v":""},0,0,0]
[{"$f":"IF(ISBLANK('Tóm tắt từ đầu năm đến nay'!A16),\"\",'Tóm tắt từ đầu năm đến nay'!A16)","v":""},{"$f":"IF(ISBLANK('Tóm tắt từ đầu năm đến nay'!B16),\"\",'Tóm tắt từ đầu năm đến nay'!B16)","v":""},0,0,0]
[{"$f":"IF(ISBLANK('Tóm tắt từ đầu năm đến nay'!A17),\"\",'Tóm tắt từ đầu năm đến nay'!A17)","v":""},{"$f":"IF(ISBLANK('Tóm tắt từ đầu năm đến nay'!B17),\"\",'Tóm tắt từ đầu năm đến nay'!B17)","v":""},0,0,0]
[{"$f":"IF(ISBLANK('Tóm tắt từ đầu năm đến nay'!A18),\"\",'Tóm tắt từ đầu năm đến nay'!A18)","v":""},{"$f":"IF(ISBLANK('Tóm tắt từ đầu năm đến nay'!B18),\"\",'Tóm tắt từ đầu năm đến nay'!B18)","v":""},0,0,0]
[{"$f":"IF(ISBLANK('Tóm tắt từ đầu năm đến nay'!A19),\"\",'Tóm tắt từ đầu năm đến nay'!A19)","v":""},{"$f":"IF(ISBLANK('Tóm tắt từ đầu năm đến nay'!B19),\"\",'Tóm tắt từ đầu năm đến nay'!B19)","v":""},0,0,0]
[{"$f":"IF(ISBLANK('Tóm tắt từ đầu năm đến nay'!A20),\"\",'Tóm tắt từ đầu năm đến nay'!A20)","v":""},{"$f":"IF(ISBLANK('Tóm tắt từ đầu năm đến nay'!B20),\"\",'Tóm tắt từ đầu năm đến nay'!B20)","v":""},0,0,0]
[{"$f":"IF(ISBLANK('Tóm tắt từ đầu năm đến nay'!A21),\"\",'Tóm tắt từ đầu năm đến nay'!A21)","v":""},{"$f":"IF(ISBLANK('Tóm tắt từ đầu năm đến nay'!B21),\"\",'Tóm tắt từ đầu năm đến nay'!B21)","v":""},0,0,0]
[{"$f":"IF(ISBLANK('Tóm tắt từ đầu năm đến nay'!A22),\"\",'Tóm tắt từ đầu năm đến nay'!A22)","v":""},{"$f":"IF(ISBLANK('Tóm tắt từ đầu năm đến nay'!B22),\"\",'Tóm tắt từ đầu năm đến nay'!B22)","v":""},0,0,0]
[{"$f":"IF(ISBLANK('Tóm tắt từ đầu năm đến nay'!A23),\"\",'Tóm tắt từ đầu năm đến nay'!A23)","v":""},{"$f":"IF(ISBLANK('Tóm tắt từ đầu năm đến nay'!B23),\"\",'Tóm tắt từ đầu năm đến nay'!B23)","v":""},0,0,0]
[{"$f":"IF(ISBLANK('Tóm tắt từ đầu năm đến nay'!A24),\"\",'Tóm tắt từ đầu năm đến nay'!A24)","v":""},{"$f":"IF(ISBLANK('Tóm tắt từ đầu năm đến nay'!B24),\"\",'Tóm tắt từ đầu năm đến nay'!B24)","v":""},0,0,0]
[{"$f":"IF(ISBLANK('Tóm tắt từ đầu năm đến nay'!A25),\"\",'Tóm tắt từ đầu năm đến nay'!A25)","v":""},{"$f":"IF(ISBLANK('Tóm tắt từ đầu năm đến nay'!B25),\"\",'Tóm tắt từ đầu năm đến nay'!B25)","v":""},0,0,0]
[{"$f":"IF(ISBLANK('Tóm tắt từ đầu năm đến nay'!A26),\"\",'Tóm tắt từ đầu năm đến nay'!A26)","v":""},{"$f":"IF(ISBLANK('Tóm tắt từ đầu năm đến nay'!B26),\"\",'Tóm tắt từ đầu năm đến nay'!B26)","v":""},0,0,0]
[{"$f":"IF(ISBLANK('Tóm tắt từ đầu năm đến nay'!A27),\"\",'Tóm tắt từ đầu năm đến nay'!A27)","v":""},{"$f":"IF(ISBLANK('Tóm tắt từ đầu năm đến nay'!B27),\"\",'Tóm tắt từ đầu năm đến nay'!B27)","v":""},0,0,0]
[{"$f":"IF(ISBLANK('Tóm tắt từ đầu năm đến nay'!A28),\"\",'Tóm tắt từ đầu năm đến nay'!A28)","v":""},{"$f":"IF(ISBLANK('Tóm tắt từ đầu năm đến nay'!B28),\"\",'Tóm tắt từ đầu năm đến nay'!B28)","v":""},0,0,0]
[{"$f":"IF(ISBLANK('Tóm tắt từ đầu năm đến nay'!A29),\"\",'Tóm tắt từ đầu năm đến nay'!A29)","v":""},{"$f":"IF(ISBLANK('Tóm tắt từ đầu năm đến nay'!B29),\"\",'Tóm tắt từ đầu năm đến nay'!B29)","v":""},0,0,0]
[{"$f":"IF(ISBLANK('Tóm tắt từ đầu năm đến nay'!A30),\"\",'Tóm tắt từ đầu năm đến nay'!A30)","v":""},{"$f":"IF(ISBLANK('Tóm tắt từ đầu năm đến nay'!B30),\"\",'Tóm tắt từ đầu năm đến nay'!B30)","v":""},0,0,0]
[{"$f":"IF(ISBLANK('Tóm tắt từ đầu năm đến nay'!A31),\"\",'Tóm tắt từ đầu năm đến nay'!A31)","v":""},{"$f":"IF(ISBLANK('Tóm tắt từ đầu năm đến nay'!B31),\"\",'Tóm tắt từ đầu năm đến nay'!B31)","v":""},0,0,0]
[{"$f":"IF(ISBLANK('Tóm tắt từ đầu năm đến nay'!A32),\"\",'Tóm tắt từ đầu năm đến nay'!A32)","v":""},{"$f":"IF(ISBLANK('Tóm tắt từ đầu năm đến nay'!B32),\"\",'Tóm tắt từ đầu năm đến nay'!B32)","v":""},0,0,0]
[{"$f":"IF(ISBLANK('Tóm tắt từ đầu năm đến nay'!A33),\"\",'Tóm tắt từ đầu năm đến nay'!A33)","v":""},{"$f":"IF(ISBLANK('Tóm tắt từ đầu năm đến nay'!B33),\"\",'Tóm tắt từ đầu năm đến nay'!B33)","v":""},0,0,0]
[{"$f":"IF(ISBLANK('Tóm tắt từ đầu năm đến nay'!A34),\"\",'Tóm tắt từ đầu năm đến nay'!A34)","v":""},{"$f":"IF(ISBLANK('Tóm tắt từ đầu năm đến nay'!B34),\"\",'Tóm tắt từ đầu năm đến nay'!B34)","v":""},0,0,0]
[{"$f":"IF(ISBLANK('Tóm tắt từ đầu năm đến nay'!A35),\"\",'Tóm tắt từ đầu năm đến nay'!A35)","v":""},{"$f":"IF(ISBLANK('Tóm tắt từ đầu năm đến nay'!B35),\"\",'Tóm tắt từ đầu năm đến nay'!B35)","v":""},0,0,0]
[{"$f":"IF(ISBLANK('Tóm tắt từ đầu năm đến nay'!A36),\"\",'Tóm tắt từ đầu năm đến nay'!A36)","v":""},{"$f":"IF(ISBLANK('Tóm tắt từ đầu năm đến nay'!B36),\"\",'Tóm tắt từ đầu năm đến nay'!B36)","v":""},0,0,0]

{"sheet":"Q2","index":2,"n_rows":36,"n_cols":96,"rows_kept":36,"merged":[[3,0,3,6]]}
[{"$f":"Tên_công_ty","v":"Tên công ty"}]
["Theo dõi chấm công, Quý 2"]
["Ngày"]
[{"$f":"Tên_công_ty","v":"Tên công ty"},{"$nulls":6},"BÍ MẬT"]
["Họ","Tên","Nghỉ phép","Nghỉ vì lý do cá nhân","Nghỉ ốm","01/04","02/04","03/04","04/04","05/04","06/04","07/04","08/04","09/04","10/04","11/04","12/04","13/04","14/04","15/04","16/04","17/04","18/04","19/04","20/04","21/04","22/04","23/04","24/04","25/04","26/04","27/04","28/04","29/04","30/04","01/05","02/05","03/05","04/05","05/05","06/05","07/05","08/05","09/05","10/05","11/05","12/05","13/05","14/05","15/05","16/05","17/05","18/05","19/05","20/05","21/05","22/05","23/05","24/05","25/05","26/05","27/05","28/05","29/05","30/05","31/05","01/06","02/06","03/06","04/06","05/06","06/06","07/06","08/06","09/06","10/06","11/06","12/06","13/06","14/06","15/06","16/06","17/06","18/06","19/06","20/06","21/06","22/06","23/06","24/06","25/06","26/06","27/06","28/06","29/06","30/06"]
[{"$f":"IF(ISBLANK('Tóm tắt từ đầu năm đến nay'!A6),\"\",'Tóm tắt từ đầu năm đến nay'!A6)","v":"Họ"},{"$f":"IF(ISBLANK('Tóm tắt từ đầu năm đến nay'!B6),\"\",'Tóm tắt từ đầu năm đến nay'!B6)","v":"Tên"},{"$f":"COUNTIF($F6:$CR6, \"Nghỉ\")","v":0},{"$f":"COUNTIF($F6:$CR6, \"Nghỉ v\")","v":0},{"$f":"COUNTIF($F6:$CR6, \"Nghỉ ố\")","v":0}]
[{"$f":"IF(ISBLANK('Tóm tắt từ đầu năm đến nay'!A7),\"\",'Tóm tắt từ đầu năm đến nay'!A7)","v":""},{"$f":"IF(ISBLANK('Tóm tắt từ đầu năm đến nay'!B7),\"\",'Tóm tắt từ đầu năm đến nay'!B7)","v":""},0,0,0]
[{"$f":"IF(ISBLANK('Tóm tắt từ đầu năm đến nay'!A8),\"\",'Tóm tắt từ đầu năm đến nay'!A8)","v":""},{"$f":"IF(ISBLANK('Tóm tắt từ đầu năm đến nay'!B8),\"\",'Tóm tắt từ đầu năm đến nay'!B8)","v":""},0,0,0]
[{"$f":"IF(ISBLANK('Tóm tắt từ đầu năm đến nay'!A9),\"\",'Tóm tắt từ đầu năm đến nay'!A9)","v":""},{"$f":"IF(ISBLANK('Tóm tắt từ đầu năm đến nay'!B9),\"\",'Tóm tắt từ đầu năm đến nay'!B9)","v":""},0,0,0]
[{"$f":"IF(ISBLANK('Tóm tắt từ đầu năm đến nay'!A10),\"\",'Tóm tắt từ đầu năm đến nay'!A10)","v":""},{"$f":"IF(ISBLANK('Tóm tắt từ đầu năm đến nay'!B10),\"\",'Tóm tắt từ đầu năm đến nay'!B10)","v":""},0,0,0]
[{"$f":"IF(ISBLANK('Tóm tắt từ đầu năm đến nay'!A11),\"\",'Tóm tắt từ đầu năm đến nay'!A11)","v":""},{"$f":"IF(ISBLANK('Tóm tắt từ đầu năm đến nay'!B11),\"\",'Tóm tắt từ đầu năm đến nay'!B11)","v":""},0,0,0]
[{"$f":"IF(ISBLANK('Tóm tắt từ đầu năm đến nay'!A12),\"\",'Tóm tắt từ đầu năm đến nay'!A12)","v":""},{"$f":"IF(ISBLANK('Tóm tắt từ đầu năm đến nay'!B12),\"\",'Tóm tắt từ đầu năm đến nay'!B12)","v":""},0,0,0]
[{"$f":"IF(ISBLANK('Tóm tắt từ đầu năm đến nay'!A13),\"\",'Tóm tắt từ đầu năm đến nay'!A13)","v":""},{"$f":"IF(ISBLANK('Tóm tắt từ đầu năm đến nay'!B13),\"\",'Tóm tắt từ đầu năm đến nay'!B13)","v":""},0,0,0]
[{"$f":"IF(ISBLANK('Tóm tắt từ đầu năm đến nay'!A14),\"\",'Tóm tắt từ đầu năm đến nay'!A14)","v":""},{"$f":"IF(ISBLANK('Tóm tắt từ đầu năm đến nay'!B14),\"\",'Tóm tắt từ đầu năm đến nay'!B14)","v":""},0,0,0]
[{"$f":"IF(ISBLANK('Tóm tắt từ đầu năm đến nay'!A15),\"\",'Tóm tắt từ đầu năm đến nay'!A15)","v":""},{"$f":"IF(ISBLANK('Tóm tắt từ đầu năm đến nay'!B15),\"\",'Tóm tắt từ đầu năm đến nay'!B15)","v":""},0,0,0]
[{"$f":"IF(ISBLANK('Tóm tắt từ đầu năm đến nay'!A16),\"\",'Tóm tắt từ đầu năm đến nay'!A16)","v":""},{"$f":"IF(ISBLANK('Tóm tắt từ đầu năm đến nay'!B16),\"\",'Tóm tắt từ đầu năm đến nay'!B16)","v":""},0,0,0]
[{"$f":"IF(ISBLANK('Tóm tắt từ đầu năm đến nay'!A17),\"\",'Tóm tắt từ đầu năm đến nay'!A17)","v":""},{"$f":"IF(ISBLANK('Tóm tắt từ đầu năm đến nay'!B17),\"\",'Tóm tắt từ đầu năm đến nay'!B17)","v":""},0,0,0]
[{"$f":"IF(ISBLANK('Tóm tắt từ đầu năm đến nay'!A18),\"\",'Tóm tắt từ đầu năm đến nay'!A18)","v":""},{"$f":"IF(ISBLANK('Tóm tắt từ đầu năm đến nay'!B18),\"\",'Tóm tắt từ đầu năm đến nay'!B18)","v":""},0,0,0]
[{"$f":"IF(ISBLANK('Tóm tắt từ đầu năm đến nay'!A19),\"\",'Tóm tắt từ đầu năm đến nay'!A19)","v":""},{"$f":"IF(ISBLANK('Tóm tắt từ đầu năm đến nay'!B19),\"\",'Tóm tắt từ đầu năm đến nay'!B19)","v":""},0,0,0]
[{"$f":"IF(ISBLANK('Tóm tắt từ đầu năm đến nay'!A20),\"\",'Tóm tắt từ đầu năm đến nay'!A20)","v":""},{"$f":"IF(ISBLANK('Tóm tắt từ đầu năm đến nay'!B20),\"\",'Tóm tắt từ đầu năm đến nay'!B20)","v":""},0,0,0]
[{"$f":"IF(ISBLANK('Tóm tắt từ đầu năm đến nay'!A21),\"\",'Tóm tắt từ đầu năm đến nay'!A21)","v":""},{"$f":"IF(ISBLANK('Tóm tắt từ đầu năm đến nay'!B21),\"\",'Tóm tắt từ đầu năm đến nay'!B21)","v":""},0,0,0]
[{"$f":"IF(ISBLANK('Tóm tắt từ đầu năm đến nay'!A22),\"\",'Tóm tắt từ đầu năm đến nay'!A22)","v":""},{"$f":"IF(ISBLANK('Tóm tắt từ đầu năm đến nay'!B22),\"\",'Tóm tắt từ đầu năm đến nay'!B22)","v":""},0,0,0]
[{"$f":"IF(ISBLANK('Tóm tắt từ đầu năm đến nay'!A23),\"\",'Tóm tắt từ đầu năm đến nay'!A23)","v":""},{"$f":"IF(ISBLANK('Tóm tắt từ đầu năm đến nay'!B23),\"\",'Tóm tắt từ đầu năm đến nay'!B23)","v":""},0,0,0]
[{"$f":"IF(ISBLANK('Tóm tắt từ đầu năm đến nay'!A24),\"\",'Tóm tắt từ đầu năm đến nay'!A24)","v":""},{"$f":"IF(ISBLANK('Tóm tắt từ đầu năm đến nay'!B24),\"\",'Tóm tắt từ đầu năm đến nay'!B24)","v":""},0,0,0]
[{"$f":"IF(ISBLANK('Tóm tắt từ đầu năm đến nay'!A25),\"\",'Tóm tắt từ đầu năm đến nay'!A25)","v":""},{"$f":"IF(ISBLANK('Tóm tắt từ đầu năm đến nay'!B25),\"\",'Tóm tắt từ đầu năm đến nay'!B25)","v":""},0,0,0]
[{"$f":"IF(ISBLANK('Tóm tắt từ đầu năm đến nay'!A26),\"\",'Tóm tắt từ đầu năm đến nay'!A26)","v":""},{"$f":"IF(ISBLANK('Tóm tắt từ đầu năm đến nay'!B26),\"\",'Tóm tắt từ đầu năm đến nay'!B26)","v":""},0,0,0]
[{"$f":"IF(ISBLANK('Tóm tắt từ đầu năm đến nay'!A27),\"\",'Tóm tắt từ đầu năm đến nay'!A27)","v":""},{"$f":"IF(ISBLANK('Tóm tắt từ đầu năm đến nay'!B27),\"\",'Tóm tắt từ đầu năm đến nay'!B27)","v":""},0,0,0]
[{"$f":"IF(ISBLANK('Tóm tắt từ đầu năm đến nay'!A28),\"\",'Tóm tắt từ đầu năm đến nay'!A28)","v":""},{"$f":"IF(ISBLANK('Tóm tắt từ đầu năm đến nay'!B28),\"\",'Tóm tắt từ đầu năm đến nay'!B28)","v":""},0,0,0]
[{"$f":"IF(ISBLANK('Tóm tắt từ đầu năm đến nay'!A29),\"\",'Tóm tắt từ đầu năm đến nay'!A29)","v":""},{"$f":"IF(ISBLANK('Tóm tắt từ đầu năm đến nay'!B29),\"\",'Tóm tắt từ đầu năm đến nay'!B29)","v":""},0,0,0]
[{"$f":"IF(ISBLANK('Tóm tắt từ đầu năm đến nay'!A30),\"\",'Tóm tắt từ đầu năm đến nay'!A30)","v":""},{"$f":"IF(ISBLANK('Tóm tắt từ đầu năm đến nay'!B30),\"\",'Tóm tắt từ đầu năm đến nay'!B30)","v":""},0,0,0]
[{"$f":"IF(ISBLANK('Tóm tắt từ đầu năm đến nay'!A31),\"\",'Tóm tắt từ đầu năm đến nay'!A31)","v":""},{"$f":"IF(ISBLANK('Tóm tắt từ đầu năm đến nay'!B31),\"\",'Tóm tắt từ đầu năm đến nay'!B31)","v":""},0,0,0]
[{"$f":"IF(ISBLANK('Tóm tắt từ đầu năm đến nay'!A32),\"\",'Tóm tắt từ đầu năm đến nay'!A32)","v":""},{"$f":"IF(ISBLANK('Tóm tắt từ đầu năm đến nay'!B32),\"\",'Tóm tắt từ đầu năm đến nay'!B32)","v":""},0,0,0]
[{"$f":"IF(ISBLANK('Tóm tắt từ đầu năm đến nay'!A33),\"\",'Tóm tắt từ đầu năm đến nay'!A33)","v":""},{"$f":"IF(ISBLANK('Tóm tắt từ đầu năm đến nay'!B33),\"\",'Tóm tắt từ đầu năm đến nay'!B33)","v":""},0,0,0]
[{"$f":"IF(ISBLANK('Tóm tắt từ đầu năm đến nay'!A34),\"\",'Tóm tắt từ đầu năm đến nay'!A34)","v":""},{"$f":"IF(ISBLANK('Tóm tắt từ đầu năm đến nay'!B34),\"\",'Tóm tắt từ đầu năm đến nay'!B34)","v":""},0,0,0]
[{"$f":"IF(ISBLANK('Tóm tắt từ đầu năm đến nay'!A35),\"\",'Tóm tắt từ đầu năm đến nay'!A35)","v":""},{"$f":"IF(ISBLANK('Tóm tắt từ đầu năm đến nay'!B35),\"\",'Tóm tắt từ đầu năm đến nay'!B35)","v":""},0,0,0]
[{"$f":"IF(ISBLANK('Tóm tắt từ đầu năm đến nay'!A36),\"\",'Tóm tắt từ đầu năm đến nay'!A36)","v":""},{"$f":"IF(ISBLANK('Tóm tắt từ đầu năm đến nay'!B36),\"\",'Tóm tắt từ đầu năm đến nay'!B36)","v":""},0,0,0]

{"sheet":"Q3","index":3,"n_rows":36,"n_cols":97,"rows_kept":36,"merged":[[3,0,3,6]]}
[{"$f":"Tên_công_ty","v":"Tên công ty"}]
["Theo dõi chấm công, Quý 3"]
["Ngày"]
[{"$f":"Tên_công_ty","v":"Tên công ty"},{"$nulls":6},"BÍ MẬT"]
["Họ","Tên","Nghỉ phép","Nghỉ vì lý do cá nhân","Nghỉ ốm","01/07","02/07","03/07","04/07","05/07","06/07","07/07","08/07","09/07","10/07","11/07","12/07","13/07","14/07","15/07","16/07","17/07","18/07","19/07","20/07","21/07","22/07","23/07","24/07","25/07","26/07","27/07","28/07","29/07","30/07","31/07","01/08","02/08","03/08","04/08","05/08","06/08","07/08","08/08","09/08","10/08","11/08","12/08","13/08","14/08","15/08","16/08","17/08","18/08","19/08","20/08","21/08","22/08","23/08","24/08","25/08","26/08","27/08","28/08","29/08","30/08","31/08","01/09","02/09","03/09","04/09","05/09","06/09","07/09","08/09","09/09","10/09","11/09","12/09","13/09","14/09","15/09","16/09","17/09","18/09","19/09","20/09","21/09","22/09","23/09","24/09","25/09","26/09","27/09","28/09","29/09","30/09"]
[{"$f":"IF(ISBLANK('Tóm tắt từ đầu năm đến nay'!A6),\"\",'Tóm tắt từ đầu năm đến nay'!A6)","v":"Họ"},{"$f":"IF(ISBLANK('Tóm tắt từ đầu năm đến nay'!B6),\"\",'Tóm tắt từ đầu năm đến nay'!B6)","v":"Tên"},{"$f":"COUNTIF($F6:$CS6, \"Nghỉ\")","v":0},{"$f":"COUNTIF($F6:$CS6, \"Nghỉ v\")","v":0},{"$f":"COUNTIF($F6:$CS6, \"Nghỉ ố\")","v":0}]
[{"$f":"IF(ISBLANK('Tóm tắt từ đầu năm đến nay'!A7),\"\",'Tóm tắt từ đầu năm đến nay'!A7)","v":""},{"$f":"IF(ISBLANK('Tóm tắt từ đầu năm đến nay'!B7),\"\",'Tóm tắt từ đầu năm đến nay'!B7)","v":""},0,0,0]
[{"$f":"IF(ISBLANK('Tóm tắt từ đầu năm đến nay'!A8),\"\",'Tóm tắt từ đầu năm đến nay'!A8)","v":""},{"$f":"IF(ISBLANK('Tóm tắt từ đầu năm đến nay'!B8),\"\",'Tóm tắt từ đầu năm đến nay'!B8)","v":""},0,0,0]
[{"$f":"IF(ISBLANK('Tóm tắt từ đầu năm đến nay'!A9),\"\",'Tóm tắt từ đầu năm đến nay'!A9)","v":""},{"$f":"IF(ISBLANK('Tóm tắt từ đầu năm đến nay'!B9),\"\",'Tóm tắt từ đầu năm đến nay'!B9)","v":""},0,0,0]
[{"$f":"IF(ISBLANK('Tóm tắt từ đầu năm đến nay'!A10),\"\",'Tóm tắt từ đầu năm đến nay'!A10)","v":""},{"$f":"IF(ISBLANK('Tóm tắt từ đầu năm đến nay'!B10),\"\",'Tóm tắt từ đầu năm đến nay'!B10)","v":""},0,0,0]
[{"$f":"IF(ISBLANK('Tóm tắt từ đầu năm đến nay'!A11),\"\",'Tóm tắt từ đầu năm đến nay'!A11)","v":""},{"$f":"IF(ISBLANK('Tóm tắt từ đầu năm đến nay'!B11),\"\",'Tóm tắt từ đầu năm đến nay'!B11)","v":""},0,0,0]
[{"$f":"IF(ISBLANK('Tóm tắt từ đầu năm đến nay'!A12),\"\",'Tóm tắt từ đầu năm đến nay'!A12)","v":""},{"$f":"IF(ISBLANK('Tóm tắt từ đầu năm đến nay'!B12),\"\",'Tóm tắt từ đầu năm đến nay'!B12)","v":""},0,0,0]
[{"$f":"IF(ISBLANK('Tóm tắt từ đầu năm đến nay'!A13),\"\",'Tóm tắt từ đầu năm đến nay'!A13)","v":""},{"$f":"IF(ISBLANK('Tóm tắt từ đầu năm đến nay'!B13),\"\",'Tóm tắt từ đầu năm đến nay'!B13)","v":""},0,0,0]
[{"$f":"IF(ISBLANK('Tóm tắt từ đầu năm đến nay'!A14),\"\",'Tóm tắt từ đầu năm đến nay'!A14)","v":""},{"$f":"IF(ISBLANK('Tóm tắt từ đầu năm đến nay'!B14),\"\",'Tóm tắt từ đầu năm đến nay'!B14)","v":""},0,0,0]
[{"$f":"IF(ISBLANK('Tóm tắt từ đầu năm đến nay'!A15),\"\",'Tóm tắt từ đầu năm đến nay'!A15)","v":""},{"$f":"IF(ISBLANK('Tóm tắt từ đầu năm đến nay'!B15),\"\",'Tóm tắt từ đầu năm đến nay'!B15)","v":""},0,0,0]
[{"$f":"IF(ISBLANK('Tóm tắt từ đầu năm đến nay'!A16),\"\",'Tóm tắt từ đầu năm đến nay'!A16)","v":""},{"$f":"IF(ISBLANK('Tóm tắt từ đầu năm đến nay'!B16),\"\",'Tóm tắt từ đầu năm đến nay'!B16)","v":""},0,0,0]
[{"$f":"IF(ISBLANK('Tóm tắt từ đầu năm đến nay'!A17),\"\",'Tóm tắt từ đầu năm đến nay'!A17)","v":""},{"$f":"IF(ISBLANK('Tóm tắt từ đầu năm đến nay'!B17),\"\",'Tóm tắt từ đầu năm đến nay'!B17)","v":""},0,0,0]
[{"$f":"IF(ISBLANK('Tóm tắt từ đầu năm đến nay'!A18),\"\",'Tóm tắt từ đầu năm đến nay'!A18)","v":""},{"$f":"IF(ISBLANK('Tóm tắt từ đầu năm đến nay'!B18),\"\",'Tóm tắt từ đầu năm đến nay'!B18)","v":""},0,0,0]
[{"$f":"IF(ISBLANK('Tóm tắt từ đầu năm đến nay'!A19),\"\",'Tóm tắt từ đầu năm đến nay'!A19)","v":""},{"$f":"IF(ISBLANK('Tóm tắt từ đầu năm đến nay'!B19),\"\",'Tóm tắt từ đầu năm đến nay'!B19)","v":""},0,0,0]
[{"$f":"IF(ISBLANK('Tóm tắt từ đầu năm đến nay'!A20),\"\",'Tóm tắt từ đầu năm đến nay'!A20)","v":""},{"$f":"IF(ISBLANK('Tóm tắt từ đầu năm đến nay'!B20),\"\",'Tóm tắt từ đầu năm đến nay'!B20)","v":""},0,0,0]
[{"$f":"IF(ISBLANK('Tóm tắt từ đầu năm đến nay'!A21),\"\",'Tóm tắt từ đầu năm đến nay'!A21)","v":""},{"$f":"IF(ISBLANK('Tóm tắt từ đầu năm đến nay'!B21),\"\",'Tóm tắt từ đầu năm đến nay'!B21)","v":""},0,0,0]
[{"$f":"IF(ISBLANK('Tóm tắt từ đầu năm đến nay'!A22),\"\",'Tóm tắt từ đầu năm đến nay'!A22)","v":""},{"$f":"IF(ISBLANK('Tóm tắt từ đầu năm đến nay'!B22),\"\",'Tóm tắt từ đầu năm đến nay'!B22)","v":""},0,0,0]
[{"$f":"IF(ISBLANK('Tóm tắt từ đầu năm đến nay'!A23),\"\",'Tóm tắt từ đầu năm đến nay'!A23)","v":""},{"$f":"IF(ISBLANK('Tóm tắt từ đầu năm đến nay'!B23),\"\",'Tóm tắt từ đầu năm đến nay'!B23)","v":""},0,0,0]
[{"$f":"IF(ISBLANK('Tóm tắt từ đầu năm đến nay'!A24),\"\",'Tóm tắt từ đầu năm đến nay'!A24)","v":""},{"$f":"IF(ISBLANK('Tóm tắt từ đầu năm đến nay'!B24),\"\",'Tóm tắt từ đầu năm đến nay'!B24)","v":""},0,0,0]
[{"$f":"IF(ISBLANK('Tóm tắt từ đầu năm đến nay'!A25),\"\",'Tóm tắt từ đầu năm đến nay'!A25)","v":""},{"$f":"IF(ISBLANK('Tóm tắt từ đầu năm đến nay'!B25),\"\",'Tóm tắt từ đầu năm đến nay'!B25)","v":""},0,0,0]
[{"$f":"IF(ISBLANK('Tóm tắt từ đầu năm đến nay'!A26),\"\",'Tóm tắt từ đầu năm đến nay'!A26)","v":""},{"$f":"IF(ISBLANK('Tóm tắt từ đầu năm đến nay'!B26),\"\",'Tóm tắt từ đầu năm đến nay'!B26)","v":""},0,0,0]
[{"$f":"IF(ISBLANK('Tóm tắt từ đầu năm đến nay'!A27),\"\",'Tóm tắt từ đầu năm đến nay'!A27)","v":""},{"$f":"IF(ISBLANK('Tóm tắt từ đầu năm đến nay'!B27),\"\",'Tóm tắt từ đầu năm đến nay'!B27)","v":""},0,0,0]
[{"$f":"IF(ISBLANK('Tóm tắt từ đầu năm đến nay'!A28),\"\",'Tóm tắt từ đầu năm đến nay'!A28)","v":""},{"$f":"IF(ISBLANK('Tóm tắt từ đầu năm đến nay'!B28),\"\",'Tóm tắt từ đầu năm đến nay'!B28)","v":""},0,0,0]
[{"$f":"IF(ISBLANK('Tóm tắt từ đầu năm đến nay'!A29),\"\",'Tóm tắt từ đầu năm đến nay'!A29)","v":""},{"$f":"IF(ISBLANK('Tóm tắt từ đầu năm đến nay'!B29),\"\",'Tóm tắt từ đầu năm đến nay'!B29)","v":""},0,0,0]
[{"$f":"IF(ISBLANK('Tóm tắt từ đầu năm đến nay'!A30),\"\",'Tóm tắt từ đầu năm đến nay'!A30)","v":""},{"$f":"IF(ISBLANK('Tóm tắt từ đầu năm đến nay'!B30),\"\",'Tóm tắt từ đầu năm đến nay'!B30)","v":""},0,0,0]
[{"$f":"IF(ISBLANK('Tóm tắt từ đầu năm đến nay'!A31),\"\",'Tóm tắt từ đầu năm đến nay'!A31)","v":""},{"$f":"IF(ISBLANK('Tóm tắt từ đầu năm đến nay'!B31),\"\",'Tóm tắt từ đầu năm đến nay'!B31)","v":""},0,0,0]
[{"$f":"IF(ISBLANK('Tóm tắt từ đầu năm đến nay'!A32),\"\",'Tóm tắt từ đầu năm đến nay'!A32)","v":""},{"$f":"IF(ISBLANK('Tóm tắt từ đầu năm đến nay'!B32),\"\",'Tóm tắt từ đầu năm đến nay'!B32)","v":""},0,0,0]
[{"$f":"IF(ISBLANK('Tóm tắt từ đầu năm đến nay'!A33),\"\",'Tóm tắt từ đầu năm đến nay'!A33)","v":""},{"$f":"IF(ISBLANK('Tóm tắt từ đầu năm đến nay'!B33),\"\",'Tóm tắt từ đầu năm đến nay'!B33)","v":""},0,0,0]
[{"$f":"IF(ISBLANK('Tóm tắt từ đầu năm đến nay'!A34),\"\",'Tóm tắt từ đầu năm đến nay'!A34)","v":""},{"$f":"IF(ISBLANK('Tóm tắt từ đầu năm đến nay'!B34),\"\",'Tóm tắt từ đầu năm đến nay'!B34)","v":""},0,0,0]
[{"$f":"IF(ISBLANK('Tóm tắt từ đầu năm đến nay'!A35),\"\",'Tóm tắt từ đầu năm đến nay'!A35)","v":""},{"$f":"IF(ISBLANK('Tóm tắt từ đầu năm đến nay'!B35),\"\",'Tóm tắt từ đầu năm đến nay'!B35)","v":""},0,0,0]
[{"$f":"IF(ISBLANK('Tóm tắt từ đầu năm đến nay'!A36),\"\",'Tóm tắt từ đầu năm đến nay'!A36)","v":""},{"$f":"IF(ISBLANK('Tóm tắt từ đầu năm đến nay'!B36),\"\",'Tóm tắt từ đầu năm đến nay'!B36)","v":""},0,0,0]

{"sheet":"Q4","index":4,"n_rows":36,"n_cols":97,"rows_kept":36,"merged":[[3,0,3,6]]}
[{"$f":"Tên_công_ty","v":"Tên công ty"}]
["Theo dõi chấm công, Quý 4"]
["Ngày"]
[{"$f":"Tên_công_ty","v":"Tên công ty"},{"$nulls":6},"BÍ MẬT"]
["Họ","Tên","Nghỉ phép","Nghỉ vì lý do cá nhân","Nghỉ ốm","01/10","02/10","03/10","04/10","05/10","06/10","07/10","08/10","09/10","10/10","11/10","12/10","13/10","14/10","15/10","16/10","17/10","18/10","19/10","20/10","21/10","22/10","23/10","24/10","25/10","26/10","27/10","28/10","29/10","30/10","31/10","01/11","02/11","03/11","04/11","05/11","06/11","07/11","08/11","09/11","10/11","11/11","12/11","13/11","14/11","15/11","16/11","17/11","18/11","19/11","20/11","21/11","22/11","23/11","24/11","25/11","26/11","27/11","28/11","29/11","30/11","01/12","02/12","03/12","04/12","05/12","06/12","07/12","08/12","09/12","10/12","11/12","12/12","13/12","14/12","15/12","16/12","17/12","18/12","19/12","20/12","21/12","22/12","23/12","24/12","25/12","26/12","27/12","28/12","29/12","30/12","31/12"]
[{"$f":"IF(ISBLANK('Tóm tắt từ đầu năm đến nay'!A6),\"\",'Tóm tắt từ đầu năm đến nay'!A6)","v":"Họ"},{"$f":"IF(ISBLANK('Tóm tắt từ đầu năm đến nay'!B6),\"\",'Tóm tắt từ đầu năm đến nay'!B6)","v":"Tên"},{"$f":"COUNTIF($F6:$CS6, \"Nghỉ\")","v":0},{"$f":"COUNTIF($F6:CS6, \"Nghỉ v\")","v":0},{"$f":"COUNTIF($F6:CS6, \"Nghỉ ố\")","v":0}]
[{"$f":"IF(ISBLANK('Tóm tắt từ đầu năm đến nay'!A7),\"\",'Tóm tắt từ đầu năm đến nay'!A7)","v":""},{"$f":"IF(ISBLANK('Tóm tắt từ đầu năm đến nay'!B7),\"\",'Tóm tắt từ đầu năm đến nay'!B7)","v":""},0,{"$f":"COUNTIF($F7:CS7, \"Nghỉ v\")","v":0},{"$f":"COUNTIF($F7:CS7, \"Nghỉ ố\")","v":0}]
[{"$f":"IF(ISBLANK('Tóm tắt từ đầu năm đến nay'!A8),\"\",'Tóm tắt từ đầu năm đến nay'!A8)","v":""},{"$f":"IF(ISBLANK('Tóm tắt từ đầu năm đến nay'!B8),\"\",'Tóm tắt từ đầu năm đến nay'!B8)","v":""},0,{"$f":"COUNTIF($F8:CS8, \"Nghỉ v\")","v":0},{"$f":"COUNTIF($F8:CS8, \"Nghỉ ố\")","v":0}]
[{"$f":"IF(ISBLANK('Tóm tắt từ đầu năm đến nay'!A9),\"\",'Tóm tắt từ đầu năm đến nay'!A9)","v":""},{"$f":"IF(ISBLANK('Tóm tắt từ đầu năm đến nay'!B9),\"\",'Tóm tắt từ đầu năm đến nay'!B9)","v":""},0,{"$f":"COUNTIF($F9:CS9, \"Nghỉ v\")","v":0},{"$f":"COUNTIF($F9:CS9, \"Nghỉ ố\")","v":0}]
[{"$f":"IF(ISBLANK('Tóm tắt từ đầu năm đến nay'!A10),\"\",'Tóm tắt từ đầu năm đến nay'!A10)","v":""},{"$f":"IF(ISBLANK('Tóm tắt từ đầu năm đến nay'!B10),\"\",'Tóm tắt từ đầu năm đến nay'!B10)","v":""},0,{"$f":"COUNTIF($F10:CS10, \"Nghỉ v\")","v":0},{"$f":"COUNTIF($F10:CS10, \"Nghỉ ố\")","v":0}]
[{"$f":"IF(ISBLANK('Tóm tắt từ đầu năm đến nay'!A11),\"\",'Tóm tắt từ đầu năm đến nay'!A11)","v":""},{"$f":"IF(ISBLANK('Tóm tắt từ đầu năm đến nay'!B11),\"\",'Tóm tắt từ đầu năm đến nay'!B11)","v":""},0,{"$f":"COUNTIF($F11:CS11, \"Nghỉ v\")","v":0},{"$f":"COUNTIF($F11:CS11, \"Nghỉ ố\")","v":0}]
[{"$f":"IF(ISBLANK('Tóm tắt từ đầu năm đến nay'!A12),\"\",'Tóm tắt từ đầu năm đến nay'!A12)","v":""},{"$f":"IF(ISBLANK('Tóm tắt từ đầu năm đến nay'!B12),\"\",'Tóm tắt từ đầu năm đến nay'!B12)","v":""},0,{"$f":"COUNTIF($F12:CS12, \"Nghỉ v\")","v":0},{"$f":"COUNTIF($F12:CS12, \"Nghỉ ố\")","v":0}]
[{"$f":"IF(ISBLANK('Tóm tắt từ đầu năm đến nay'!A13),\"\",'Tóm tắt từ đầu năm đến nay'!A13)","v":""},{"$f":"IF(ISBLANK('Tóm tắt từ đầu năm đến nay'!B13),\"\",'Tóm tắt từ đầu năm đến nay'!B13)","v":""},0,{"$f":"COUNTIF($F13:CS13, \"Nghỉ v\")","v":0},{"$f":"COUNTIF($F13:CS13, \"Nghỉ ố\")","v":0}]
[{"$f":"IF(ISBLANK('Tóm tắt từ đầu năm đến nay'!A14),\"\",'Tóm tắt từ đầu năm đến nay'!A14)","v":""},{"$f":"IF(ISBLANK('Tóm tắt từ đầu năm đến nay'!B14),\"\",'Tóm tắt từ đầu năm đến nay'!B14)","v":""},0,{"$f":"COUNTIF($F14:CS14, \"Nghỉ v\")","v":0},{"$f":"COUNTIF($F14:CS14, \"Nghỉ ố\")","v":0}]
[{"$f":"IF(ISBLANK('Tóm tắt từ đầu năm đến nay'!A15),\"\",'Tóm tắt từ đầu năm đến nay'!A15)","v":""},{"$f":"IF(ISBLANK('Tóm tắt từ đầu năm đến nay'!B15),\"\",'Tóm tắt từ đầu năm đến nay'!B15)","v":""},0,{"$f":"COUNTIF($F15:CS15, \"Nghỉ v\")","v":0},{"$f":"COUNTIF($F15:CS15, \"Nghỉ ố\")","v":0}]
[{"$f":"IF(ISBLANK('Tóm tắt từ đầu năm đến nay'!A16),\"\",'Tóm tắt từ đầu năm đến nay'!A16)","v":""},{"$f":"IF(ISBLANK('Tóm tắt từ đầu năm đến nay'!B16),\"\",'Tóm tắt từ đầu năm đến nay'!B16)","v":""},0,{"$f":"COUNTIF($F16:CS16, \"Nghỉ v\")","v":0},{"$f":"COUNTIF($F16:CS16, \"Nghỉ ố\")","v":0}]
[{"$f":"IF(ISBLANK('Tóm tắt từ đầu năm đến nay'!A17),\"\",'Tóm tắt từ đầu năm đến nay'!A17)","v":""},{"$f":"IF(ISBLANK('Tóm tắt từ đầu năm đến nay'!B17),\"\",'Tóm tắt từ đầu năm đến nay'!B17)","v":""},0,{"$f":"COUNTIF($F17:CS17, \"Nghỉ v\")","v":0},{"$f":"COUNTIF($F17:CS17, \"Nghỉ ố\")","v":0}]
[{"$f":"IF(ISBLANK('Tóm tắt từ đầu năm đến nay'!A18),\"\",'Tóm tắt từ đầu năm đến nay'!A18)","v":""},{"$f":"IF(ISBLANK('Tóm tắt từ đầu năm đến nay'!B18),\"\",'Tóm tắt từ đầu năm đến nay'!B18)","v":""},0,{"$f":"COUNTIF($F18:CS18, \"Nghỉ v\")","v":0},{"$f":"COUNTIF($F18:CS18, \"Nghỉ ố\")","v":0}]
[{"$f":"IF(ISBLANK('Tóm tắt từ đầu năm đến nay'!A19),\"\",'Tóm tắt từ đầu năm đến nay'!A19)","v":""},{"$f":"IF(ISBLANK('Tóm tắt từ đầu năm đến nay'!B19),\"\",'Tóm tắt từ đầu năm đến nay'!B19)","v":""},0,{"$f":"COUNTIF($F19:CS19, \"Nghỉ v\")","v":0},{"$f":"COUNTIF($F19:CS19, \"Nghỉ ố\")","v":0}]
[{"$f":"IF(ISBLANK('Tóm tắt từ đầu năm đến nay'!A20),\"\",'Tóm tắt từ đầu năm đến nay'!A20)","v":""},{"$f":"IF(ISBLANK('Tóm tắt từ đầu năm đến nay'!B20),\"\",'Tóm tắt từ đầu năm đến nay'!B20)","v":""},0,{"$f":"COUNTIF($F20:CS20, \"Nghỉ v\")","v":0},{"$f":"COUNTIF($F20:CS20, \"Nghỉ ố\")","v":0}]
[{"$f":"IF(ISBLANK('Tóm tắt từ đầu năm đến nay'!A21),\"\",'Tóm tắt từ đầu năm đến nay'!A21)","v":""},{"$f":"IF(ISBLANK('Tóm tắt từ đầu năm đến nay'!B21),\"\",'Tóm tắt từ đầu năm đến nay'!B21)","v":""},0,{"$f":"COUNTIF($F21:CS21, \"Nghỉ v\")","v":0},{"$f":"COUNTIF($F21:CS21, \"Nghỉ ố\")","v":0}]
[{"$f":"IF(ISBLANK('Tóm tắt từ đầu năm đến nay'!A22),\"\",'Tóm tắt từ đầu năm đến nay'!A22)","v":""},{"$f":"IF(ISBLANK('Tóm tắt từ đầu năm đến nay'!B22),\"\",'Tóm tắt từ đầu năm đến nay'!B22)","v":""},0,{"$f":"COUNTIF($F22:CS22, \"Nghỉ v\")","v":0},{"$f":"COUNTIF($F22:CS22, \"Nghỉ ố\")","v":0}]
[{"$f":"IF(ISBLANK('Tóm tắt từ đầu năm đến nay'!A23),\"\",'Tóm tắt từ đầu năm đến nay'!A23)","v":""},{"$f":"IF(ISBLANK('Tóm tắt từ đầu năm đến nay'!B23),\"\",'Tóm tắt từ đầu năm đến nay'!B23)","v":""},0,{"$f":"COUNTIF($F23:CS23, \"Nghỉ v\")","v":0},{"$f":"COUNTIF($F23:CS23, \"Nghỉ ố\")","v":0}]
[{"$f":"IF(ISBLANK('Tóm tắt từ đầu năm đến nay'!A24),\"\",'Tóm tắt từ đầu năm đến nay'!A24)","v":""},{"$f":"IF(ISBLANK('Tóm tắt từ đầu năm đến nay'!B24),\"\",'Tóm tắt từ đầu năm đến nay'!B24)","v":""},0,{"$f":"COUNTIF($F24:CS24, \"Nghỉ v\")","v":0},{"$f":"COUNTIF($F24:CS24, \"Nghỉ ố\")","v":0}]
[{"$f":"IF(ISBLANK('Tóm tắt từ đầu năm đến nay'!A25),\"\",'Tóm tắt từ đầu năm đến nay'!A25)","v":""},{"$f":"IF(ISBLANK('Tóm tắt từ đầu năm đến nay'!B25),\"\",'Tóm tắt từ đầu năm đến nay'!B25)","v":""},0,{"$f":"COUNTIF($F25:CS25, \"Nghỉ v\")","v":0},{"$f":"COUNTIF($F25:CS25, \"Nghỉ ố\")","v":0}]
[{"$f":"IF(ISBLANK('Tóm tắt từ đầu năm đến nay'!A26),\"\",'Tóm tắt từ đầu năm đến nay'!A26)","v":""},{"$f":"IF(ISBLANK('Tóm tắt từ đầu năm đến nay'!B26),\"\",'Tóm tắt từ đầu năm đến nay'!B26)","v":""},0,{"$f":"COUNTIF($F26:CS26, \"Nghỉ v\")","v":0},{"$f":"COUNTIF($F26:CS26, \"Nghỉ ố\")","v":0}]
[{"$f":"IF(ISBLANK('Tóm tắt từ đầu năm đến nay'!A27),\"\",'Tóm tắt từ đầu năm đến nay'!A27)","v":""},{"$f":"IF(ISBLANK('Tóm tắt từ đầu năm đến nay'!B27),\"\",'Tóm tắt từ đầu năm đến nay'!B27)","v":""},0,{"$f":"COUNTIF($F27:CS27, \"Nghỉ v\")","v":0},{"$f":"COUNTIF($F27:CS27, \"Nghỉ ố\")","v":0}]
[{"$f":"IF(ISBLANK('Tóm tắt từ đầu năm đến nay'!A28),\"\",'Tóm tắt từ đầu năm đến nay'!A28)","v":""},{"$f":"IF(ISBLANK('Tóm tắt từ đầu năm đến nay'!B28),\"\",'Tóm tắt từ đầu năm đến nay'!B28)","v":""},0,{"$f":"COUNTIF($F28:CS28, \"Nghỉ v\")","v":0},{"$f":"COUNTIF($F28:CS28, \"Nghỉ ố\")","v":0}]
[{"$f":"IF(ISBLANK('Tóm tắt từ đầu năm đến nay'!A29),\"\",'Tóm tắt từ đầu năm đến nay'!A29)","v":""},{"$f":"IF(ISBLANK('Tóm tắt từ đầu năm đến nay'!B29),\"\",'Tóm tắt từ đầu năm đến nay'!B29)","v":""},0,{"$f":"COUNTIF($F29:CS29, \"Nghỉ v\")","v":0},{"$f":"COUNTIF($F29:CS29, \"Nghỉ ố\")","v":0}]
[{"$f":"IF(ISBLANK('Tóm tắt từ đầu năm đến nay'!A30),\"\",'Tóm tắt từ đầu năm đến nay'!A30)","v":""},{"$f":"IF(ISBLANK('Tóm tắt từ đầu năm đến nay'!B30),\"\",'Tóm tắt từ đầu năm đến nay'!B30)","v":""},0,{"$f":"COUNTIF($F30:CS30, \"Nghỉ v\")","v":0},{"$f":"COUNTIF($F30:CS30, \"Nghỉ ố\")","v":0}]
[{"$f":"IF(ISBLANK('Tóm tắt từ đầu năm đến nay'!A31),\"\",'Tóm tắt từ đầu năm đến nay'!A31)","v":""},{"$f":"IF(ISBLANK('Tóm tắt từ đầu năm đến nay'!B31),\"\",'Tóm tắt từ đầu năm đến nay'!B31)","v":""},0,{"$f":"COUNTIF($F31:CS31, \"Nghỉ v\")","v":0},{"$f":"COUNTIF($F31:CS31, \"Nghỉ ố\")","v":0}]
[{"$f":"IF(ISBLANK('Tóm tắt từ đầu năm đến nay'!A32),\"\",'Tóm tắt từ đầu năm đến nay'!A32)","v":""},{"$f":"IF(ISBLANK('Tóm tắt từ đầu năm đến nay'!B32),\"\",'Tóm tắt từ đầu năm đến nay'!B32)","v":""},0,{"$f":"COUNTIF($F32:CS32, \"Nghỉ v\")","v":0},{"$f":"COUNTIF($F32:CS32, \"Nghỉ ố\")","v":0}]
[{"$f":"IF(ISBLANK('Tóm tắt từ đầu năm đến nay'!A33),\"\",'Tóm tắt từ đầu năm đến nay'!A33)","v":""},{"$f":"IF(ISBLANK('Tóm tắt từ đầu năm đến nay'!B33),\"\",'Tóm tắt từ đầu năm đến nay'!B33)","v":""},0,{"$f":"COUNTIF($F33:CS33, \"Nghỉ v\")","v":0},{"$f":"COUNTIF($F33:CS33, \"Nghỉ ố\")","v":0}]
[{"$f":"IF(ISBLANK('Tóm tắt từ đầu năm đến nay'!A34),\"\",'Tóm tắt từ đầu năm đến nay'!A34)","v":""},{"$f":"IF(ISBLANK('Tóm tắt từ đầu năm đến nay'!B34),\"\",'Tóm tắt từ đầu năm đến nay'!B34)","v":""},0,{"$f":"COUNTIF($F34:CS34, \"Nghỉ v\")","v":0},{"$f":"COUNTIF($F34:CS34, \"Nghỉ ố\")","v":0}]
[{"$f":"IF(ISBLANK('Tóm tắt từ đầu năm đến nay'!A35),\"\",'Tóm tắt từ đầu năm đến nay'!A35)","v":""},{"$f":"IF(ISBLANK('Tóm tắt từ đầu năm đến nay'!B35),\"\",'Tóm tắt từ đầu năm đến nay'!B35)","v":""},0,{"$f":"COUNTIF($F35:CS35, \"Nghỉ v\")","v":0},{"$f":"COUNTIF($F35:CS35, \"Nghỉ ố\")","v":0}]
[{"$f":"IF(ISBLANK('Tóm tắt từ đầu năm đến nay'!A36),\"\",'Tóm tắt từ đầu năm đến nay'!A36)","v":""},{"$f":"IF(ISBLANK('Tóm tắt từ đầu năm đến nay'!B36),\"\",'Tóm tắt từ đầu năm đến nay'!B36)","v":""},0,{"$f":"COUNTIF($F36:CS36, \"Nghỉ v\")","v":0},{"$f":"COUNTIF($F36:CS36, \"Nghỉ ố\")","v":0}]