{"text_format":"3","workbook":"xlsx","n_sheets":2,"sheets":["Bảng chấm công nhân viên","Tra_cứu_ngày_trong_tuần"],"not_rendered":{"defined_names":26},"read":"whole","date_system":"1900"}

{"sheet":"Bảng chấm công nhân viên","index":0,"n_rows":36,"n_cols":26,"rows_kept":36,"merged":[[0,1,2,4],[0,5,2,9],[0,10,2,14],[0,15,3,23],[0,24,3,24],[3,1,3,3],[3,5,3,9],[3,10,3,14],[4,1,6,3],[4,4,6,6],[5,14,7,14],[5,22,7,22],[5,23,7,23],[5,24,7,24],[21,1,21,6],[22,1,23,3],[22,4,23,6],[23,14,24,14],[23,22,24,22],[23,23,24,23],[23,24,24,24],[32,1,32,6],[32,24,33,24],[32,25,33,25],[33,1,33,6],[34,1,34,6],[35,1,35,3],[35,4,35,5],[35,6,35,7],[35,8,35,14],[35,15,35,16],[35,17,35,23]]}
[null,"BẢNG CHẤM CÔNG CHO NHÂN VIÊN",{"$nulls":3},"Tên nhân viên",{"$nulls":9},"Chọn Có trong ô bên phải, nếu cần phê duyệt \nđể được làm thêm giờ"]
[]
[]
[null,"Ngày kết thúc bảng lương",null,null,{"$f":"V7","v":"2025-06-14"},"Mã số nhân viên"]
[null,"SỐ GIỜ LÀM VIỆC THÔNG THƯỜNG:",null,null,"Ngày:"]
[{"$nulls":14},"Tổng số giờ\nlàm việc thông thường\ntuần 1",{"$nulls":7},"Tổng số giờ\nlàm việc thông thường\ntuần 2","Tổng số giờ\nlàm việc\nthông thường","Mã thanh toán\nchỉ sử dụng\ncho bảng lương"]
[{"$nulls":7},"2025-06-01",{"$f":"Ngày_một+1","v":"2025-06-02"},{"$f":"Ngày_một+2","v":"2025-06-03"},{"$f":"Ngày_một+3","v":"2025-06-04"},{"$f":"Ngày_một+4","v":"2025-06-05"},{"$f":"Ngày_một+5","v":"2025-06-06"},{"$f":"Ngày_một+6","v":"2025-06-07"},null,{"$f":"Ngày_một+7","v":"2025-06-08"},{"$f":"Ngày_một+8","v":"2025-06-09"},{"$f":"Ngày_một+9","v":"2025-06-10"},{"$f":"Ngày_một+10","v":"2025-06-11"},{"$f":"Ngày_một+11","v":"2025-06-12"},{"$f":"Ngày_một+12","v":"2025-06-13"},{"$f":"Ngày_một+13","v":"2025-06-14"}]
[null,"Nhiệm vụ","Vị trí","Số lệnh giao việc","Mô tả công việc","Chức danh","Mã số chức danh",{"$f":"VLOOKUP(WEEKDAY(Ngày_một),Tra_cứu_ngày_trong_tuần!$B$2:$C$8,2)","v":"CN"},{"$f":"VLOOKUP(WEEKDAY(I7),Tra_cứu_ngày_trong_tuần!$B$2:$C$8,2)","v":"T2"},{"$f":"VLOOKUP(WEEKDAY(J7),Tra_cứu_ngày_trong_tuần!$B$2:$C$8,2)","v":"T3"},{"$f":"VLOOKUP(WEEKDAY(K7),Tra_cứu_ngày_trong_tuần!$B$2:$C$8,2)","v":"T4"},{"$f":"VLOOKUP(WEEKDAY(L7),Tra_cứu_ngày_trong_tuần!$B$2:$C$8,2)","v":"T5"},{"$f":"VLOOKUP(WEEKDAY(M7),Tra_cứu_ngày_trong_tuần!$B$2:$C$8,2)","v":"T6"},{"$f":"VLOOKUP(WEEKDAY(N7),Tra_cứu_ngày_trong_tuần!$B$2:$C$8,2)","v":"T7"},null,{"$f":"VLOOKUP(WEEKDAY(P7),Tra_cứu_ngày_trong_tuần!$B$2:$C$8,2)","v":"CN"},{"$f":"VLOOKUP(WEEKDAY(Q7),Tra_cứu_ngày_trong_tuần!$B$2:$C$8,2)","v":"T2"},{"$f":"VLOOKUP(WEEKDAY(R7),Tra_cứu_ngày_trong_tuần!$B$2:$C$8,2)","v":"T3"},{"$f":"VLOOKUP(WEEKDAY(S7),Tra_cứu_ngày_trong_tuần!$B$2:$C$8,2)","v":"T4"},{"$f":"VLOOKUP(WEEKDAY(T7),Tra_cứu_ngày_trong_tuần!$B$2:$C$8,2)","v":"T5"},{"$f":"VLOOKUP(WEEKDAY(U7),Tra_cứu_ngày_trong_tuần!$B$2:$C$8,2)","v":"T6"},{"$f":"VLOOKUP(WEEKDAY(V7),Tra_cứu_ngày_trong_tuần!$B$2:$C$8,2)","v":"T7"}]
[{"$nulls":14},{"$f":"SUM(H9:N9)","v":{"v":0,"d":"0.00"}},{"$nulls":7},{"$f":"SUM(P9:V9)","v":{"v":0,"d":"0.00"}},{"$f":"O9+W9","v":{"v":0,"d":"0.00"}}]
[{"$nulls":14},{"v":0,"d":"0.00"},{"$nulls":7},{"v":0,"d":"0.00"},{"v":0,"d":"0.00"}]
[{"$nulls":14},{"v":0,"d":"0.00"},{"$nulls":7},{"v":0,"d":"0.00"},{"v":0,"d":"0.00"}]
[{"$nulls":14},{"v":0,"d":"0.00"},{"$nulls":7},{"v":0,"d":"0.00"},{"v":0,"d":"0.00"}]
[{"$nulls":14},{"v":0,"d":"0.00"},{"$nulls":7},{"v":0,"d":"0.00"},{"v":0,"d":"0.00"}]
[{"$nulls":14},{"v":0,"d":"0.00"},{"$nulls":7},{"v":0,"d":"0.00"},{"v":0,"d":"0.00"}]
[{"$nulls":14},{"v":0,"d":"0.00"},{"$nulls":7},{"v":0,"d":"0.00"},{"v":0,"d":"0.00"}]
[{"$nulls":14},{"$f":"SUM(H16:N16)","v":{"v":0,"d":"0.00"}},{"$nulls":7},{"$f":"SUM(P16:V16)","v":{"v":0,"d":"0.00"}},{"$f":"O16+W16","v":{"v":0,"d":"0.00"}}]
[{"$nulls":14},{"v":0,"d":"0.00"},{"$nulls":7},{"v":0,"d":"0.00"},{"v":0,"d":"0.00"}]
[{"$nulls":14},{"v":0,"d":"0.00"},{"$nulls":7},{"v":0,"d":"0.00"},{"v":0,"d":"0.00"}]
[{"$nulls":14},{"v":0,"d":"0.00"},{"$nulls":7},{"v":0,"d":"0.00"},{"v":0,"d":"0.00"}]
[{"$nulls":14},{"v":0,"d":"0.00"},{"$nulls":7},{"v":0,"d":"0.00"},{"v":0,"d":"0.00"}]
[{"$nulls":14},{"v":0,"d":"0.00"},{"$nulls":7},{"v":0,"d":"0.00"},{"v":0,"d":"0.00"}]
[null,"Tổng số giờ làm việc thông thường   ",{"$nulls":5},{"$f":"SUM(H9:H21)","v":{"v":0,"d":"0.00"}},{"v":0,"d":"0.00"},{"v":0,"d":"0.00"},{"v":0,"d":"0.00"},{"v":0,"d":"0.00"},{"v":0,"d":"0.00"},{"v":0,"d":"0.00"},{"v":0,"d":"0.00"},{"v":0,"d":"0.00"},{"$f":"SUM(Q9:Q21)","v":{"v":0,"d":"0.00"}},{"v":0,"d":"0.00"},{"v":0,"d":"0.00"},{"v":0,"d":"0.00"},{"v":0,"d":"0.00"},{"v":0,"d":"0.00"},{"$f":"SUM(W9:W21)","v":{"v":0,"d":"0.00"}},{"$f":"SUM(X9:X21)","v":{"v":0,"d":"0.00"}}]
[null,"SỐ GIỜ LÀM THÊM:",null,null,"Ngày:"]
[{"$nulls":7},{"$f":"Ngày_một","v":"2025-06-01"},{"$f":"Ngày_một+1","v":"2025-06-02"},{"$f":"Ngày_một+2","v":"2025-06-03"},{"$f":"Ngày_một+3","v":"2025-06-04"},{"$f":"Ngày_một+4","v":"2025-06-05"},{"$f":"Ngày_một+5","v":"2025-06-06"},{"$f":"Ngày_một+6","v":"2025-06-07"},"Số giờ làm thêm tuần 1",{"$f":"Ngày_một+7","v":"2025-06-08"},{"$f":"Ngày_một+8","v":"2025-06-09"},{"$f":"Ngày_một+9","v":"2025-06-10"},{"$f":"Ngày_một+10","v":"2025-06-11"},{"$f":"Ngày_một+11","v":"2025-06-12"},{"$f":"Ngày_một+12","v":"2025-06-13"},{"$f":"Ngày_một+13","v":"2025-06-14"},"Số giờ làm thêm Tuần 2","Tổng số giờ làm thêm","Mã\nlàm thêm"]
[null,"Nhiệm vụ","Vị trí","Số lệnh giao việc","Mô tả công việc","Chức danh","Mã số chức danh",{"$f":"VLOOKUP(WEEKDAY(Ngày_một),Tra_cứu_ngày_trong_tuần!$B$2:$C$8,2)","v":"CN"},{"$f":"VLOOKUP(WEEKDAY(I24),Tra_cứu_ngày_trong_tuần!$B$2:$C$8,2)","v":"T2"},{"$f":"VLOOKUP(WEEKDAY(J24),Tra_cứu_ngày_trong_tuần!$B$2:$C$8,2)","v":"T3"},{"$f":"VLOOKUP(WEEKDAY(K24),Tra_cứu_ngày_trong_tuần!$B$2:$C$8,2)","v":"T4"},{"$f":"VLOOKUP(WEEKDAY(L24),Tra_cứu_ngày_trong_tuần!$B$2:$C$8,2)","v":"T5"},{"$f":"VLOOKUP(WEEKDAY(M24),Tra_cứu_ngày_trong_tuần!$B$2:$C$8,2)","v":"T6"},{"$f":"VLOOKUP(WEEKDAY(N24),Tra_cứu_ngày_trong_tuần!$B$2:$C$8,2)","v":"T7"},null,{"$f":"VLOOKUP(WEEKDAY(P24),Tra_cứu_ngày_trong_tuần!$B$2:$C$8,2)","v":"CN"},{"$f":"VLOOKUP(WEEKDAY(Q24),Tra_cứu_ngày_trong_tuần!$B$2:$C$8,2)","v":"T2"},{"$f":"VLOOKUP(WEEKDAY(R24),Tra_cứu_ngày_trong_tuần!$B$2:$C$8,2)","v":"T3"},{"$f":"VLOOKUP(WEEKDAY(S24),Tra_cứu_ngày_trong_tuần!$B$2:$C$8,2)","v":"T4"},{"$f":"VLOOKUP(WEEKDAY(T24),Tra_cứu_ngày_trong_tuần!$B$2:$C$8,2)","v":"T5"},{"$f":"VLOOKUP(WEEKDAY(U24),Tra_cứu_ngày_trong_tuần!$B$2:$C$8,2)","v":"T6"},{"$f":"VLOOKUP(WEEKDAY(V24),Tra_cứu_ngày_trong_tuần!$B$2:$C$8,2)","v":"T7"}]
[{"$nulls":14},{"$f":"SUM(H26:N26)","v":{"v":0,"d":"0.00"}},{"$nulls":7},{"$f":"SUM(P26:V26)","v":{"v":0,"d":"0.00"}},{"$f":"O26+W26","v":{"v":0,"d":"0.00"}}]
[{"$nulls":14},{"v":0,"d":"0.00"},{"$nulls":7},{"v":0,"d":"0.00"},{"v":0,"d":"0.00"}]
[{"$nulls":14},{"v":0,"d":"0.00"},{"$nulls":7},{"v":0,"d":"0.00"},{"v":0,"d":"0.00"}]
[{"$nulls":14},{"v":0,"d":"0.00"},{"$nulls":7},{"v":0,"d":"0.00"},{"v":0,"d":"0.00"}]
[{"$nulls":14},{"v":0,"d":"0.00"},{"$nulls":7},{"v":0,"d":"0.00"},{"v":0,"d":"0.00"}]
[{"$nulls":14},{"v":0,"d":"0.00"},{"$nulls":7},{"v":0,"d":"0.00"},{"v":0,"d":"0.00"}]
[{"$nulls":14},{"v":0,"d":"0.00"},{"$nulls":7},{"v":0,"d":"0.00"},{"v":0,"d":"0.00"}]
[null,"Tổng số giờ làm thêm     ",{"$nulls":5},{"$f":"SUM(H26:H32)","v":{"v":0,"d":"0.00"}},{"v":0,"d":"0.00"},{"v":0,"d":"0.00"},{"v":0,"d":"0.00"},{"v":0,"d":"0.00"},{"v":0,"d":"0.00"},{"v":0,"d":"0.00"},{"$f":"SUM(O26:O32)","v":{"v":0,"d":"0.00"}},{"v":0,"d":"0.00"},{"v":0,"d":"0.00"},{"v":0,"d":"0.00"},{"v":0,"d":"0.00"},{"v":0,"d":"0.00"},{"v":0,"d":"0.00"},{"v":0,"d":"0.00"},{"$f":"SUM(P33:V33)","v":{"v":0,"d":"0.00"}},{"$f":"SUM(X26:X32)","v":{"v":0,"d":"0.00"}},"Tổng số giờ\nđã\nlàm việc","Tổng\nđược\nthanh toán"]
[null,"Tiền lương làm thêm giờ:     ",{"$nulls":12},{"$f":"IF(SUM(H34:N34)<=O33,SUM(H34:N34),O33)","v":{"v":0,"d":"0.00"}},{"$nulls":7},{"$f":"IF(SUM(P34:V34)<=W33,SUM(P34:V34),W33)","v":{"v":0,"d":"0.00"}},{"$f":"IF(SUM(Q34:W34)<=X33,SUM(Q34:W34),X33)","v":{"v":0,"d":"0.00"}}]
[null,"Tiền làm thêm giờ được thanh toán     ",{"$nulls":5},{"$f":"IF(H33>=H34,H33-H34,H33)","v":{"v":0,"d":"0.00"}},{"$f":"IF(I33>=I34,I33-I34,I33)","v":{"v":0,"d":"0.00"}},{"v":0,"d":"0.00"},{"v":0,"d":"0.00"},{"v":0,"d":"0.00"},{"v":0,"d":"0.00"},{"v":0,"d":"0.00"},{"v":0,"d":"0.00"},{"v":0,"d":"0.00"},{"v":0,"d":"0.00"},{"v":0,"d":"0.00"},{"v":0,"d":"0.00"},{"v":0,"d":"0.00"},{"v":0,"d":"0.00"},{"v":0,"d":"0.00"},{"$f":"IF(W33>=W34,W33-W34,W33)","v":{"v":0,"d":"0.00"}},{"$f":"IF(X33>=X34,X33-X34,X33)","v":{"v":0,"d":"0.00"}},{"$f":"$X$22+$X$33","v":{"v":0,"d":"0.00"}},{"$f":"X22+X35","v":{"v":0,"d":"0.00"}}]
[null,"Nhân viên ",{"$nulls":4},"Giám sát viên ",{"$nulls":8},"Giám sát viên "]

{"sheet":"Tra_cứu_ngày_trong_tuần","index":1,"n_rows":8,"n_cols":3,"rows_kept":8}
[null,"Số nguyên biểu thị\nngày trong tuần","Ký hiệu viết tắt cho\nngày trong tuần"]
[null,1,"CN"]
[null,2,"T2"]
[null,3,"T3"]
[null,4,"T4"]
[null,5,"T5"]
[null,6,"T6"]
[null,7,"T7"]