{"text_format":"3","workbook":"xlsx","n_sheets":4,"sheets":["Başlangıç","PROJE PARAMETRELERİ","PROJE AYRINTILARI","PROJE TOPLAMLARI"],"not_rendered":{"charts":2,"defined_names":3,"pivot_tables":1},"read":"whole","date_system":"1900"}

{"sheet":"Başlangıç","index":0,"n_rows":8,"n_cols":2,"rows_kept":8}
[null,"BU ŞABLON HAKKINDA"]
[]
[null,"Hukuk Firmaları için Proje Planlama Proje Parametreleri, Proje Ayrıntıları ve Proje Toplamları izlemek için bu çalışma kitabını kullanın."]
[null,"Proje Parametreleri çalışma sayfasında Şirket Adı girdiğinizde, bu ad diğer çalışma sayfalarında otomatik olarak güncelleştirilir."]
[null,"Sütun grafiklerini güncelleştirmek için Proje Parametreleri ve Proje Ayrıntıları çalışma sayfasına bilgileri girin. Proje Toplamları çalışma sayfasındaki PivotTable otomatik olarak güncelleştirilir."]
[null,"Not:  "]
[null,"Ek Yönergeler her çalışma sayfasının A sütununda sağlanmıştır. Bu metin özellikle gizlendi. Metni kaldırmak için A sütununu ve ardından SİL seçeneğini belirleyin. Metni göstermek için A sütununu seçin ve yazı tipi rengini değiştirin."]
[null,"Çalışma sayfalarındaki tablolar hakkında daha fazla bilgi edinmek için bir tabloda SHIFT ve F10 tuşlarına basın, TABLO seçeneğini ve ardından ALTERNATİF METİN seçeneğini belirleyin. Proje Toplamları çalışma sayfasındaki PivotTable için tablonun içinde SHIFT ve F10 tuşlarına basın, PIVOTTABLE SEÇENEKLERİ'ni ve ardından ALTERNATİF METİN sekmesini seçin."]
{"$rows_left_out":1}
{"sheet":"PROJE PARAMETRELERİ","index":1,"n_rows":19,"n_cols":9,"rows_kept":19}
["Bu çalışma sayfasında Proje Parametreleri oluşturun. Sağdaki hücreye Şirket Adı girin. Bu sütundaki hücrelerde faydalı yönergeler yer alır.","Şirket Adı"]
["Bu çalışma sayfasının başlığı sağdaki hücrededir.","Hukuk Firmaları için Proje Planlama"]
["Gizlilik iletisi sağdaki hücrededir.",{"$f":"B1&\" Gizli\"","v":"Şirket Adı Gizli"}]
["İpucu sağdaki hücrededir.","Gölgeli hücreler sizin için hesaplanır. Bu hücrelere hiçbir şey girmeniz gerekmez."]
["Sağdaki hücreden başlayarak Parametreler tablosuna ayrıntıları girin. Sonraki yönerge A12 hücresindedir.","PROJE TÜRÜ","GENEL İŞ ORTAĞI","ŞİRKET AVUKATI","SAVUNMA AVUKATI","FİKRİ MÜLKİYET AVUKATI","İFLAS AVUKATI","YÖNETİCİ PERSONEL","TOPLAM"]
[null,"Şirket Kurma",{"v":0.1,"d":"10%"},{"v":0.4,"d":"40%"},{"v":0,"d":"0%"},{"v":0,"d":"0%"},{"v":0,"d":"0%"},{"v":0.5,"d":"50%"},{"$f":"SUM(Parametreler[[#This Row],[GENEL İŞ ORTAĞI]:[YÖNETİCİ PERSONEL]])","v":{"v":1,"d":"100%"}}]
[null,"Şirketi Bünyesine Katma",{"v":0.1,"d":"10%"},{"v":0.4,"d":"40%"},{"v":0,"d":"0%"},{"v":0.1,"d":"10%"},{"v":0,"d":"0%"},{"v":0.4,"d":"40%"},{"$f":"SUM(Parametreler[[#This Row],[GENEL İŞ ORTAĞI]:[YÖNETİCİ PERSONEL]])","v":{"v":1,"d":"100%"}}]
[null,"Ürün Sorumluluğu Savunması",{"v":0.2,"d":"20%"},{"v":0,"d":"0%"},{"v":0.5,"d":"50%"},{"v":0,"d":"0%"},{"v":0,"d":"0%"},{"v":0.3,"d":"30%"},{"$f":"SUM(Parametreler[[#This Row],[GENEL İŞ ORTAĞI]:[YÖNETİCİ PERSONEL]])","v":{"v":1,"d":"100%"}}]
{"$rows_left_out":12}
{"sheet":"PROJE AYRINTILARI","index":2,"n_rows":10,"n_cols":25,"rows_kept":10,"merged":[[1,24,8,28]]}
["Bu çalışma sayfasında Proje Ayrıntıları oluşturun. Şirket Adı sağdaki hücrede otomatik olarak güncelleştirilir. Bu sütundaki hücrelerde faydalı yönergeler yer alır. Başlamak için aşağı oka basın.",{"$f":"'PROJE PARAMETRELERİ'!B1","v":"Şirket Adı"}]
["Bu çalışma sayfasının başlığı sağdaki hücrede ve bilgi ipucu Y2 hücresindedir.",{"$f":"'PROJE PARAMETRELERİ'!B2","v":"Hukuk Firmaları için Proje Planlama"},{"$nulls":22},"BİLGİ:\nSatır eklemek için tablo gövdesinin (toplamlar satırı değil) sağ alt köşesindeki hücreyi seçin ve Sekme tuşuna basın veya tablonun içinde satırı eklemek istediğiniz yere gelin, SHIFT ve F10 tuşlarına basın ve Ekle | Yukarıya/Aşağıya Tablo Satırları seçeneklerini belirleyin.\nKullanılmayan tüm satırların silindiğinden emin olun, PROJE TOPLAMLARI PivotTable tablonun tüm hücrelerini kullandığı için, bunları silmezseniz hatalı sonuçlar verebilir."]
["Gizlilik iletisi sağdaki hücrededir.",{"$f":"'PROJE PARAMETRELERİ'!B3","v":"Şirket Adı Gizli"}]
["Sağdaki hücreden başlayarak Ayrıntılar tablosuna bilgileri girin. Sağdaki Ayrıntılar tablosundaki Proje Türü, Proje Parametreleri çalışma sayfasındaki Parametreler tablosundan alınan bilgilerle otomatik olarak güncelleştirilir.","PROJE ADI","PROJE TÜRÜ","TAHMİNİ BAŞLANGIÇ","TAHMİNİ BİTİŞ","FİİLİ BAŞLANGIÇ","FİİLİ BİTİŞ","TAHMİNİ ÇALIŞMA","FİİLİ ÇALIŞMA","TAHMİNİ SÜRE","FİİLİ SÜRE","GENEL İŞ ORTAĞI","ŞİRKET AVUKATI","SAVUNMA AVUKATI","FİKRİ MÜLKİYET AVUKATI","İFLAS AVUKATI","YÖNETİCİ PERSONEL","GENEL İŞ ORTAĞI 2","ŞİRKET AVUKATI 2","SAVUNMA AVUKATI 2","FİKRİ MÜLKİYET AVUKATI 2","İFLAS AVUKATI 2","YÖNETİCİ PERSONEL 2"]
[null,"Proje 1","Şirket Kurma",{"$f":"TODAY()","v":"2019-02-15"},{"$f":"TODAY()+60","v":"2019-04-16"},{"$f":"TODAY()+10","v":"2019-02-25"},{"$f":"TODAY()+65","v":"2019-04-21"},200,220,{"$f":"DAYS360(Ayrıntılar[[#This Row],[TAHMİNİ BAŞLANGIÇ]],Ayrıntılar[[#This Row],[TAHMİNİ BİTİŞ]],FALSE)","v":61},{"$f":"DAYS360(Ayrıntılar[[#This Row],[FİİLİ BAŞLANGIÇ]],Ayrıntılar[[#This Row],[FİİLİ BİTİŞ]],FALSE)","v":56},{"$f":"INDEX(Parametreler[],MATCH(Ayrıntılar[[#This Row],[PROJE TÜRÜ]],Parametreler[PROJE TÜRÜ],0),MATCH(Ayrıntılar[[#Headers],[GENEL İŞ ORTAĞI]],Parametreler[#Headers],0))*INDEX('PROJE PARAMETRELERİ'!$B$12:$H$12,1,MATCH(Ayrıntılar[[#Headers],[GENEL İŞ ORTAĞI]],Parametreler[#Headers],0))*Ayrıntılar[[#This Row],[TAHMİNİ ÇALIŞMA]]","v":{"v":7000,"d":"7,000 ₺"}},{"$f":"INDEX(Parametreler[],MATCH(Ayrıntılar[[#This Row],[PROJE TÜRÜ]],Parametreler[PROJE TÜRÜ],0),MATCH(Ayrıntılar[[#Headers],[ŞİRKET AVUKATI]],Parametreler[#Headers],0))*INDEX('PROJE PARAMETRELERİ'!$B$12:$H$12,1,MATCH(Ayrıntılar[[#Headers],[ŞİRKET AVUKATI]],Parametreler[#Headers],0))*Ayrıntılar[[#This Row],[TAHMİNİ ÇALIŞMA]]","v":{"v":20000,"d":"20,000 ₺"}},{"$f":"INDEX(Parametreler[],MATCH(Ayrıntılar[[#This Row],[PROJE TÜRÜ]],Parametreler[PROJE TÜRÜ],0),MATCH(Ayrıntılar[[#Headers],[SAVUNMA AVUKATI]],Parametreler[#Headers],0))*INDEX('PROJE PARAMETRELERİ'!$B$12:$H$12,1,MATCH(Ayrıntılar[[#Headers],[SAVUNMA AVUKATI]],Parametreler[#Headers],0))*Ayrıntılar[[#This Row],[TAHMİNİ ÇALIŞMA]]","v":{"v":0,"d":"0 ₺"}},{"$f":"INDEX(Parametreler[],MATCH(Ayrıntılar[[#This Row],[PROJE TÜRÜ]],Parametreler[PROJE TÜRÜ],0),MATCH(Ayrıntılar[[#Headers],[FİKRİ MÜLKİYET AVUKATI]],Parametreler[#Headers],0))*INDEX('PROJE PARAMETRELERİ'!$B$12:$H$12,1,MATCH(Ayrıntılar[[#Headers],[FİKRİ MÜLKİYET AVUKATI]],Parametreler[#Headers],0))*Ayrıntılar[[#This Row],[TAHMİNİ ÇALIŞMA]]","v":{"v":0,"d":"0 ₺"}},{"$f":"INDEX(Parametreler[],MATCH(Ayrıntılar[[#This Row],[PROJE TÜRÜ]],Parametreler[PROJE TÜRÜ],0),MATCH(Ayrıntılar[[#Headers],[İFLAS AVUKATI]],Parametreler[#Headers],0))*INDEX('PROJE PARAMETRELERİ'!$B$12:$H$12,1,MATCH(Ayrıntılar[[#Headers],[İFLAS AVUKATI]],Parametreler[#Headers],0))*Ayrıntılar[[#This Row],[TAHMİNİ ÇALIŞMA]]","v":{"v":0,"d":"0 ₺"}},{"$f":"INDEX(Parametreler[],MATCH(Ayrıntılar[[#This Row],[PROJE TÜRÜ]],Parametreler[PROJE TÜRÜ],0),MATCH(Ayrıntılar[[#Headers],[YÖNETİCİ PERSONEL]],Parametreler[#Headers],0))*INDEX('PROJE PARAMETRELERİ'!$B$12:$H$12,1,MATCH(Ayrıntılar[[#Headers],[YÖNETİCİ PERSONEL]],Parametreler[#Headers],0))*Ayrıntılar[[#This Row],[TAHMİNİ ÇALIŞMA]]","v":{"v":12500,"d":"12,500 ₺"}},{"$f":"INDEX(Parametreler[],MATCH(Ayrıntılar[[#This Row],[PROJE TÜRÜ]],Parametreler[PROJE TÜRÜ],0),MATCH(Ayrıntılar[[#Headers],[GENEL İŞ ORTAĞI]],Parametreler[#Headers],0))*INDEX('PROJE PARAMETRELERİ'!$B$12:$H$12,1,MATCH(Ayrıntılar[[#Headers],[GENEL İŞ ORTAĞI]],Parametreler[#Headers],0))*Ayrıntılar[[#This Row],[FİİLİ ÇALIŞMA]]","v":{"v":7700,"d":"7,700 ₺"}},{"$f":"INDEX(Parametreler[],MATCH(Ayrıntılar[[#This Row],[PROJE TÜRÜ]],Parametreler[PROJE TÜRÜ],0),MATCH(Ayrıntılar[[#Headers],[ŞİRKET AVUKATI]],Parametreler[#Headers],0))*INDEX('PROJE PARAMETRELERİ'!$B$12:$H$12,1,MATCH(Ayrıntılar[[#Headers],[ŞİRKET AVUKATI]],Parametreler[#Headers],0))*Ayrıntılar[[#This Row],[FİİLİ ÇALIŞMA]]","v":{"v":22000,"d":"22,000 ₺"}},{"$f":"INDEX(Parametreler[],MATCH(Ayrıntılar[[#This Row],[PROJE TÜRÜ]],Parametreler[PROJE TÜRÜ],0),MATCH(Ayrıntılar[[#Headers],[SAVUNMA AVUKATI]],Parametreler[#Headers],0))*INDEX('PROJE PARAMETRELERİ'!$B$12:$H$12,1,MATCH(Ayrıntılar[[#Headers],[SAVUNMA AVUKATI]],Parametreler[#Headers],0))*Ayrıntılar[[#This Row],[FİİLİ ÇALIŞMA]]","v":{"v":0,"d":"0 ₺"}},{"$f":"INDEX(Parametreler[],MATCH(Ayrıntılar[[#This Row],[PROJE TÜRÜ]],Parametreler[PROJE TÜRÜ],0),MATCH(Ayrıntılar[[#Headers],[FİKRİ MÜLKİYET AVUKATI]],Parametreler[#Headers],0))*INDEX('PROJE PARAMETRELERİ'!$B$12:$H$12,1,MATCH(Ayrıntılar[[#Headers],[FİKRİ MÜLKİYET AVUKATI]],Parametreler[#Headers],0))*Ayrıntılar[[#This Row],[FİİLİ ÇALIŞMA]]","v":{"v":0,"d":"0 ₺"}},{"$f":"INDEX(Parametreler[],MATCH(Ayrıntılar[[#This Row],[PROJE TÜRÜ]],Parametreler[PROJE TÜRÜ],0),MATCH(Ayrıntılar[[#Headers],[İFLAS AVUKATI]],Parametreler[#Headers],0))*INDEX('PROJE PARAMETRELERİ'!$B$12:$H$12,1,MATCH(Ayrıntılar[[#Headers],[İFLAS AVUKATI]],Parametreler[#Headers],0))*Ayrıntılar[[#This Row],[FİİLİ ÇALIŞMA]]","v":{"v":0,"d":"0 ₺"}},{"$f":"INDEX(Parametreler[],MATCH(Ayrıntılar[[#This Row],[PROJE TÜRÜ]],Parametreler[PROJE TÜRÜ],0),MATCH(Ayrıntılar[[#Headers],[YÖNETİCİ PERSONEL]],Parametreler[#Headers],0))*INDEX('PROJE PARAMETRELERİ'!$B$12:$H$12,1,MATCH(Ayrıntılar[[#Headers],[YÖNETİCİ PERSONEL]],Parametreler[#Headers],0))*Ayrıntılar[[#This Row],[FİİLİ ÇALIŞMA]]","v":{"v":13750,"d":"13,750 ₺"}}]
[null,"Proje 2","Şirketi Bünyesine Katma",{"$f":"TODAY()+30","v":"2019-03-17"},{"$f":"TODAY()+100","v":"2019-05-26"},{"$f":"TODAY()+40","v":"2019-03-27"},{"$f":"TODAY()+110","v":"2019-06-05"},400,390,{"$f":"DAYS360(Ayrıntılar[[#This Row],[TAHMİNİ BAŞLANGIÇ]],Ayrıntılar[[#This Row],[TAHMİNİ BİTİŞ]],FALSE)","v":69},{"$f":"DAYS360(Ayrıntılar[[#This Row],[FİİLİ BAŞLANGIÇ]],Ayrıntılar[[#This Row],[FİİLİ BİTİŞ]],FALSE)","v":68},{"$f":"INDEX(Parametreler[],MATCH(Ayrıntılar[[#This Row],[PROJE TÜRÜ]],Parametreler[PROJE TÜRÜ],0),MATCH(Ayrıntılar[[#Headers],[GENEL İŞ ORTAĞI]],Parametreler[#Headers],0))*INDEX('PROJE PARAMETRELERİ'!$B$12:$H$12,1,MATCH(Ayrıntılar[[#Headers],[GENEL İŞ ORTAĞI]],Parametreler[#Headers],0))*Ayrıntılar[[#This Row],[TAHMİNİ ÇALIŞMA]]","v":{"v":14000,"d":"14,000 ₺"}},{"$f":"INDEX(Parametreler[],MATCH(Ayrıntılar[[#This Row],[PROJE TÜRÜ]],Parametreler[PROJE TÜRÜ],0),MATCH(Ayrıntılar[[#Headers],[ŞİRKET AVUKATI]],Parametreler[#Headers],0))*INDEX('PROJE PARAMETRELERİ'!$B$12:$H$12,1,MATCH(Ayrıntılar[[#Headers],[ŞİRKET AVUKATI]],Parametreler[#Headers],0))*Ayrıntılar[[#This Row],[TAHMİNİ ÇALIŞMA]]","v":{"v":40000,"d":"40,000 ₺"}},{"$f":"INDEX(Parametreler[],MATCH(Ayrıntılar[[#This Row],[PROJE TÜRÜ]],Parametreler[PROJE TÜRÜ],0),MATCH(Ayrıntılar[[#Headers],[SAVUNMA AVUKATI]],Parametreler[#Headers],0))*INDEX('PROJE PARAMETRELERİ'!$B$12:$H$12,1,MATCH(Ayrıntılar[[#Headers],[SAVUNMA AVUKATI]],Parametreler[#Headers],0))*Ayrıntılar[[#This Row],[TAHMİNİ ÇALIŞMA]]","v":{"v":0,"d":"0 ₺"}},{"$f":"INDEX(Parametreler[],MATCH(Ayrıntılar[[#This Row],[PROJE TÜRÜ]],Parametreler[PROJE TÜRÜ],0),MATCH(Ayrıntılar[[#Headers],[FİKRİ MÜLKİYET AVUKATI]],Parametreler[#Headers],0))*INDEX('PROJE PARAMETRELERİ'!$B$12:$H$12,1,MATCH(Ayrıntılar[[#Headers],[FİKRİ MÜLKİYET AVUKATI]],Parametreler[#Headers],0))*Ayrıntılar[[#This Row],[TAHMİNİ ÇALIŞMA]]","v":{"v":11000,"d":"11,000 ₺"}},{"$f":"INDEX(Parametreler[],MATCH(Ayrıntılar[[#This Row],[PROJE TÜRÜ]],Parametreler[PROJE TÜRÜ],0),MATCH(Ayrıntılar[[#Headers],[İFLAS AVUKATI]],Parametreler[#Headers],0))*INDEX('PROJE PARAMETRELERİ'!$B$12:$H$12,1,MATCH(Ayrıntılar[[#Headers],[İFLAS AVUKATI]],Parametreler[#Headers],0))*Ayrıntılar[[#This Row],[TAHMİNİ ÇALIŞMA]]","v":{"v":0,"d":"0 ₺"}},{"$f":"INDEX(Parametreler[],MATCH(Ayrıntılar[[#This Row],[PROJE TÜRÜ]],Parametreler[PROJE TÜRÜ],0),MATCH(Ayrıntılar[[#Headers],[YÖNETİCİ PERSONEL]],Parametreler[#Headers],0))*INDEX('PROJE PARAMETRELERİ'!$B$12:$H$12,1,MATCH(Ayrıntılar[[#Headers],[YÖNETİCİ PERSONEL]],Parametreler[#Headers],0))*Ayrıntılar[[#This Row],[TAHMİNİ ÇALIŞMA]]","v":{"v":20000,"d":"20,000 ₺"}},{"$f":"INDEX(Parametreler[],MATCH(Ayrıntılar[[#This Row],[PROJE TÜRÜ]],Parametreler[PROJE TÜRÜ],0),MATCH(Ayrıntılar[[#Headers],[GENEL İŞ ORTAĞI]],Parametreler[#Headers],0))*INDEX('PROJE PARAMETRELERİ'!$B$12:$H$12,1,MATCH(Ayrıntılar[[#Headers],[GENEL İŞ ORTAĞI]],Parametreler[#Headers],0))*Ayrıntılar[[#This Row],[FİİLİ ÇALIŞMA]]","v":{"v":13650,"d":"13,650 ₺"}},{"$f":"INDEX(Parametreler[],MATCH(Ayrıntılar[[#This Row],[PROJE TÜRÜ]],Parametreler[PROJE TÜRÜ],0),MATCH(Ayrıntılar[[#Headers],[ŞİRKET AVUKATI]],Parametreler[#Headers],0))*INDEX('PROJE PARAMETRELERİ'!$B$12:$H$12,1,MATCH(Ayrıntılar[[#Headers],[ŞİRKET AVUKATI]],Parametreler[#Headers],0))*Ayrıntılar[[#This Row],[FİİLİ ÇALIŞMA]]","v":{"v":39000,"d":"39,000 ₺"}},{"$f":"INDEX(Parametreler[],MATCH(Ayrıntılar[[#This Row],[PROJE TÜRÜ]],Parametreler[PROJE TÜRÜ],0),MATCH(Ayrıntılar[[#Headers],[SAVUNMA AVUKATI]],Parametreler[#Headers],0))*INDEX('PROJE PARAMETRELERİ'!$B$12:$H$12,1,MATCH(Ayrıntılar[[#Headers],[SAVUNMA AVUKATI]],Parametreler[#Headers],0))*Ayrıntılar[[#This Row],[FİİLİ ÇALIŞMA]]","v":{"v":0,"d":"0 ₺"}},{"$f":"INDEX(Parametreler[],MATCH(Ayrıntılar[[#This Row],[PROJE TÜRÜ]],Parametreler[PROJE TÜRÜ],0),MATCH(Ayrıntılar[[#Headers],[FİKRİ MÜLKİYET AVUKATI]],Parametreler[#Headers],0))*INDEX('PROJE PARAMETRELERİ'!$B$12:$H$12,1,MATCH(Ayrıntılar[[#Headers],[FİKRİ MÜLKİYET AVUKATI]],Parametreler[#Headers],0))*Ayrıntılar[[#This Row],[FİİLİ ÇALIŞMA]]","v":{"v":10725,"d":"10,725 ₺"}},{"$f":"INDEX(Parametreler[],MATCH(Ayrıntılar[[#This Row],[PROJE TÜRÜ]],Parametreler[PROJE TÜRÜ],0),MATCH(Ayrıntılar[[#Headers],[İFLAS AVUKATI]],Parametreler[#Headers],0))*INDEX('PROJE PARAMETRELERİ'!$B$12:$H$12,1,MATCH(Ayrıntılar[[#Headers],[İFLAS AVUKATI]],Parametreler[#Headers],0))*Ayrıntılar[[#This Row],[FİİLİ ÇALIŞMA]]","v":{"v":0,"d":"0 ₺"}},{"$f":"INDEX(Parametreler[],MATCH(Ayrıntılar[[#This Row],[PROJE TÜRÜ]],Parametreler[PROJE TÜRÜ],0),MATCH(Ayrıntılar[[#Headers],[YÖNETİCİ PERSONEL]],Parametreler[#Headers],0))*INDEX('PROJE PARAMETRELERİ'!$B$12:$H$12,1,MATCH(Ayrıntılar[[#Headers],[YÖNETİCİ PERSONEL]],Parametreler[#Headers],0))*Ayrıntılar[[#This Row],[FİİLİ ÇALIŞMA]]","v":{"v":19500,"d":"19,500 ₺"}}]
[null,"Proje 3","Ürün Sorumluluğu Savunması",{"$f":"TODAY()+150","v":"2019-07-15"},{"$f":"TODAY()+150","v":"2019-07-15"},{"$f":"TODAY()+150","v":"2019-07-15"},{"$f":"TODAY()+170","v":"2019-08-04"},500,500,{"$f":"DAYS360(Ayrıntılar[[#This Row],[TAHMİNİ BAŞLANGIÇ]],Ayrıntılar[[#This Row],[TAHMİNİ BİTİŞ]],FALSE)","v":0},{"$f":"DAYS360(Ayrıntılar[[#This Row],[FİİLİ BAŞLANGIÇ]],Ayrıntılar[[#This Row],[FİİLİ BİTİŞ]],FALSE)","v":19},{"$f":"INDEX(Parametreler[],MATCH(Ayrıntılar[[#This Row],[PROJE TÜRÜ]],Parametreler[PROJE TÜRÜ],0),MATCH(Ayrıntılar[[#Headers],[GENEL İŞ ORTAĞI]],Parametreler[#Headers],0))*INDEX('PROJE PARAMETRELERİ'!$B$12:$H$12,1,MATCH(Ayrıntılar[[#Headers],[GENEL İŞ ORTAĞI]],Parametreler[#Headers],0))*Ayrıntılar[[#This Row],[TAHMİNİ ÇALIŞMA]]","v":{"v":35000,"d":"35,000 ₺"}},{"$f":"INDEX(Parametreler[],MATCH(Ayrıntılar[[#This Row],[PROJE TÜRÜ]],Parametreler[PROJE TÜRÜ],0),MATCH(Ayrıntılar[[#Headers],[ŞİRKET AVUKATI]],Parametreler[#Headers],0))*INDEX('PROJE PARAMETRELERİ'!$B$12:$H$12,1,MATCH(Ayrıntılar[[#Headers],[ŞİRKET AVUKATI]],Parametreler[#Headers],0))*Ayrıntılar[[#This Row],[TAHMİNİ ÇALIŞMA]]","v":{"v":0,"d":"0 ₺"}},{"$f":"INDEX(Parametreler[],MATCH(Ayrıntılar[[#This Row],[PROJE TÜRÜ]],Parametreler[PROJE TÜRÜ],0),MATCH(Ayrıntılar[[#Headers],[SAVUNMA AVUKATI]],Parametreler[#Headers],0))*INDEX('PROJE PARAMETRELERİ'!$B$12:$H$12,1,MATCH(Ayrıntılar[[#Headers],[SAVUNMA AVUKATI]],Parametreler[#Headers],0))*Ayrıntılar[[#This Row],[TAHMİNİ ÇALIŞMA]]","v":{"v":75000,"d":"75,000 ₺"}},{"$f":"INDEX(Parametreler[],MATCH(Ayrıntılar[[#This Row],[PROJE TÜRÜ]],Parametreler[PROJE TÜRÜ],0),MATCH(Ayrıntılar[[#Headers],[FİKRİ MÜLKİYET AVUKATI]],Parametreler[#Headers],0))*INDEX('PROJE PARAMETRELERİ'!$B$12:$H$12,1,MATCH(Ayrıntılar[[#Headers],[FİKRİ MÜLKİYET AVUKATI]],Parametreler[#Headers],0))*Ayrıntılar[[#This Row],[TAHMİNİ ÇALIŞMA]]","v":{"v":0,"d":"0 ₺"}},{"$f":"INDEX(Parametreler[],MATCH(Ayrıntılar[[#This Row],[PROJE TÜRÜ]],Parametreler[PROJE TÜRÜ],0),MATCH(Ayrıntılar[[#Headers],[İFLAS AVUKATI]],Parametreler[#Headers],0))*INDEX('PROJE PARAMETRELERİ'!$B$12:$H$12,1,MATCH(Ayrıntılar[[#Headers],[İFLAS AVUKATI]],Parametreler[#Headers],0))*Ayrıntılar[[#This Row],[TAHMİNİ ÇALIŞMA]]","v":{"v":0,"d":"0 ₺"}},{"$f":"INDEX(Parametreler[],MATCH(Ayrıntılar[[#This Row],[PROJE TÜRÜ]],Parametreler[PROJE TÜRÜ],0),MATCH(Ayrıntılar[[#Headers],[YÖNETİCİ PERSONEL]],Parametreler[#Headers],0))*INDEX('PROJE PARAMETRELERİ'!$B$12:$H$12,1,MATCH(Ayrıntılar[[#Headers],[YÖNETİCİ PERSONEL]],Parametreler[#Headers],0))*Ayrıntılar[[#This Row],[TAHMİNİ ÇALIŞMA]]","v":{"v":18750,"d":"18,750 ₺"}},{"$f":"INDEX(Parametreler[],MATCH(Ayrıntılar[[#This Row],[PROJE TÜRÜ]],Parametreler[PROJE TÜRÜ],0),MATCH(Ayrıntılar[[#Headers],[GENEL İŞ ORTAĞI]],Parametreler[#Headers],0))*INDEX('PROJE PARAMETRELERİ'!$B$12:$H$12,1,MATCH(Ayrıntılar[[#Headers],[GENEL İŞ ORTAĞI]],Parametreler[#Headers],0))*Ayrıntılar[[#This Row],[FİİLİ ÇALIŞMA]]","v":{"v":35000,"d":"35,000 ₺"}},{"$f":"INDEX(Parametreler[],MATCH(Ayrıntılar[[#This Row],[PROJE TÜRÜ]],Parametreler[PROJE TÜRÜ],0),MATCH(Ayrıntılar[[#Headers],[ŞİRKET AVUKATI]],Parametreler[#Headers],0))*INDEX('PROJE PARAMETRELERİ'!$B$12:$H$12,1,MATCH(Ayrıntılar[[#Headers],[ŞİRKET AVUKATI]],Parametreler[#Headers],0))*Ayrıntılar[[#This Row],[FİİLİ ÇALIŞMA]]","v":{"v":0,"d":"0 ₺"}},{"$f":"INDEX(Parametreler[],MATCH(Ayrıntılar[[#This Row],[PROJE TÜRÜ]],Parametreler[PROJE TÜRÜ],0),MATCH(Ayrıntılar[[#Headers],[SAVUNMA AVUKATI]],Parametreler[#Headers],0))*INDEX('PROJE PARAMETRELERİ'!$B$12:$H$12,1,MATCH(Ayrıntılar[[#Headers],[SAVUNMA AVUKATI]],Parametreler[#Headers],0))*Ayrıntılar[[#This Row],[FİİLİ ÇALIŞMA]]","v":{"v":75000,"d":"75,000 ₺"}},{"$f":"INDEX(Parametreler[],MATCH(Ayrıntılar[[#This Row],[PROJE TÜRÜ]],Parametreler[PROJE TÜRÜ],0),MATCH(Ayrıntılar[[#Headers],[FİKRİ MÜLKİYET AVUKATI]],Parametreler[#Headers],0))*INDEX('PROJE PARAMETRELERİ'!$B$12:$H$12,1,MATCH(Ayrıntılar[[#Headers],[FİKRİ MÜLKİYET AVUKATI]],Parametreler[#Headers],0))*Ayrıntılar[[#This Row],[FİİLİ ÇALIŞMA]]","v":{"v":0,"d":"0 ₺"}},{"$f":"INDEX(Parametreler[],MATCH(Ayrıntılar[[#This Row],[PROJE TÜRÜ]],Parametreler[PROJE TÜRÜ],0),MATCH(Ayrıntılar[[#Headers],[İFLAS AVUKATI]],Parametreler[#Headers],0))*INDEX('PROJE PARAMETRELERİ'!$B$12:$H$12,1,MATCH(Ayrıntılar[[#Headers],[İFLAS AVUKATI]],Parametreler[#Headers],0))*Ayrıntılar[[#This Row],[FİİLİ ÇALIŞMA]]","v":{"v":0,"d":"0 ₺"}},{"$f":"INDEX(Parametreler[],MATCH(Ayrıntılar[[#This Row],[PROJE TÜRÜ]],Parametreler[PROJE TÜRÜ],0),MATCH(Ayrıntılar[[#Headers],[YÖNETİCİ PERSONEL]],Parametreler[#Headers],0))*INDEX('PROJE PARAMETRELERİ'!$B$12:$H$12,1,MATCH(Ayrıntılar[[#Headers],[YÖNETİCİ PERSONEL]],Parametreler[#Headers],0))*Ayrıntılar[[#This Row],[FİİLİ ÇALIŞMA]]","v":{"v":18750,"d":"18,750 ₺"}}]
[null,"Proje 4","Patent Başvurusu",{"$f":"TODAY()+200","v":"2019-09-03"},{"$f":"TODAY()+230","v":"2019-10-03"},{"$f":"TODAY()+230","v":"2019-10-03"},{"$f":"TODAY()+230","v":"2019-10-03"},150,145,{"$f":"DAYS360(Ayrıntılar[[#This Row],[TAHMİNİ BAŞLANGIÇ]],Ayrıntılar[[#This Row],[TAHMİNİ BİTİŞ]],FALSE)","v":30},{"$f":"DAYS360(Ayrıntılar[[#This Row],[FİİLİ BAŞLANGIÇ]],Ayrıntılar[[#This Row],[FİİLİ BİTİŞ]],FALSE)","v":0},{"$f":"INDEX(Parametreler[],MATCH(Ayrıntılar[[#This Row],[PROJE TÜRÜ]],Parametreler[PROJE TÜRÜ],0),MATCH(Ayrıntılar[[#Headers],[GENEL İŞ ORTAĞI]],Parametreler[#Headers],0))*INDEX('PROJE PARAMETRELERİ'!$B$12:$H$12,1,MATCH(Ayrıntılar[[#Headers],[GENEL İŞ ORTAĞI]],Parametreler[#Headers],0))*Ayrıntılar[[#This Row],[TAHMİNİ ÇALIŞMA]]","v":{"v":5250,"d":"5,250 ₺"}},{"$f":"INDEX(Parametreler[],MATCH(Ayrıntılar[[#This Row],[PROJE TÜRÜ]],Parametreler[PROJE TÜRÜ],0),MATCH(Ayrıntılar[[#Headers],[ŞİRKET AVUKATI]],Parametreler[#Headers],0))*INDEX('PROJE PARAMETRELERİ'!$B$12:$H$12,1,MATCH(Ayrıntılar[[#Headers],[ŞİRKET AVUKATI]],Parametreler[#Headers],0))*Ayrıntılar[[#This Row],[TAHMİNİ ÇALIŞMA]]","v":{"v":0,"d":"0 ₺"}},{"$f":"INDEX(Parametreler[],MATCH(Ayrıntılar[[#This Row],[PROJE TÜRÜ]],Parametreler[PROJE TÜRÜ],0),MATCH(Ayrıntılar[[#Headers],[SAVUNMA AVUKATI]],Parametreler[#Headers],0))*INDEX('PROJE PARAMETRELERİ'!$B$12:$H$12,1,MATCH(Ayrıntılar[[#Headers],[SAVUNMA AVUKATI]],Parametreler[#Headers],0))*Ayrıntılar[[#This Row],[TAHMİNİ ÇALIŞMA]]","v":{"v":0,"d":"0 ₺"}},{"$f":"INDEX(Parametreler[],MATCH(Ayrıntılar[[#This Row],[PROJE TÜRÜ]],Parametreler[PROJE TÜRÜ],0),MATCH(Ayrıntılar[[#Headers],[FİKRİ MÜLKİYET AVUKATI]],Parametreler[#Headers],0))*INDEX('PROJE PARAMETRELERİ'!$B$12:$H$12,1,MATCH(Ayrıntılar[[#Headers],[FİKRİ MÜLKİYET AVUKATI]],Parametreler[#Headers],0))*Ayrıntılar[[#This Row],[TAHMİNİ ÇALIŞMA]]","v":{"v":24750,"d":"24,750 ₺"}},{"$f":"INDEX(Parametreler[],MATCH(Ayrıntılar[[#This Row],[PROJE TÜRÜ]],Parametreler[PROJE TÜRÜ],0),MATCH(Ayrıntılar[[#Headers],[İFLAS AVUKATI]],Parametreler[#Headers],0))*INDEX('PROJE PARAMETRELERİ'!$B$12:$H$12,1,MATCH(Ayrıntılar[[#Headers],[İFLAS AVUKATI]],Parametreler[#Headers],0))*Ayrıntılar[[#This Row],[TAHMİNİ ÇALIŞMA]]","v":{"v":0,"d":"0 ₺"}},{"$f":"INDEX(Parametreler[],MATCH(Ayrıntılar[[#This Row],[PROJE TÜRÜ]],Parametreler[PROJE TÜRÜ],0),MATCH(Ayrıntılar[[#Headers],[YÖNETİCİ PERSONEL]],Parametreler[#Headers],0))*INDEX('PROJE PARAMETRELERİ'!$B$12:$H$12,1,MATCH(Ayrıntılar[[#Headers],[YÖNETİCİ PERSONEL]],Parametreler[#Headers],0))*Ayrıntılar[[#This Row],[TAHMİNİ ÇALIŞMA]]","v":{"v":5625,"d":"5,625 ₺"}},{"$f":"INDEX(Parametreler[],MATCH(Ayrıntılar[[#This Row],[PROJE TÜRÜ]],Parametreler[PROJE TÜRÜ],0),MATCH(Ayrıntılar[[#Headers],[GENEL İŞ ORTAĞI]],Parametreler[#Headers],0))*INDEX('PROJE PARAMETRELERİ'!$B$12:$H$12,1,MATCH(Ayrıntılar[[#Headers],[GENEL İŞ ORTAĞI]],Parametreler[#Headers],0))*Ayrıntılar[[#This Row],[FİİLİ ÇALIŞMA]]","v":{"v":5075,"d":"5,075 ₺"}},{"$f":"INDEX(Parametreler[],MATCH(Ayrıntılar[[#This Row],[PROJE TÜRÜ]],Parametreler[PROJE TÜRÜ],0),MATCH(Ayrıntılar[[#Headers],[ŞİRKET AVUKATI]],Parametreler[#Headers],0))*INDEX('PROJE PARAMETRELERİ'!$B$12:$H$12,1,MATCH(Ayrıntılar[[#Headers],[ŞİRKET AVUKATI]],Parametreler[#Headers],0))*Ayrıntılar[[#This Row],[FİİLİ ÇALIŞMA]]","v":{"v":0,"d":"0 ₺"}},{"$f":"INDEX(Parametreler[],MATCH(Ayrıntılar[[#This Row],[PROJE TÜRÜ]],Parametreler[PROJE TÜRÜ],0),MATCH(Ayrıntılar[[#Headers],[SAVUNMA AVUKATI]],Parametreler[#Headers],0))*INDEX('PROJE PARAMETRELERİ'!$B$12:$H$12,1,MATCH(Ayrıntılar[[#Headers],[SAVUNMA AVUKATI]],Parametreler[#Headers],0))*Ayrıntılar[[#This Row],[FİİLİ ÇALIŞMA]]","v":{"v":0,"d":"0 ₺"}},{"$f":"INDEX(Parametreler[],MATCH(Ayrıntılar[[#This Row],[PROJE TÜRÜ]],Parametreler[PROJE TÜRÜ],0),MATCH(Ayrıntılar[[#Headers],[FİKRİ MÜLKİYET AVUKATI]],Parametreler[#Headers],0))*INDEX('PROJE PARAMETRELERİ'!$B$12:$H$12,1,MATCH(Ayrıntılar[[#Headers],[FİKRİ MÜLKİYET AVUKATI]],Parametreler[#Headers],0))*Ayrıntılar[[#This Row],[FİİLİ ÇALIŞMA]]","v":{"v":23925,"d":"23,925 ₺"}},{"$f":"INDEX(Parametreler[],MATCH(Ayrıntılar[[#This Row],[PROJE TÜRÜ]],Parametreler[PROJE TÜRÜ],0),MATCH(Ayrıntılar[[#Headers],[İFLAS AVUKATI]],Parametreler[#Headers],0))*INDEX('PROJE PARAMETRELERİ'!$B$12:$H$12,1,MATCH(Ayrıntılar[[#Headers],[İFLAS AVUKATI]],Parametreler[#Headers],0))*Ayrıntılar[[#This Row],[FİİLİ ÇALIŞMA]]","v":{"v":0,"d":"0 ₺"}},{"$f":"INDEX(Parametreler[],MATCH(Ayrıntılar[[#This Row],[PROJE TÜRÜ]],Parametreler[PROJE TÜRÜ],0),MATCH(Ayrıntılar[[#Headers],[YÖNETİCİ PERSONEL]],Parametreler[#Headers],0))*INDEX('PROJE PARAMETRELERİ'!$B$12:$H$12,1,MATCH(Ayrıntılar[[#Headers],[YÖNETİCİ PERSONEL]],Parametreler[#Headers],0))*Ayrıntılar[[#This Row],[FİİLİ ÇALIŞMA]]","v":{"v":5437.5,"d":"5,438 ₺"}}]
{"$rows_left_out":3}
{"sheet":"PROJE TOPLAMLARI","index":3,"n_rows":11,"n_cols":16,"rows_kept":11,"merged":[[3,2,3,7],[3,8,3,13],[3,15,14,19]]}
["Bu çalışma sayfasında Proje Toplamları elde edersiniz. Şirket Adı sağdaki hücrede otomatik olarak güncelleştirilir. Bu sütundaki hücrelerde faydalı yönergeler yer alır. Başlamak için aşağı oka basın.",{"$f":"'PROJE PARAMETRELERİ'!B1","v":"Şirket Adı"}]
["Bu çalışma sayfasının başlığı sağdaki hücrededir.",{"$f":"'PROJE PARAMETRELERİ'!B2","v":"Hukuk Firmaları için Proje Planlama"}]
["Gizlilik iletisi sağdaki hücrededir.",{"$f":"'PROJE PARAMETRELERİ'!B3","v":"Şirket Adı Gizli"}]
["Tahmini etiketi C4 hücresinde, Fiili etiketi I4 hücresinde ve Bilgi ipucu da P4 hücresindedir.",null,"TAHMİNİ",{"$nulls":5},"FİİLİ",{"$nulls":6},"BİLGİ: \nBu PivotTable otomatik olarak yenilenmez.  Yenilemek için bu PivotTable'ı (PivotTable'ın içindeki herhangi bir satırı) seçin, PIVOTTABLE ARAÇLARI | ANALİZ ET şerit sekmesinde Yenile'yi seçin.  İsterseniz PivotTable’ı seçip SHIFT + F10 tuşlarına basın ve Yenile’yi seçin."]
["Sağdaki hücreden başlayan PivotTable otomatik olarak güncelleştirilir","PROJE ADI","GENEL İŞ ORTAĞI ","ŞİRKET ","SAVUNMA AVUKATI ","FİKRİ MÜLKİYET ","İFLAS ","YÖNETİCİ PERSONEL ","GENEL İŞ ORTAĞI  ","ŞİRKET  ","SAVUNMA AVUKATI  ","İFLAS  ","FİKRİ MÜLKİYET  ","YÖNETİCİ PERSONEL  "]
[null,"Proje 1",{"v":7000,"d":"7,000.00 ₺"},{"v":20000,"d":"20,000.00 ₺"},{"v":0,"d":"0.00 ₺"},{"v":0,"d":"0.00 ₺"},{"v":0,"d":"0.00 ₺"},{"v":12500,"d":"12,500.00 ₺"},{"v":7700,"d":"7,700.00 ₺"},{"v":22000,"d":"22,000.00 ₺"},{"v":0,"d":"0.00 ₺"},{"v":0,"d":"0.00 ₺"},{"v":0,"d":"0.00 ₺"},{"v":13750,"d":"13,750.00 ₺"}]
[null,"Proje 2",{"v":14000,"d":"14,000.00 ₺"},{"v":40000,"d":"40,000.00 ₺"},{"v":0,"d":"0.00 ₺"},{"v":11000,"d":"11,000.00 ₺"},{"v":0,"d":"0.00 ₺"},{"v":20000,"d":"20,000.00 ₺"},{"v":13650,"d":"13,650.00 ₺"},{"v":39000,"d":"39,000.00 ₺"},{"v":0,"d":"0.00 ₺"},{"v":10725,"d":"10,725.00 ₺"},{"v":0,"d":"0.00 ₺"},{"v":19500,"d":"19,500.00 ₺"}]
[null,"Proje 3",{"v":35000,"d":"35,000.00 ₺"},{"v":0,"d":"0.00 ₺"},{"v":75000,"d":"75,000.00 ₺"},{"v":0,"d":"0.00 ₺"},{"v":0,"d":"0.00 ₺"},{"v":18750,"d":"18,750.00 ₺"},{"v":35000,"d":"35,000.00 ₺"},{"v":0,"d":"0.00 ₺"},{"v":75000,"d":"75,000.00 ₺"},{"v":0,"d":"0.00 ₺"},{"v":0,"d":"0.00 ₺"},{"v":18750,"d":"18,750.00 ₺"}]
{"$rows_left_out":3}