{"text_format":"3","workbook":"xlsx","n_sheets":3,"sheets":["Kişisel Net Değer","Varlıklar","Borçlar"],"not_rendered":{"charts":2,"images":2,"defined_names":1},"read":"whole","date_system":"1900"}

{"sheet":"Kişisel Net Değer","index":0,"n_rows":21,"n_cols":25,"rows_kept":21,"merged":[[3,2,4,7]]}
[{"$nulls":14}," "]
[{"$nulls":16},"Nakit ve Nakit Eşdeğeri",{"$f":"SUMIF(TBL_Assets[Kategori],'Kişisel Net Değer'!Q2,TBL_Assets[Değer])+ROW(Q2)/10000","v":42500.0002},{"$f":"_xlfn.RANK.EQ(R2,$R$2:$R$6,0)","v":5},null,{"$f":"INDEX($Q$2:$R$6,MATCH(5,$S$2:$S$6,0),1)","v":"Nakit ve Nakit Eşdeğeri"},{"$f":"ROUND(INDEX($Q$2:$R$6,MATCH(5,$S$2:$S$6,0),2),2)","v":42500},null,"Toplam Varlıklar",{"$f":"SUM(TBL_Assets[Değer])","v":1923500}]
[null,null," KİŞİSEL NET DEĞER",{"$nulls":13},"Mülkler",{"$f":"SUMIF(TBL_Assets[Kategori],'Kişisel Net Değer'!Q3,TBL_Assets[Değer])+ROW(Q3)/10000","v":1205000.0003},{"$f":"_xlfn.RANK.EQ(R3,$R$2:$R$6,0)","v":1},null,{"$f":"INDEX($Q$2:$R$6,MATCH(4,$S$2:$S$6,0),1)","v":"Emeklilik Birikimleri"},{"$f":"ROUND(INDEX($Q$2:$R$6,MATCH(4,$S$2:$S$6,0),2),2)","v":98000},null,"Toplam Borçlar",{"$f":"SUM(TBL_Debts[Değer])","v":652500}]
[null,null,{"$f":"F6-F8","v":{"v":1271000,"d":"₺1,271,000"}},{"$nulls":6},"VARLIKLAR VE BORÇLAR",{"$nulls":6},"Yatırımlar",{"$f":"SUMIF(TBL_Assets[Kategori],'Kişisel Net Değer'!Q4,TBL_Assets[Değer])+ROW(Q4)/10000","v":475000.0004},{"$f":"_xlfn.RANK.EQ(R4,$R$2:$R$6,0)","v":2},null,{"$f":"INDEX($Q$2:$R$6,MATCH(3,$S$2:$S$6,0),1)","v":"Hayat Sigortası"},{"$f":"ROUND(INDEX($Q$2:$R$6,MATCH(3,$S$2:$S$6,0),2),2)","v":103000}]
[{"$nulls":16},"Emeklilik Birikimleri",{"$f":"SUMIF(TBL_Assets[Kategori],'Kişisel Net Değer'!Q5,TBL_Assets[Değer])+ROW(Q5)/10000","v":98000.0005},{"$f":"_xlfn.RANK.EQ(R5,$R$2:$R$6,0)","v":4},null,{"$f":"INDEX($Q$2:$R$6,MATCH(2,$S$2:$S$6,0),1)","v":"Yatırımlar"},{"$f":"ROUND(INDEX($Q$2:$R$6,MATCH(2,$S$2:$S$6,0),2),2)","v":475000}]
[{"$nulls":4},"Toplam Varlıklar",{"$f":"SUM(TBL_Assets[Değer])","v":{"v":1923500,"d":"₺1,923,500"}},{"$nulls":10},"Hayat Sigortası",{"$f":"SUMIF(TBL_Assets[Kategori],'Kişisel Net Değer'!Q6,TBL_Assets[Değer])+ROW(Q6)/10000","v":103000.0006},{"$f":"_xlfn.RANK.EQ(R6,$R$2:$R$6,0)","v":3},null,{"$f":"INDEX($Q$2:$R$6,MATCH(1,$S$2:$S$6,0),1)","v":"Mülkler"},{"$f":"ROUND(INDEX($Q$2:$R$6,MATCH(1,$S$2:$S$6,0),2),2)","v":1205000}]
[]
[{"$nulls":4},"Toplam Borçlar",{"$f":"SUM(TBL_Debts[Değer])","v":{"v":652500,"d":"₺652,500"}}]
[]
[]
[]
[{"$nulls":3},"VARLIKLARIN ÖZETİ"]
[{"$nulls":10},{"$f":"U6","v":"Mülkler"},{"$f":"V6","v":{"v":1205000,"d":"₺1,205,000"}}]
[]
[{"$nulls":10},{"$f":"U5","v":"Yatırımlar"},{"$f":"V5","v":{"v":475000,"d":"₺475,000"}}]
[]
[{"$nulls":10},{"$f":"U4","v":"Hayat Sigortası"},{"$f":"V4","v":{"v":103000,"d":"₺103,000"}}]
[]
[{"$nulls":10},{"$f":"U3","v":"Emeklilik Birikimleri"},{"$f":"V3","v":{"v":98000,"d":"₺98,000"}}]
[]
[{"$nulls":10},{"$f":"U2","v":"Nakit ve Nakit Eşdeğeri"},{"$f":"V2","v":{"v":42500,"d":"₺42,500"}}]

{"sheet":"Varlıklar","index":1,"n_rows":25,"n_cols":5,"rows_kept":25}
[{"$nulls":4}," "]
[null,"VARLIKLAR"]
[]
[null,"Kategori","Öğe","Değer"]
[null,"Mülkler","Ev",{"v":560000,"d":"₺560,000.00"}]
[null,"Mülkler","Diğer",{"v":255000,"d":"₺255,000.00"}]
[null,"Emeklilik Birikimleri","Emeklilik hesapları",{"v":98000,"d":"₺98,000.00"}]
[null,"Yatırımlar","Hisse Senetleri",{"v":53000,"d":"₺53,000.00"}]
[null,"Yatırımlar","Teminatlar",{"v":25000,"d":"₺25,000.00"}]
[null,"Yatırımlar","Yatırım fonları",{"v":33000,"d":"₺33,000.00"}]
[null,"Yatırımlar","CD’ler",{"v":74000,"d":"₺74,000.00"}]
[null,"Yatırımlar","Külçe",{"v":20000,"d":"₺20,000.00"}]
[null,"Yatırımlar","Güven fonları",{"v":250000,"d":"₺250,000.00"}]
[null,"Hayat Sigortası","Sağlık tasarruf hesabı",{"v":18000,"d":"₺18,000.00"}]
[null,"Hayat Sigortası","Hayat sigortası poliçesinin yazılı değeri",{"v":85000,"d":"₺85,000.00"}]
[null,"Yatırımlar","Diğer",{"v":20000,"d":"₺20,000.00"}]
[null,"Nakit ve Nakit Eşdeğeri","Cari hesaplar",{"v":35500,"d":"₺35,500.00"}]
[null,"Nakit ve Nakit Eşdeğeri","Tasarruf hesapları",{"v":5000,"d":"₺5,000.00"}]
[null,"Nakit ve Nakit Eşdeğeri","Diğer",{"v":2000,"d":"₺2,000.00"}]
[null,"Mülkler","Arabalar",{"v":55000,"d":"₺55,000.00"}]
[null,"Mülkler","Diğer araçlar",{"v":85000,"d":"₺85,000.00"}]
[null,"Mülkler","Mobilyalar",{"v":100000,"d":"₺100,000.00"}]
[null,"Mülkler","Koleksiyon malları",{"v":50000,"d":"₺50,000.00"}]
[null,"Mülkler","Takılar",{"v":60000,"d":"₺60,000.00"}]
[null,"Mülkler","Diğer lüks mallar",{"v":40000,"d":"₺40,000.00"}]

{"sheet":"Borçlar","index":2,"n_rows":14,"n_cols":4,"rows_kept":14}
[{"$nulls":3}," "]
[null,"BORÇLAR"]
[]
[null,"Kategori","Değer"]
[null,"İpotekler",{"v":400000,"d":"₺400,000.00"}]
[null,"Ev teminatlı krediler",{"v":50000,"d":"₺50,000.00"}]
[null,"Araç kredileri",{"v":30000,"d":"₺30,000.00"}]
[null,"Kişisel krediler",{"v":12500,"d":"₺12,500.00"}]
[null,"Kredi kartları",{"v":65000,"d":"₺65,000.00"}]
[null,"Öğrenci kredileri",{"v":10000,"d":"₺10,000.00"}]
[null,"Yatırım karşılığı krediler",{"v":20000,"d":"₺20,000.00"}]
[null,"Hayat sigortası kredileri",{"v":5000,"d":"₺5,000.00"}]
[null,"Diğer taksitli krediler",{"v":10000,"d":"₺10,000.00"}]
[null,"Diğer borçlar",{"v":50000,"d":"₺50,000.00"}]