{"text_format":"3","workbook":"xlsx","n_sheets":3,"sheets":["Eğitim Günlüğü","Eğitim Listesi","Personel Bilgileri"],"not_rendered":{"defined_names":13},"read":"whole","date_system":"1900"}

{"sheet":"Eğitim Günlüğü","index":0,"n_rows":23,"n_cols":9,"rows_kept":23}
[]
[]
[null,null,"EĞİTİM GÜNLÜĞÜ"]
{"$rows_empty":8}
[null,null,"EĞİTİM TARİHİ","AD","EĞİTİM","EĞİTMEN","ALINDI","BAŞARILI/BAŞARISIZ","NOTLAR"]
[null,null,"2012-06-01","Sibel Mersin","Yeni Çalışanlar için Giriş",{"$f":"IF(tblEğitimGünlüğü[[#This Row],[EĞİTİM]]=\"\",\"\",IFERROR(VLOOKUP(tblEğitimGünlüğü[[#This Row],[EĞİTİM]],tblDersListesi[],2,0),\"Not Found\"))","v":"Barış Çetinok"},"Evet","Başarılı","Mükemmel bir eğitmen."]
[null,null,"2012-06-02","Attila Biber","Yeni Çalışanlar için Giriş",{"$f":"IF(tblEğitimGünlüğü[[#This Row],[EĞİTİM]]=\"\",\"\",IFERROR(VLOOKUP(tblEğitimGünlüğü[[#This Row],[EĞİTİM]],tblDersListesi[],2,0),\"Not Found\"))","v":"Barış Çetinok"},"Evet","Başarısız","Erken ayrılması gerekti, tamamlayamadı."]
[null,null,"2012-06-03","Kerim Hanif","Yeni Çalışanlar için Giriş",{"$f":"IF(tblEğitimGünlüğü[[#This Row],[EĞİTİM]]=\"\",\"\",IFERROR(VLOOKUP(tblEğitimGünlüğü[[#This Row],[EĞİTİM]],tblDersListesi[],2,0),\"Not Found\"))","v":"Barış Çetinok"},"Evet","Başarılı","Bu üç aylık dönemdeki son oturum."]
[null,null,"2012-06-03","Attila Biber","Yeni Çalışanlar için Giriş",{"$f":"IF(tblEğitimGünlüğü[[#This Row],[EĞİTİM]]=\"\",\"\",IFERROR(VLOOKUP(tblEğitimGünlüğü[[#This Row],[EĞİTİM]],tblDersListesi[],2,0),\"Not Found\"))","v":"Barış Çetinok"},"Evet","Başarılı","Bu üç aylık dönemdeki son oturum."]
[null,null,"2012-06-04","Attila Biber","Çalışan Operasyonları",{"$f":"IF(tblEğitimGünlüğü[[#This Row],[EĞİTİM]]=\"\",\"\",IFERROR(VLOOKUP(tblEğitimGünlüğü[[#This Row],[EĞİTİM]],tblDersListesi[],2,0),\"Not Found\"))","v":"Çiğdem Akın"},"Evet","Başarılı","Bu üç aylık dönemdeki ilk oturum"]
[null,null,"2012-06-04","Kerim Hanif","Çalışan Operasyonları",{"$f":"IF(tblEğitimGünlüğü[[#This Row],[EĞİTİM]]=\"\",\"\",IFERROR(VLOOKUP(tblEğitimGünlüğü[[#This Row],[EĞİTİM]],tblDersListesi[],2,0),\"Not Found\"))","v":"Çiğdem Akın"},"Evet","Başarılı","Bu üç aylık dönemdeki ilk oturum"]
[null,null,"2012-06-04","Kerim Hanif","Orta Seviye Muhasebe",{"$f":"IF(tblEğitimGünlüğü[[#This Row],[EĞİTİM]]=\"\",\"\",IFERROR(VLOOKUP(tblEğitimGünlüğü[[#This Row],[EĞİTİM]],tblDersListesi[],2,0),\"Not Found\"))","v":"Çiğdem Akın"},"Evet","Başarılı","Yalnızca kapalı oturum."]
[null,null,"2012-06-04","Sibel Mersin","Çalışan Operasyonları",{"$f":"IF(tblEğitimGünlüğü[[#This Row],[EĞİTİM]]=\"\",\"\",IFERROR(VLOOKUP(tblEğitimGünlüğü[[#This Row],[EĞİTİM]],tblDersListesi[],2,0),\"Not Found\"))","v":"Çiğdem Akın"},"Evet","Başarılı","Bu üç aylık dönemdeki ilk oturum"]
[null,null,"2012-06-05","Sibel Mersin","Orta Seviye Muhasebe",{"$f":"IF(tblEğitimGünlüğü[[#This Row],[EĞİTİM]]=\"\",\"\",IFERROR(VLOOKUP(tblEğitimGünlüğü[[#This Row],[EĞİTİM]],tblDersListesi[],2,0),\"Not Found\"))","v":"Çiğdem Akın"},"Hayır","İleride","Henüz almadı."]
[null,null,"2012-06-05","Attila Biber","İleri Seviye Muhasebe",{"$f":"IF(tblEğitimGünlüğü[[#This Row],[EĞİTİM]]=\"\",\"\",IFERROR(VLOOKUP(tblEğitimGünlüğü[[#This Row],[EĞİTİM]],tblDersListesi[],2,0),\"Not Found\"))","v":"Barış Çetinok"},"Hayır","İleride","Henüz almadı."]
[{"$nulls":5},{"$f":"IF(tblEğitimGünlüğü[[#This Row],[EĞİTİM]]=\"\",\"\",IFERROR(VLOOKUP(tblEğitimGünlüğü[[#This Row],[EĞİTİM]],tblDersListesi[],2,0),\"Not Found\"))","v":""}]

{"sheet":"Eğitim Listesi","index":1,"n_rows":10,"n_cols":6,"rows_kept":10}
[]
[]
[null,null,"EĞİTİM LİSTESİ"]
[]
[null,null,"BAŞLIK","EĞİTMEN","AÇIKLAMA","SAAT"]
[null,null,"Yeni Çalışanlar için Giriş","Barış Çetinok","Yeni çalışanlar için temel bir giriş eğitimi. Departmanların hedef ve beklentilerinin yanı sıra zaman kullanımı ve sınırlar tanımlanır.",2]
[null,null,"Çalışan Operasyonları","Çiğdem Akın","Çalışan el kitabını kapsayan, temel çalışan operasyonları.",1]
[null,null,"Çalışan Operasyonları","Barış Çetinok","Temel muhasebe işlemleri ve kılavuzlar",1.5]
[null,null,"Orta Seviye Muhasebe","Çiğdem Akın","Orta seviye muhasebe işlemleri ve kılavuzlar.",2]
[null,null,"İleri Seviye Muhasebe","Barış Çetinok","İleri muhasebe işlemleri ve kılavuzlar.",2]

{"sheet":"Personel Bilgileri","index":2,"n_rows":9,"n_cols":5,"rows_kept":9}
[]
[]
[null,null,"PERSONEL BİLGİLERİ"]
[]
[null,null,"AD","Bölüm","BAŞLIK"]
[null,null,"Sibel Mersin","Satış","Muhasebe Şefi"]
[null,null,"Attila Biber","Muhasebe","Muhasebeci"]
[null,null,"Kerim Hanif","Muhasebe","Muhasebeci"]
[null,null,"Ebru Ersan","Muhasebe","Muhasebeci"]