{"text_format":"3","workbook":"xlsx","n_sheets":3,"sheets":["Veri Girişi","Satış Raporu","Satış Tahmini"],"not_rendered":{"charts":5,"defined_names":7,"pivot_tables":1},"read":"whole","date_system":"1900"}

{"sheet":"Veri Girişi","index":0,"n_rows":24,"n_cols":17,"rows_kept":24}
[{"$nulls":9},{"$f":"365*2","v":730}]
[null,"AYLIK VERİ GİRİŞİ"]
[{"$nulls":11},"TOPLAMLAR",null,null,"TAHMİN"]
[]
[null,"TARİH","ŞİRKET","TUTAR","PLANLANAN","MALİYET","GELİR","AY","ÜÇ AYLIK DÖNEM","YIL","AY NO (GİZLE)","AY ","ÜÇ AYLIK DÖNEM ","YILLIK ","AY  ","ÜÇ AYLIK DÖNEM  ","YIL "]
[null,{"$f":"40657+(365*2)","v":"2013-04-23"},"Veri Bilgisayarcılık",{"v":6400,"d":"6,400.00 TL"},{"v":6200,"d":"6,200.00 TL"},{"v":4450,"d":"4,450.00 TL"},{"$f":"'Veri Girişi'!$D6-'Veri Girişi'!$F6","v":{"v":1950,"d":"1,950.00 TL"}},{"$f":"DATE(YEAR('Veri Girişi'!$B6),MONTH('Veri Girişi'!$B6),1)","v":"2013-04-01"},{"$f":"LOOKUP(MONTH('Veri Girişi'!$H6),{1,1;2,1;3,1;4,2;5,2;6,2;7,3;8,3;9,3;10,4;11,4;12,4})","v":{"v":2,"d":"Üç aylık dönem 2"}},{"$f":"YEAR('Veri Girişi'!$B6)","v":2013},{"$f":"MONTH(tblVeriler[[#This Row],[TARİH]])","v":4},{"$f":"SUMIFS('Veri Girişi'!$D$6:$D$24,'Veri Girişi'!$B$6:$B$24,\">=\"&EOMONTH('Veri Girişi'!$B6,-1)+1,'Veri Girişi'!$B$6:$B$24,\"<=\"&EOMONTH('Veri Girişi'!$B6,0))","v":{"v":14600,"d":"14,600.00 TL"}},{"$f":"SUMIFS('Veri Girişi'!$D$6:$D$24,'Veri Girişi'!$B$6:$B$24,\">=\"&DATE(YEAR('Veri Girişi'!$B6),1,1),'Veri Girişi'!$B$6:$B$24,\"<=\"&DATE(YEAR('Veri Girişi'!$B6),12,31),'Veri Girişi'!$I$6:$I$24,'Veri Girişi'!$I6)","v":{"v":50800,"d":"50,800.00 TL"}},{"$f":"SUMIFS('Veri Girişi'!$D$6:$D$24,'Veri Girişi'!$B$6:$B$24,\">=\"&DATE(YEAR('Veri Girişi'!$B6),1,1),'Veri Girişi'!$B$6:$B$24,\"<=\"&DATE(YEAR('Veri Girişi'!$B6),12,31))","v":{"v":143800,"d":"143,800.00 TL"}},{"$f":"IFERROR(TREND($L$6:INDEX($L:$L,ROW(),1),$K$6:INDEX($K:$K,ROW(),1),IF(MONTH('Veri Girişi'!$B6)=12,13,MONTH('Veri Girişi'!$B6)+1)),\"\")","v":{"v":14600,"d":"14,600.00 TL"}},{"$f":"IFERROR(TREND($M$6:INDEX($M:$M,ROW(),1),$I$6:INDEX($I:$I,ROW(),1),IF('Veri Girişi'!$I6=4,5,'Veri Girişi'!$I6+1)),\"\")","v":{"v":50800,"d":"50,800.00 TL"}},{"$f":"IFERROR(TREND($N$6:INDEX($N:$N,ROW(),1),$J$6:INDEX($J:$J,ROW(),1),'Veri Girişi'!$J6+1),\"\")","v":{"v":143800,"d":"143,800.00 TL"}}]
[null,{"$f":"40659+(365*2)","v":"2013-04-25"},"Contoso Farmasötik",{"v":8200,"d":"8,200.00 TL"},{"v":8000,"d":"8,000.00 TL"},{"v":6400,"d":"6,400.00 TL"},{"$f":"'Veri Girişi'!$D7-'Veri Girişi'!$F7","v":{"v":1800,"d":"1,800.00 TL"}},{"$f":"DATE(YEAR('Veri Girişi'!$B7),MONTH('Veri Girişi'!$B7),1)","v":"2013-04-01"},{"$f":"LOOKUP(MONTH('Veri Girişi'!$H7),{1,1;2,1;3,1;4,2;5,2;6,2;7,3;8,3;9,3;10,4;11,4;12,4})","v":{"v":2,"d":"Üç aylık dönem 2"}},{"$f":"YEAR('Veri Girişi'!$B7)","v":2013},{"$f":"MONTH(tblVeriler[[#This Row],[TARİH]])","v":4},{"$f":"SUMIFS('Veri Girişi'!$D$6:$D$24,'Veri Girişi'!$B$6:$B$24,\">=\"&EOMONTH('Veri Girişi'!$B7,-1)+1,'Veri Girişi'!$B$6:$B$24,\"<=\"&EOMONTH('Veri Girişi'!$B7,0))","v":{"v":14600,"d":"14,600.00 TL"}},{"$f":"SUMIFS('Veri Girişi'!$D$6:$D$24,'Veri Girişi'!$B$6:$B$24,\">=\"&DATE(YEAR('Veri Girişi'!$B7),1,1),'Veri Girişi'!$B$6:$B$24,\"<=\"&DATE(YEAR('Veri Girişi'!$B7),12,31),'Veri Girişi'!$I$6:$I$24,'Veri Girişi'!$I7)","v":{"v":50800,"d":"50,800.00 TL"}},{"$f":"SUMIFS('Veri Girişi'!$D$6:$D$24,'Veri Girişi'!$B$6:$B$24,\">=\"&DATE(YEAR('Veri Girişi'!$B7),1,1),'Veri Girişi'!$B$6:$B$24,\"<=\"&DATE(YEAR('Veri Girişi'!$B7),12,31))","v":{"v":143800,"d":"143,800.00 TL"}},{"$f":"IFERROR(TREND($L$6:INDEX($L:$L,ROW(),1),$K$6:INDEX($K:$K,ROW(),1),IF(MONTH('Veri Girişi'!$B7)=12,13,MONTH('Veri Girişi'!$B7)+1)),\"\")","v":{"v":14600,"d":"14,600.00 TL"}},{"$f":"IFERROR(TREND($M$6:INDEX($M:$M,ROW(),1),$I$6:INDEX($I:$I,ROW(),1),IF('Veri Girişi'!$I7=4,5,'Veri Girişi'!$I7+1)),\"\")","v":{"v":50800,"d":"50,800.00 TL"}},{"$f":"IFERROR(TREND($N$6:INDEX($N:$N,ROW(),1),$J$6:INDEX($J:$J,ROW(),1),'Veri Girişi'!$J7+1),\"\")","v":{"v":143800,"d":"143,800.00 TL"}}]
[null,{"$f":"40671+(365*2)","v":"2013-05-07"},"Birleşik Kurye",{"v":4400,"d":"4,400.00 TL"},{"v":4200,"d":"4,200.00 TL"},{"v":2600,"d":"2,600.00 TL"},{"$f":"'Veri Girişi'!$D8-'Veri Girişi'!$F8","v":{"v":1800,"d":"1,800.00 TL"}},{"$f":"DATE(YEAR('Veri Girişi'!$B8),MONTH('Veri Girişi'!$B8),1)","v":"2013-05-01"},{"$f":"LOOKUP(MONTH('Veri Girişi'!$H8),{1,1;2,1;3,1;4,2;5,2;6,2;7,3;8,3;9,3;10,4;11,4;12,4})","v":{"v":2,"d":"Üç aylık dönem 2"}},{"$f":"YEAR('Veri Girişi'!$B8)","v":2013},{"$f":"MONTH(tblVeriler[[#This Row],[TARİH]])","v":5},{"$f":"SUMIFS('Veri Girişi'!$D$6:$D$24,'Veri Girişi'!$B$6:$B$24,\">=\"&EOMONTH('Veri Girişi'!$B8,-1)+1,'Veri Girişi'!$B$6:$B$24,\"<=\"&EOMONTH('Veri Girişi'!$B8,0))","v":{"v":21800,"d":"21,800.00 TL"}},{"$f":"SUMIFS('Veri Girişi'!$D$6:$D$24,'Veri Girişi'!$B$6:$B$24,\">=\"&DATE(YEAR('Veri Girişi'!$B8),1,1),'Veri Girişi'!$B$6:$B$24,\"<=\"&DATE(YEAR('Veri Girişi'!$B8),12,31),'Veri Girişi'!$I$6:$I$24,'Veri Girişi'!$I8)","v":{"v":50800,"d":"50,800.00 TL"}},{"$f":"SUMIFS('Veri Girişi'!$D$6:$D$24,'Veri Girişi'!$B$6:$B$24,\">=\"&DATE(YEAR('Veri Girişi'!$B8),1,1),'Veri Girişi'!$B$6:$B$24,\"<=\"&DATE(YEAR('Veri Girişi'!$B8),12,31))","v":{"v":143800,"d":"143,800.00 TL"}},{"$f":"IFERROR(TREND($L$6:INDEX($L:$L,ROW(),1),$K$6:INDEX($K:$K,ROW(),1),IF(MONTH('Veri Girişi'!$B8)=12,13,MONTH('Veri Girişi'!$B8)+1)),\"\")","v":{"v":28999.999999999996,"d":"29,000.00 TL"}},{"$f":"IFERROR(TREND($M$6:INDEX($M:$M,ROW(),1),$I$6:INDEX($I:$I,ROW(),1),IF('Veri Girişi'!$I8=4,5,'Veri Girişi'!$I8+1)),\"\")","v":{"v":50800,"d":"50,800.00 TL"}},{"$f":"IFERROR(TREND($N$6:INDEX($N:$N,ROW(),1),$J$6:INDEX($J:$J,ROW(),1),'Veri Girişi'!$J8+1),\"\")","v":{"v":143800,"d":"143,800.00 TL"}}]
[null,{"$f":"40678+(365*2)","v":"2013-05-14"},"Bilgi Pazarlama",{"v":5400,"d":"5,400.00 TL"},{"v":5500,"d":"5,500.00 TL"},{"v":4500,"d":"4,500.00 TL"},{"$f":"'Veri Girişi'!$D9-'Veri Girişi'!$F9","v":{"v":900,"d":"900.00 TL"}},{"$f":"DATE(YEAR('Veri Girişi'!$B9),MONTH('Veri Girişi'!$B9),1)","v":"2013-05-01"},{"$f":"LOOKUP(MONTH('Veri Girişi'!$H9),{1,1;2,1;3,1;4,2;5,2;6,2;7,3;8,3;9,3;10,4;11,4;12,4})","v":{"v":2,"d":"Üç aylık dönem 2"}},{"$f":"YEAR('Veri Girişi'!$B9)","v":2013},{"$f":"MONTH(tblVeriler[[#This Row],[TARİH]])","v":5},{"$f":"SUMIFS('Veri Girişi'!$D$6:$D$24,'Veri Girişi'!$B$6:$B$24,\">=\"&EOMONTH('Veri Girişi'!$B9,-1)+1,'Veri Girişi'!$B$6:$B$24,\"<=\"&EOMONTH('Veri Girişi'!$B9,0))","v":{"v":21800,"d":"21,800.00 TL"}},{"$f":"SUMIFS('Veri Girişi'!$D$6:$D$24,'Veri Girişi'!$B$6:$B$24,\">=\"&DATE(YEAR('Veri Girişi'!$B9),1,1),'Veri Girişi'!$B$6:$B$24,\"<=\"&DATE(YEAR('Veri Girişi'!$B9),12,31),'Veri Girişi'!$I$6:$I$24,'Veri Girişi'!$I9)","v":{"v":50800,"d":"50,800.00 TL"}},{"$f":"SUMIFS('Veri Girişi'!$D$6:$D$24,'Veri Girişi'!$B$6:$B$24,\">=\"&DATE(YEAR('Veri Girişi'!$B9),1,1),'Veri Girişi'!$B$6:$B$24,\"<=\"&DATE(YEAR('Veri Girişi'!$B9),12,31))","v":{"v":143800,"d":"143,800.00 TL"}},{"$f":"IFERROR(TREND($L$6:INDEX($L:$L,ROW(),1),$K$6:INDEX($K:$K,ROW(),1),IF(MONTH('Veri Girişi'!$B9)=12,13,MONTH('Veri Girişi'!$B9)+1)),\"\")","v":{"v":29000,"d":"29,000.00 TL"}},{"$f":"IFERROR(TREND($M$6:INDEX($M:$M,ROW(),1),$I$6:INDEX($I:$I,ROW(),1),IF('Veri Girişi'!$I9=4,5,'Veri Girişi'!$I9+1)),\"\")","v":{"v":50800,"d":"50,800.00 TL"}},{"$f":"IFERROR(TREND($N$6:INDEX($N:$N,ROW(),1),$J$6:INDEX($J:$J,ROW(),1),'Veri Girişi'!$J9+1),\"\")","v":{"v":143800,"d":"143,800.00 TL"}}]
[null,{"$f":"40678+(365*2)","v":"2013-05-14"},"Güzel Sanatlar Akademisi",{"v":5800,"d":"5,800.00 TL"},{"v":6000,"d":"6,000.00 TL"},{"v":4500,"d":"4,500.00 TL"},{"$f":"'Veri Girişi'!$D10-'Veri Girişi'!$F10","v":{"v":1300,"d":"1,300.00 TL"}},{"$f":"DATE(YEAR('Veri Girişi'!$B10),MONTH('Veri Girişi'!$B10),1)","v":"2013-05-01"},{"$f":"LOOKUP(MONTH('Veri Girişi'!$H10),{1,1;2,1;3,1;4,2;5,2;6,2;7,3;8,3;9,3;10,4;11,4;12,4})","v":{"v":2,"d":"Üç aylık dönem 2"}},{"$f":"YEAR('Veri Girişi'!$B10)","v":2013},{"$f":"MONTH(tblVeriler[[#This Row],[TARİH]])","v":5},{"$f":"SUMIFS('Veri Girişi'!$D$6:$D$24,'Veri Girişi'!$B$6:$B$24,\">=\"&EOMONTH('Veri Girişi'!$B10,-1)+1,'Veri Girişi'!$B$6:$B$24,\"<=\"&EOMONTH('Veri Girişi'!$B10,0))","v":{"v":21800,"d":"21,800.00 TL"}},{"$f":"SUMIFS('Veri Girişi'!$D$6:$D$24,'Veri Girişi'!$B$6:$B$24,\">=\"&DATE(YEAR('Veri Girişi'!$B10),1,1),'Veri Girişi'!$B$6:$B$24,\"<=\"&DATE(YEAR('Veri Girişi'!$B10),12,31),'Veri Girişi'!$I$6:$I$24,'Veri Girişi'!$I10)","v":{"v":50800,"d":"50,800.00 TL"}},{"$f":"SUMIFS('Veri Girişi'!$D$6:$D$24,'Veri Girişi'!$B$6:$B$24,\">=\"&DATE(YEAR('Veri Girişi'!$B10),1,1),'Veri Girişi'!$B$6:$B$24,\"<=\"&DATE(YEAR('Veri Girişi'!$B10),12,31))","v":{"v":143800,"d":"143,800.00 TL"}},{"$f":"IFERROR(TREND($L$6:INDEX($L:$L,ROW(),1),$K$6:INDEX($K:$K,ROW(),1),IF(MONTH('Veri Girişi'!$B10)=12,13,MONTH('Veri Girişi'!$B10)+1)),\"\")","v":{"v":29000,"d":"29,000.00 TL"}},{"$f":"IFERROR(TREND($M$6:INDEX($M:$M,ROW(),1),$I$6:INDEX($I:$I,ROW(),1),IF('Veri Girişi'!$I10=4,5,'Veri Girişi'!$I10+1)),\"\")","v":{"v":50800,"d":"50,800.00 TL"}},{"$f":"IFERROR(TREND($N$6:INDEX($N:$N,ROW(),1),$J$6:INDEX($J:$J,ROW(),1),'Veri Girişi'!$J10+1),\"\")","v":{"v":143800,"d":"143,800.00 TL"}}]
[null,{"$f":"40693+(365*2)","v":"2013-05-29"},"Trey Araştırma",{"v":6200,"d":"6,200.00 TL"},{"v":6000,"d":"6,000.00 TL"},{"v":4500,"d":"4,500.00 TL"},{"$f":"'Veri Girişi'!$D11-'Veri Girişi'!$F11","v":{"v":1700,"d":"1,700.00 TL"}},{"$f":"DATE(YEAR('Veri Girişi'!$B11),MONTH('Veri Girişi'!$B11),1)","v":"2013-05-01"},{"$f":"LOOKUP(MONTH('Veri Girişi'!$H11),{1,1;2,1;3,1;4,2;5,2;6,2;7,3;8,3;9,3;10,4;11,4;12,4})","v":{"v":2,"d":"Üç aylık dönem 2"}},{"$f":"YEAR('Veri Girişi'!$B11)","v":2013},{"$f":"MONTH(tblVeriler[[#This Row],[TARİH]])","v":5},{"$f":"SUMIFS('Veri Girişi'!$D$6:$D$24,'Veri Girişi'!$B$6:$B$24,\">=\"&EOMONTH('Veri Girişi'!$B11,-1)+1,'Veri Girişi'!$B$6:$B$24,\"<=\"&EOMONTH('Veri Girişi'!$B11,0))","v":{"v":21800,"d":"21,800.00 TL"}},{"$f":"SUMIFS('Veri Girişi'!$D$6:$D$24,'Veri Girişi'!$B$6:$B$24,\">=\"&DATE(YEAR('Veri Girişi'!$B11),1,1),'Veri Girişi'!$B$6:$B$24,\"<=\"&DATE(YEAR('Veri Girişi'!$B11),12,31),'Veri Girişi'!$I$6:$I$24,'Veri Girişi'!$I11)","v":{"v":50800,"d":"50,800.00 TL"}},{"$f":"SUMIFS('Veri Girişi'!$D$6:$D$24,'Veri Girişi'!$B$6:$B$24,\">=\"&DATE(YEAR('Veri Girişi'!$B11),1,1),'Veri Girişi'!$B$6:$B$24,\"<=\"&DATE(YEAR('Veri Girişi'!$B11),12,31))","v":{"v":143800,"d":"143,800.00 TL"}},{"$f":"IFERROR(TREND($L$6:INDEX($L:$L,ROW(),1),$K$6:INDEX($K:$K,ROW(),1),IF(MONTH('Veri Girişi'!$B11)=12,13,MONTH('Veri Girişi'!$B11)+1)),\"\")","v":{"v":29000,"d":"29,000.00 TL"}},{"$f":"IFERROR(TREND($M$6:INDEX($M:$M,ROW(),1),$I$6:INDEX($I:$I,ROW(),1),IF('Veri Girişi'!$I11=4,5,'Veri Girişi'!$I11+1)),\"\")","v":{"v":50800,"d":"50,800.00 TL"}},{"$f":"IFERROR(TREND($N$6:INDEX($N:$N,ROW(),1),$J$6:INDEX($J:$J,ROW(),1),'Veri Girişi'!$J11+1),\"\")","v":{"v":143800,"d":"143,800.00 TL"}}]
[null,{"$f":"40705+(365*2)","v":"2013-06-10"},"Veri Bilgisayarcılık",{"v":6900,"d":"6,900.00 TL"},{"v":7500,"d":"7,500.00 TL"},{"v":5400,"d":"5,400.00 TL"},{"$f":"'Veri Girişi'!$D12-'Veri Girişi'!$F12","v":{"v":1500,"d":"1,500.00 TL"}},{"$f":"DATE(YEAR('Veri Girişi'!$B12),MONTH('Veri Girişi'!$B12),1)","v":"2013-06-01"},{"$f":"LOOKUP(MONTH('Veri Girişi'!$H12),{1,1;2,1;3,1;4,2;5,2;6,2;7,3;8,3;9,3;10,4;11,4;12,4})","v":{"v":2,"d":"Üç aylık dönem 2"}},{"$f":"YEAR('Veri Girişi'!$B12)","v":2013},{"$f":"MONTH(tblVeriler[[#This Row],[TARİH]])","v":6},{"$f":"SUMIFS('Veri Girişi'!$D$6:$D$24,'Veri Girişi'!$B$6:$B$24,\">=\"&EOMONTH('Veri Girişi'!$B12,-1)+1,'Veri Girişi'!$B$6:$B$24,\"<=\"&EOMONTH('Veri Girişi'!$B12,0))","v":{"v":14400,"d":"14,400.00 TL"}},{"$f":"SUMIFS('Veri Girişi'!$D$6:$D$24,'Veri Girişi'!$B$6:$B$24,\">=\"&DATE(YEAR('Veri Girişi'!$B12),1,1),'Veri Girişi'!$B$6:$B$24,\"<=\"&DATE(YEAR('Veri Girişi'!$B12),12,31),'Veri Girişi'!$I$6:$I$24,'Veri Girişi'!$I12)","v":{"v":50800,"d":"50,800.00 TL"}},{"$f":"SUMIFS('Veri Girişi'!$D$6:$D$24,'Veri Girişi'!$B$6:$B$24,\">=\"&DATE(YEAR('Veri Girişi'!$B12),1,1),'Veri Girişi'!$B$6:$B$24,\"<=\"&DATE(YEAR('Veri Girişi'!$B12),12,31))","v":{"v":143800,"d":"143,800.00 TL"}},{"$f":"IFERROR(TREND($L$6:INDEX($L:$L,ROW(),1),$K$6:INDEX($K:$K,ROW(),1),IF(MONTH('Veri Girişi'!$B12)=12,13,MONTH('Veri Girişi'!$B12)+1)),\"\")","v":{"v":21600.000000000004,"d":"21,600.00 TL"}},{"$f":"IFERROR(TREND($M$6:INDEX($M:$M,ROW(),1),$I$6:INDEX($I:$I,ROW(),1),IF('Veri Girişi'!$I12=4,5,'Veri Girişi'!$I12+1)),\"\")","v":{"v":50800,"d":"50,800.00 TL"}},{"$f":"IFERROR(TREND($N$6:INDEX($N:$N,ROW(),1),$J$6:INDEX($J:$J,ROW(),1),'Veri Girişi'!$J12+1),\"\")","v":{"v":143800,"d":"143,800.00 TL"}}]
[null,{"$f":"40716+(365*2)","v":"2013-06-21"},"Contoso Farmasötik",{"v":7500,"d":"7,500.00 TL"},{"v":7200,"d":"7,200.00 TL"},{"v":6500,"d":"6,500.00 TL"},{"$f":"'Veri Girişi'!$D13-'Veri Girişi'!$F13","v":{"v":1000,"d":"1,000.00 TL"}},{"$f":"DATE(YEAR('Veri Girişi'!$B13),MONTH('Veri Girişi'!$B13),1)","v":"2013-06-01"},{"$f":"LOOKUP(MONTH('Veri Girişi'!$H13),{1,1;2,1;3,1;4,2;5,2;6,2;7,3;8,3;9,3;10,4;11,4;12,4})","v":{"v":2,"d":"Üç aylık dönem 2"}},{"$f":"YEAR('Veri Girişi'!$B13)","v":2013},{"$f":"MONTH(tblVeriler[[#This Row],[TARİH]])","v":6},{"$f":"SUMIFS('Veri Girişi'!$D$6:$D$24,'Veri Girişi'!$B$6:$B$24,\">=\"&EOMONTH('Veri Girişi'!$B13,-1)+1,'Veri Girişi'!$B$6:$B$24,\"<=\"&EOMONTH('Veri Girişi'!$B13,0))","v":{"v":14400,"d":"14,400.00 TL"}},{"$f":"SUMIFS('Veri Girişi'!$D$6:$D$24,'Veri Girişi'!$B$6:$B$24,\">=\"&DATE(YEAR('Veri Girişi'!$B13),1,1),'Veri Girişi'!$B$6:$B$24,\"<=\"&DATE(YEAR('Veri Girişi'!$B13),12,31),'Veri Girişi'!$I$6:$I$24,'Veri Girişi'!$I13)","v":{"v":50800,"d":"50,800.00 TL"}},{"$f":"SUMIFS('Veri Girişi'!$D$6:$D$24,'Veri Girişi'!$B$6:$B$24,\">=\"&DATE(YEAR('Veri Girişi'!$B13),1,1),'Veri Girişi'!$B$6:$B$24,\"<=\"&DATE(YEAR('Veri Girişi'!$B13),12,31))","v":{"v":143800,"d":"143,800.00 TL"}},{"$f":"IFERROR(TREND($L$6:INDEX($L:$L,ROW(),1),$K$6:INDEX($K:$K,ROW(),1),IF(MONTH('Veri Girişi'!$B13)=12,13,MONTH('Veri Girişi'!$B13)+1)),\"\")","v":{"v":17950,"d":"17,950.00 TL"}},{"$f":"IFERROR(TREND($M$6:INDEX($M:$M,ROW(),1),$I$6:INDEX($I:$I,ROW(),1),IF('Veri Girişi'!$I13=4,5,'Veri Girişi'!$I13+1)),\"\")","v":{"v":50800,"d":"50,800.00 TL"}},{"$f":"IFERROR(TREND($N$6:INDEX($N:$N,ROW(),1),$J$6:INDEX($J:$J,ROW(),1),'Veri Girişi'!$J13+1),\"\")","v":{"v":143800,"d":"143,800.00 TL"}}]
[null,{"$f":"40731+(365*2)","v":"2013-07-06"},"Birleşik Kurye",{"v":8700,"d":"8,700.00 TL"},{"v":8500,"d":"8,500.00 TL"},{"v":7250,"d":"7,250.00 TL"},{"$f":"'Veri Girişi'!$D14-'Veri Girişi'!$F14","v":{"v":1450,"d":"1,450.00 TL"}},{"$f":"DATE(YEAR('Veri Girişi'!$B14),MONTH('Veri Girişi'!$B14),1)","v":"2013-07-01"},{"$f":"LOOKUP(MONTH('Veri Girişi'!$H14),{1,1;2,1;3,1;4,2;5,2;6,2;7,3;8,3;9,3;10,4;11,4;12,4})","v":{"v":3,"d":"Üç aylık dönem 3"}},{"$f":"YEAR('Veri Girişi'!$B14)","v":2013},{"$f":"MONTH(tblVeriler[[#This Row],[TARİH]])","v":7},{"$f":"SUMIFS('Veri Girişi'!$D$6:$D$24,'Veri Girişi'!$B$6:$B$24,\">=\"&EOMONTH('Veri Girişi'!$B14,-1)+1,'Veri Girişi'!$B$6:$B$24,\"<=\"&EOMONTH('Veri Girişi'!$B14,0))","v":{"v":8700,"d":"8,700.00 TL"}},{"$f":"SUMIFS('Veri Girişi'!$D$6:$D$24,'Veri Girişi'!$B$6:$B$24,\">=\"&DATE(YEAR('Veri Girişi'!$B14),1,1),'Veri Girişi'!$B$6:$B$24,\"<=\"&DATE(YEAR('Veri Girişi'!$B14),12,31),'Veri Girişi'!$I$6:$I$24,'Veri Girişi'!$I14)","v":{"v":49100,"d":"49,100.00 TL"}},{"$f":"SUMIFS('Veri Girişi'!$D$6:$D$24,'Veri Girişi'!$B$6:$B$24,\">=\"&DATE(YEAR('Veri Girişi'!$B14),1,1),'Veri Girişi'!$B$6:$B$24,\"<=\"&DATE(YEAR('Veri Girişi'!$B14),12,31))","v":{"v":143800,"d":"143,800.00 TL"}},{"$f":"IFERROR(TREND($L$6:INDEX($L:$L,ROW(),1),$K$6:INDEX($K:$K,ROW(),1),IF(MONTH('Veri Girişi'!$B14)=12,13,MONTH('Veri Girişi'!$B14)+1)),\"\")","v":{"v":10776.470588235294,"d":"10,776.47 TL"}},{"$f":"IFERROR(TREND($M$6:INDEX($M:$M,ROW(),1),$I$6:INDEX($I:$I,ROW(),1),IF('Veri Girişi'!$I14=4,5,'Veri Girişi'!$I14+1)),\"\")","v":{"v":47400,"d":"47,400.00 TL"}},{"$f":"IFERROR(TREND($N$6:INDEX($N:$N,ROW(),1),$J$6:INDEX($J:$J,ROW(),1),'Veri Girişi'!$J14+1),\"\")","v":{"v":143800,"d":"143,800.00 TL"}}]
[null,{"$f":"40761+(365*2)","v":"2013-08-05"},"Bilgi Pazarlama",{"v":8500,"d":"8,500.00 TL"},{"v":8300,"d":"8,300.00 TL"},{"v":7100,"d":"7,100.00 TL"},{"$f":"'Veri Girişi'!$D15-'Veri Girişi'!$F15","v":{"v":1400,"d":"1,400.00 TL"}},{"$f":"DATE(YEAR('Veri Girişi'!$B15),MONTH('Veri Girişi'!$B15),1)","v":"2013-08-01"},{"$f":"LOOKUP(MONTH('Veri Girişi'!$H15),{1,1;2,1;3,1;4,2;5,2;6,2;7,3;8,3;9,3;10,4;11,4;12,4})","v":{"v":3,"d":"Üç aylık dönem 3"}},{"$f":"YEAR('Veri Girişi'!$B15)","v":2013},{"$f":"MONTH(tblVeriler[[#This Row],[TARİH]])","v":8},{"$f":"SUMIFS('Veri Girişi'!$D$6:$D$24,'Veri Girişi'!$B$6:$B$24,\">=\"&EOMONTH('Veri Girişi'!$B15,-1)+1,'Veri Girişi'!$B$6:$B$24,\"<=\"&EOMONTH('Veri Girişi'!$B15,0))","v":{"v":16400,"d":"16,400.00 TL"}},{"$f":"SUMIFS('Veri Girişi'!$D$6:$D$24,'Veri Girişi'!$B$6:$B$24,\">=\"&DATE(YEAR('Veri Girişi'!$B15),1,1),'Veri Girişi'!$B$6:$B$24,\"<=\"&DATE(YEAR('Veri Girişi'!$B15),12,31),'Veri Girişi'!$I$6:$I$24,'Veri Girişi'!$I15)","v":{"v":49100,"d":"49,100.00 TL"}},{"$f":"SUMIFS('Veri Girişi'!$D$6:$D$24,'Veri Girişi'!$B$6:$B$24,\">=\"&DATE(YEAR('Veri Girişi'!$B15),1,1),'Veri Girişi'!$B$6:$B$24,\"<=\"&DATE(YEAR('Veri Girişi'!$B15),12,31))","v":{"v":143800,"d":"143,800.00 TL"}},{"$f":"IFERROR(TREND($L$6:INDEX($L:$L,ROW(),1),$K$6:INDEX($K:$K,ROW(),1),IF(MONTH('Veri Girişi'!$B15)=12,13,MONTH('Veri Girişi'!$B15)+1)),\"\")","v":{"v":12455.862068965516,"d":"12,455.86 TL"}},{"$f":"IFERROR(TREND($M$6:INDEX($M:$M,ROW(),1),$I$6:INDEX($I:$I,ROW(),1),IF('Veri Girişi'!$I15=4,5,'Veri Girişi'!$I15+1)),\"\")","v":{"v":47400,"d":"47,400.00 TL"}},{"$f":"IFERROR(TREND($N$6:INDEX($N:$N,ROW(),1),$J$6:INDEX($J:$J,ROW(),1),'Veri Girişi'!$J15+1),\"\")","v":{"v":143800,"d":"143,800.00 TL"}}]
{"$rows_left_out":10}
{"sheet":"Satış Raporu","index":1,"n_rows":28,"n_cols":6,"rows_kept":28}
[]
[null,"AYLIK SATIŞ RAPORU"]
[]
[]
[null,"YIL","ÜÇ AYLIK DÖNEM","AY","ŞİRKET","Toplam TUTAR"]
[null,2013,{"v":2,"d":"Üç aylık dönem 2"},"2013-04-01","Contoso Farmasötik",{"v":8200,"d":"8,200.00 TL"}]
[{"$nulls":4},"Veri Bilgisayarcılık",{"v":6400,"d":"6,400.00 TL"}]
[{"$nulls":3},"2013-05-01","Bilgi Pazarlama",{"v":5400,"d":"5,400.00 TL"}]
[{"$nulls":4},"Birleşik Kurye",{"v":4400,"d":"4,400.00 TL"}]
[{"$nulls":4},"Güzel Sanatlar Akademisi",{"v":5800,"d":"5,800.00 TL"}]
[{"$nulls":4},"Trey Araştırma",{"v":6200,"d":"6,200.00 TL"}]
[{"$nulls":3},"2013-06-01","Contoso Farmasötik",{"v":7500,"d":"7,500.00 TL"}]
[{"$nulls":4},"Veri Bilgisayarcılık",{"v":6900,"d":"6,900.00 TL"}]
[null,null,"Toplam Üç aylık dönem 2",null,null,{"v":50800,"d":"50,800.00 TL"}]
[null,null,{"v":3,"d":"Üç aylık dönem 3"},"2013-07-01","Birleşik Kurye",{"v":8700,"d":"8,700.00 TL"}]
{"$rows_left_out":14}
{"sheet":"Satış Tahmini","index":2,"n_rows":43,"n_cols":10,"rows_kept":43}
[]
[null,"AYLIK SATIŞ TAHMİNİ"]
[null,{"$f":"\"BUGÜNÜN TARİHİ: \"&UPPER(TEXT(TODAY(),\"g aaa, yyyy\"))","v":"BUGÜNÜN TARİHİ: 12 KAS, 2012"},null,{"$f":"--TRIM(RIGHT(B3,LEN(B3)-FIND(\":\",B3)))","v":"2012-11-12"}]
[]
[null,"BU AY","GERÇEK","PLANLANAN","FARK","%","YIL BAŞINDAN BUGÜNE GERÇEK","YIL BAŞINDAN BUGÜNE PLANLANAN","YILBAŞINDAN BUGÜNE FARK","YIL BAŞINDAN BUGÜNE %"]
[null,"Miktar",{"$f":"COUNTIF('Veri Girişi'!$B$6:$B$24,\">=\"&DATE(tYıl,MONTH(tTarih),1))-COUNTIF('Veri Girişi'!$B$6:$B$24,\">\"&EOMONTH(tTarih,0))","v":0},{"$nulls":3},{"$f":"COUNTIF('Veri Girişi'!$B$6:$B$24,\"<=\"&EOMONTH(tTarih,0))","v":0}]
[null,"Satış",{"$f":"SUMIF('Veri Girişi'!$B$6:$B$24,\">=\"&DATE(tYıl,MONTH(tTarih),1),'Veri Girişi'!$D$6:$D$24)-SUMIF('Veri Girişi'!$B$6:$B$24,\">\"&EOMONTH(tTarih,0),'Veri Girişi'!$D$6:$D$24)","v":{"v":0,"d":"0.00 TL"}},{"$f":"SUMIF('Veri Girişi'!$B$6:$B$24,\">=\"&DATE(tYıl,MONTH(tTarih),1),'Veri Girişi'!$E$6:$E$24)-SUMIF('Veri Girişi'!$B$6:$B$24,\">\"&EOMONTH(tTarih,0),'Veri Girişi'!$E$6:$E$24)","v":{"v":0,"d":"0.00 TL"}},{"$f":"D7-C7","v":{"v":0,"d":"0.00 TL"}},{"$f":"IFERROR(D7/C7,\"-\")","v":"-"},{"$f":"SUMIF('Veri Girişi'!$B$6:$B$24,\"<=\"&EOMONTH(tTarih,0),'Veri Girişi'!$D$6:$D$24)","v":{"v":0,"d":"0.00 TL"}},{"$f":"SUMIF('Veri Girişi'!$B$6:$B$24,\"<=\"&EOMONTH(tTarih,0),'Veri Girişi'!$E$6:$E$24)","v":{"v":0,"d":"0.00 TL"}},{"$f":"H7-G7","v":{"v":0,"d":"0.00 TL"}},{"$f":"IFERROR(H7/G7,\"\")","v":""}]
[null,"Gelirler",{"$f":"(SUMIF('Veri Girişi'!$B$6:$B$24,\">=\"&DATE(tYıl,MONTH(tTarih),1),'Veri Girişi'!$D$6:$D$24)-SUMIF('Veri Girişi'!$B$6:$B$24,\">\"&EOMONTH(tTarih,0),'Veri Girişi'!$D$6:$D$24))-(SUMIF('Veri Girişi'!$B$6:$B$24,\">=\"&DATE(tYıl,MONTH(tTarih),1),'Veri Girişi'!$F$6:$F$24)-SUMIF('Veri Girişi'!$B$6:$B$24,\">\"&EOMONTH(tTarih,0),'Veri Girişi'!$F$6:$F$24))","v":{"v":0,"d":"0.00 TL"}},{"$f":"(SUMIF('Veri Girişi'!$B$6:$B$24,\">=\"&DATE(tYıl,MONTH(tTarih),1),'Veri Girişi'!$E$6:$E$24)-SUMIF('Veri Girişi'!$B$6:$B$24,\">\"&EOMONTH(tTarih,0),'Veri Girişi'!$E$6:$E$24))-(SUMIF('Veri Girişi'!$B$6:$B$24,\">=\"&DATE(tYıl,MONTH(tTarih),1),'Veri Girişi'!$F$6:$F$24)-SUMIF('Veri Girişi'!$B$6:$B$24,\">\"&EOMONTH(tTarih,0),'Veri Girişi'!$F$6:$F$24))","v":{"v":0,"d":"0.00 TL"}},{"$f":"D8-C8","v":{"v":0,"d":"0.00 TL"}},{"$f":"IFERROR(D8/C8,\"-\")","v":"-"},{"$f":"SUMIF('Veri Girişi'!$B$6:$B$24,\"<=\"&EOMONTH(tTarih,0),'Veri Girişi'!$F$6:$F$24)","v":{"v":0,"d":"0.00 TL"}},{"$f":"SUMIF('Veri Girişi'!$B$6:$B$24,\"<=\"&EOMONTH(tTarih,0),'Veri Girişi'!$F$6:$F$24)","v":{"v":0,"d":"0.00 TL"}},{"$f":"H8-G8","v":{"v":0,"d":"0.00 TL"}},{"$f":"IFERROR(H8/G8,\"\")","v":""}]
[null,"Aralık",{"$f":"IFERROR(C8/C7,\"-\")","v":"-"},{"$f":"IFERROR(D8/D7,\"-\")","v":"-"},null,{"$f":"IFERROR(F8/F7,\"-\")","v":"-"},{"$f":"IFERROR(G8/G7,\"\")","v":""},{"$f":"IFERROR(H8/H7,\"\")","v":""},null,{"$f":"IFERROR(J8/J7,\"\")","v":""}]
[null,"Sipariş Sayısı",{"$f":"COUNTIF('Veri Girişi'!$B$6:$B$24,\">=\"&DATE(tYıl,MONTH(tTarih),1))-COUNTIF('Veri Girişi'!$B$6:$B$24,\">\"&EOMONTH(tTarih,0))","v":0},{"$nulls":3},{"$f":"COUNTIF('Veri Girişi'!$B$6:$B$24,\">\"&EOMONTH(tTarih,0))","v":19}]
[null,"Ortalama Sipariş",{"$f":"IFERROR(C7/C10,\"-\")","v":"-"},{"$nulls":3},{"$f":"IFERROR(G7/G10,\"-\")","v":{"v":0,"d":"0.00 TL"}}]
[]
[null,"TAHMİN",null,"GELECEK AY",null,"GELECEK ÜÇ AYLIK DÖNEM",null,null,"GELECEK YIL"]
[null,"Satış",null,{"$f":"TREND(tblVeriler[[AY ]],tblVeriler[AY NO (GİZLE)],IF(MONTH(tTarih)=12,13,MONTH(tTarih)+1))","v":{"v":20153.510998307953,"d":"20,153.51 TL"}},null,{"$f":"TREND(tblVeriler[[ÜÇ AYLIK DÖNEM ]],tblVeriler[AY NO (GİZLE)],IF(MONTH(tTarih)=12,13,MONTH(tTarih)+1))","v":{"v":44115.905245346876,"d":"44,115.91 TL"}},null,null,{"$f":"TREND(tblVeriler[[YILLIK ]],tblVeriler[ÜÇ AYLIK DÖNEM],IF(MONTH(tTarih)=12,13,MONTH(tTarih)+1))","v":{"v":143800,"d":"143,800.00 TL"}}]
[]
{"$rows_left_out":10}