{"text_format":"3","workbook":"xlsx","n_sheets":5,"sheets":["Yılbaşından Bugüne Özeti","1. Ç","2. Ç","3. Ç","4. Ç"],"not_rendered":{"defined_names":12},"read":"whole","date_system":"1900"}

{"sheet":"Yılbaşından Bugüne Özeti","index":0,"n_rows":36,"n_cols":12,"rows_kept":36,"merged":[[3,0,3,6]]}
["Şirket Adı"]
["Çalışan Devam Durumu İzleme, Yılbaşından Bugüne Özeti"]
["Tarih"]
[{"$f":"Şirket_Adı","v":"Şirket Adı"},{"$nulls":6},"GİZLİ"]
["Soyadı","Ad","Tatil","Kişisel","Hastalık","SGN","Pozisyon","Müdür","İşe Alınma Tarihi","Açıklamalar","Tatil Günleri \nYıl başına","Tatil Günleri \nKalan"]
["Soyadı","Ad",{"$f":"SUM('1. Ç:4. Ç'!C6)","v":3},{"$f":"SUM('1. Ç:4. Ç'!D6)","v":0},{"$f":"SUM('1. Ç:4. Ç'!E6)","v":1},"xxx-xx-xxxx","Yönetici","Ad",null,null,10,{"$f":"K6-C6","v":7}]
[null,null,{"$f":"SUM('1. Ç:4. Ç'!C7)","v":0},{"$f":"SUM('1. Ç:4. Ç'!D7)","v":0},{"$f":"SUM('1. Ç:4. Ç'!E7)","v":0},{"$nulls":6},{"$f":"K7-C7","v":0}]
[null,null,{"$f":"SUM('1. Ç:4. Ç'!C8)","v":0},{"$f":"SUM('1. Ç:4. Ç'!D8)","v":0},{"$f":"SUM('1. Ç:4. Ç'!E8)","v":0},{"$nulls":6},0]
[null,null,{"$f":"SUM('1. Ç:4. Ç'!C9)","v":0},{"$f":"SUM('1. Ç:4. Ç'!D9)","v":0},{"$f":"SUM('1. Ç:4. Ç'!E9)","v":0},{"$nulls":6},0]
[null,null,{"$f":"SUM('1. Ç:4. Ç'!C10)","v":0},{"$f":"SUM('1. Ç:4. Ç'!D10)","v":0},{"$f":"SUM('1. Ç:4. Ç'!E10)","v":0},{"$nulls":6},0]
[null,null,{"$f":"SUM('1. Ç:4. Ç'!C11)","v":0},{"$f":"SUM('1. Ç:4. Ç'!D11)","v":0},{"$f":"SUM('1. Ç:4. Ç'!E11)","v":0},{"$nulls":6},0]
[null,null,{"$f":"SUM('1. Ç:4. Ç'!C12)","v":0},{"$f":"SUM('1. Ç:4. Ç'!D12)","v":0},{"$f":"SUM('1. Ç:4. Ç'!E12)","v":0},{"$nulls":6},0]
[null,null,{"$f":"SUM('1. Ç:4. Ç'!C13)","v":0},{"$f":"SUM('1. Ç:4. Ç'!D13)","v":0},{"$f":"SUM('1. Ç:4. Ç'!E13)","v":0},{"$nulls":6},0]
[null,null,{"$f":"SUM('1. Ç:4. Ç'!C14)","v":0},{"$f":"SUM('1. Ç:4. Ç'!D14)","v":0},{"$f":"SUM('1. Ç:4. Ç'!E14)","v":0},{"$nulls":6},0]
[null,null,{"$f":"SUM('1. Ç:4. Ç'!C15)","v":0},{"$f":"SUM('1. Ç:4. Ç'!D15)","v":0},{"$f":"SUM('1. Ç:4. Ç'!E15)","v":0},{"$nulls":6},0]
[null,null,{"$f":"SUM('1. Ç:4. Ç'!C16)","v":0},{"$f":"SUM('1. Ç:4. Ç'!D16)","v":0},{"$f":"SUM('1. Ç:4. Ç'!E16)","v":0},{"$nulls":6},0]
[null,null,{"$f":"SUM('1. Ç:4. Ç'!C17)","v":0},{"$f":"SUM('1. Ç:4. Ç'!D17)","v":0},{"$f":"SUM('1. Ç:4. Ç'!E17)","v":0},{"$nulls":6},0]
[null,null,{"$f":"SUM('1. Ç:4. Ç'!C18)","v":0},{"$f":"SUM('1. Ç:4. Ç'!D18)","v":0},{"$f":"SUM('1. Ç:4. Ç'!E18)","v":0},{"$nulls":6},0]
[null,null,{"$f":"SUM('1. Ç:4. Ç'!C19)","v":0},{"$f":"SUM('1. Ç:4. Ç'!D19)","v":0},{"$f":"SUM('1. Ç:4. Ç'!E19)","v":0},{"$nulls":6},0]
[null,null,{"$f":"SUM('1. Ç:4. Ç'!C20)","v":0},{"$f":"SUM('1. Ç:4. Ç'!D20)","v":0},{"$f":"SUM('1. Ç:4. Ç'!E20)","v":0},{"$nulls":6},0]
[null,null,{"$f":"SUM('1. Ç:4. Ç'!C21)","v":0},{"$f":"SUM('1. Ç:4. Ç'!D21)","v":0},{"$f":"SUM('1. Ç:4. Ç'!E21)","v":0},{"$nulls":6},0]
[null,null,{"$f":"SUM('1. Ç:4. Ç'!C22)","v":0},{"$f":"SUM('1. Ç:4. Ç'!D22)","v":0},{"$f":"SUM('1. Ç:4. Ç'!E22)","v":0},{"$nulls":6},0]
[null,null,{"$f":"SUM('1. Ç:4. Ç'!C23)","v":0},{"$f":"SUM('1. Ç:4. Ç'!D23)","v":0},{"$f":"SUM('1. Ç:4. Ç'!E23)","v":0},{"$nulls":6},0]
[null,null,{"$f":"SUM('1. Ç:4. Ç'!C24)","v":0},{"$f":"SUM('1. Ç:4. Ç'!D24)","v":0},{"$f":"SUM('1. Ç:4. Ç'!E24)","v":0},{"$nulls":6},0]
[null,null,{"$f":"SUM('1. Ç:4. Ç'!C25)","v":0},{"$f":"SUM('1. Ç:4. Ç'!D25)","v":0},{"$f":"SUM('1. Ç:4. Ç'!E25)","v":0},{"$nulls":6},0]
[null,null,{"$f":"SUM('1. Ç:4. Ç'!C26)","v":0},{"$f":"SUM('1. Ç:4. Ç'!D26)","v":0},{"$f":"SUM('1. Ç:4. Ç'!E26)","v":0},{"$nulls":6},0]
[null,null,{"$f":"SUM('1. Ç:4. Ç'!C27)","v":0},{"$f":"SUM('1. Ç:4. Ç'!D27)","v":0},{"$f":"SUM('1. Ç:4. Ç'!E27)","v":0},{"$nulls":6},0]
[null,null,{"$f":"SUM('1. Ç:4. Ç'!C28)","v":0},{"$f":"SUM('1. Ç:4. Ç'!D28)","v":0},{"$f":"SUM('1. Ç:4. Ç'!E28)","v":0},{"$nulls":6},0]
[null,null,{"$f":"SUM('1. Ç:4. Ç'!C29)","v":0},{"$f":"SUM('1. Ç:4. Ç'!D29)","v":0},{"$f":"SUM('1. Ç:4. Ç'!E29)","v":0},{"$nulls":6},0]
[null,null,{"$f":"SUM('1. Ç:4. Ç'!C30)","v":0},{"$f":"SUM('1. Ç:4. Ç'!D30)","v":0},{"$f":"SUM('1. Ç:4. Ç'!E30)","v":0},{"$nulls":6},0]
[null,null,{"$f":"SUM('1. Ç:4. Ç'!C31)","v":0},{"$f":"SUM('1. Ç:4. Ç'!D31)","v":0},{"$f":"SUM('1. Ç:4. Ç'!E31)","v":0},{"$nulls":6},0]
[null,null,{"$f":"SUM('1. Ç:4. Ç'!C32)","v":0},{"$f":"SUM('1. Ç:4. Ç'!D32)","v":0},{"$f":"SUM('1. Ç:4. Ç'!E32)","v":0},{"$nulls":6},0]
[null,null,{"$f":"SUM('1. Ç:4. Ç'!C33)","v":0},{"$f":"SUM('1. Ç:4. Ç'!D33)","v":0},{"$f":"SUM('1. Ç:4. Ç'!E33)","v":0},{"$nulls":6},0]
[null,null,{"$f":"SUM('1. Ç:4. Ç'!C34)","v":0},{"$f":"SUM('1. Ç:4. Ç'!D34)","v":0},{"$f":"SUM('1. Ç:4. Ç'!E34)","v":0},{"$nulls":6},0]
[null,null,{"$f":"SUM('1. Ç:4. Ç'!C35)","v":0},{"$f":"SUM('1. Ç:4. Ç'!D35)","v":0},{"$f":"SUM('1. Ç:4. Ç'!E35)","v":0},{"$nulls":6},0]
[null,null,{"$f":"SUM('1. Ç:4. Ç'!C36)","v":0},{"$f":"SUM('1. Ç:4. Ç'!D36)","v":0},{"$f":"SUM('1. Ç:4. Ç'!E36)","v":0},{"$nulls":6},0]

{"sheet":"1. Ç","index":1,"n_rows":36,"n_cols":95,"rows_kept":36,"merged":[[3,0,3,6]]}
[{"$f":"Şirket_Adı","v":"Şirket Adı"}]
["Çalışan Devam Durumu İzleme, 1. Çeyrek"]
["Tarih"]
[{"$f":"Şirket_Adı","v":"Şirket Adı"},{"$nulls":6},"GİZLİ"]
["Soyadı","Ad","Tatil","Kişisel","Hastalık","01.01","02.01","03.01","04.01","05.01","06.01","07.01","08.01","09.01","10.01","11.01","12.01","13.01","14.01","15.01","16.01","17.01","18.01","19.01","20.01","21.01","22.01","23.01","24.01","25.01","26.01","27.01","28.01","29.01","30.01","31.01","01.02","02.02","03.02","04.02","05.02","06.02","07.02","08.02","09.02","10.02","11.02","12.02","13.02","14.02","15.02","16.02","17.02","18.02","19.02","20.02","21.02","22.02","23.02","24.02","25.02","26.02","27.02","28.02","01.03","02.03","03.03","04.03","05.03","06.03","07.03","08.03","09.03","10.03","11.03","12.03","13.03","14.03","15.03","16.03","17.03","18.03","19.03","20.03","21.03","22.03","23.03","24.03","25.03","26.03","27.03","28.03","29.03","30.03","31.03"]
[{"$f":"IF(ISBLANK('Yılbaşından Bugüne Özeti'!A6),\"\",'Yılbaşından Bugüne Özeti'!A6)","v":"Soyadı"},{"$f":"IF(ISBLANK('Yılbaşından Bugüne Özeti'!B6),\"\",'Yılbaşından Bugüne Özeti'!B6)","v":"Ad"},{"$f":"COUNTIF($F6:$CQ6, \"T\")","v":3},{"$f":"COUNTIF($F6:$CQ6, \"K\")","v":0},{"$f":"COUNTIF($F6:$CQ6, \"H\")","v":1},"t","t","t",{"$nulls":4},"h"]
[{"$f":"IF(ISBLANK('Yılbaşından Bugüne Özeti'!A7),\"\",'Yılbaşından Bugüne Özeti'!A7)","v":""},{"$f":"IF(ISBLANK('Yılbaşından Bugüne Özeti'!B7),\"\",'Yılbaşından Bugüne Özeti'!B7)","v":""},0,0,0]
[{"$f":"IF(ISBLANK('Yılbaşından Bugüne Özeti'!A8),\"\",'Yılbaşından Bugüne Özeti'!A8)","v":""},{"$f":"IF(ISBLANK('Yılbaşından Bugüne Özeti'!B8),\"\",'Yılbaşından Bugüne Özeti'!B8)","v":""},0,0,0]
[{"$f":"IF(ISBLANK('Yılbaşından Bugüne Özeti'!A9),\"\",'Yılbaşından Bugüne Özeti'!A9)","v":""},{"$f":"IF(ISBLANK('Yılbaşından Bugüne Özeti'!B9),\"\",'Yılbaşından Bugüne Özeti'!B9)","v":""},0,0,0]
[{"$f":"IF(ISBLANK('Yılbaşından Bugüne Özeti'!A10),\"\",'Yılbaşından Bugüne Özeti'!A10)","v":""},{"$f":"IF(ISBLANK('Yılbaşından Bugüne Özeti'!B10),\"\",'Yılbaşından Bugüne Özeti'!B10)","v":""},0,0,0]
[{"$f":"IF(ISBLANK('Yılbaşından Bugüne Özeti'!A11),\"\",'Yılbaşından Bugüne Özeti'!A11)","v":""},{"$f":"IF(ISBLANK('Yılbaşından Bugüne Özeti'!B11),\"\",'Yılbaşından Bugüne Özeti'!B11)","v":""},0,0,0]
[{"$f":"IF(ISBLANK('Yılbaşından Bugüne Özeti'!A12),\"\",'Yılbaşından Bugüne Özeti'!A12)","v":""},{"$f":"IF(ISBLANK('Yılbaşından Bugüne Özeti'!B12),\"\",'Yılbaşından Bugüne Özeti'!B12)","v":""},0,0,0]
[{"$f":"IF(ISBLANK('Yılbaşından Bugüne Özeti'!A13),\"\",'Yılbaşından Bugüne Özeti'!A13)","v":""},{"$f":"IF(ISBLANK('Yılbaşından Bugüne Özeti'!B13),\"\",'Yılbaşından Bugüne Özeti'!B13)","v":""},0,0,0]
[{"$f":"IF(ISBLANK('Yılbaşından Bugüne Özeti'!A14),\"\",'Yılbaşından Bugüne Özeti'!A14)","v":""},{"$f":"IF(ISBLANK('Yılbaşından Bugüne Özeti'!B14),\"\",'Yılbaşından Bugüne Özeti'!B14)","v":""},0,0,0]
[{"$f":"IF(ISBLANK('Yılbaşından Bugüne Özeti'!A15),\"\",'Yılbaşından Bugüne Özeti'!A15)","v":""},{"$f":"IF(ISBLANK('Yılbaşından Bugüne Özeti'!B15),\"\",'Yılbaşından Bugüne Özeti'!B15)","v":""},0,0,0]
[{"$f":"IF(ISBLANK('Yılbaşından Bugüne Özeti'!A16),\"\",'Yılbaşından Bugüne Özeti'!A16)","v":""},{"$f":"IF(ISBLANK('Yılbaşından Bugüne Özeti'!B16),\"\",'Yılbaşından Bugüne Özeti'!B16)","v":""},0,0,0]
[{"$f":"IF(ISBLANK('Yılbaşından Bugüne Özeti'!A17),\"\",'Yılbaşından Bugüne Özeti'!A17)","v":""},{"$f":"IF(ISBLANK('Yılbaşından Bugüne Özeti'!B17),\"\",'Yılbaşından Bugüne Özeti'!B17)","v":""},0,0,0]
[{"$f":"IF(ISBLANK('Yılbaşından Bugüne Özeti'!A18),\"\",'Yılbaşından Bugüne Özeti'!A18)","v":""},{"$f":"IF(ISBLANK('Yılbaşından Bugüne Özeti'!B18),\"\",'Yılbaşından Bugüne Özeti'!B18)","v":""},0,0,0]
[{"$f":"IF(ISBLANK('Yılbaşından Bugüne Özeti'!A19),\"\",'Yılbaşından Bugüne Özeti'!A19)","v":""},{"$f":"IF(ISBLANK('Yılbaşından Bugüne Özeti'!B19),\"\",'Yılbaşından Bugüne Özeti'!B19)","v":""},0,0,0]
[{"$f":"IF(ISBLANK('Yılbaşından Bugüne Özeti'!A20),\"\",'Yılbaşından Bugüne Özeti'!A20)","v":""},{"$f":"IF(ISBLANK('Yılbaşından Bugüne Özeti'!B20),\"\",'Yılbaşından Bugüne Özeti'!B20)","v":""},0,0,0]
[{"$f":"IF(ISBLANK('Yılbaşından Bugüne Özeti'!A21),\"\",'Yılbaşından Bugüne Özeti'!A21)","v":""},{"$f":"IF(ISBLANK('Yılbaşından Bugüne Özeti'!B21),\"\",'Yılbaşından Bugüne Özeti'!B21)","v":""},0,0,0]
[{"$f":"IF(ISBLANK('Yılbaşından Bugüne Özeti'!A22),\"\",'Yılbaşından Bugüne Özeti'!A22)","v":""},{"$f":"IF(ISBLANK('Yılbaşından Bugüne Özeti'!B22),\"\",'Yılbaşından Bugüne Özeti'!B22)","v":""},0,0,0]
[{"$f":"IF(ISBLANK('Yılbaşından Bugüne Özeti'!A23),\"\",'Yılbaşından Bugüne Özeti'!A23)","v":""},{"$f":"IF(ISBLANK('Yılbaşından Bugüne Özeti'!B23),\"\",'Yılbaşından Bugüne Özeti'!B23)","v":""},0,0,0]
[{"$f":"IF(ISBLANK('Yılbaşından Bugüne Özeti'!A24),\"\",'Yılbaşından Bugüne Özeti'!A24)","v":""},{"$f":"IF(ISBLANK('Yılbaşından Bugüne Özeti'!B24),\"\",'Yılbaşından Bugüne Özeti'!B24)","v":""},0,0,0]
[{"$f":"IF(ISBLANK('Yılbaşından Bugüne Özeti'!A25),\"\",'Yılbaşından Bugüne Özeti'!A25)","v":""},{"$f":"IF(ISBLANK('Yılbaşından Bugüne Özeti'!B25),\"\",'Yılbaşından Bugüne Özeti'!B25)","v":""},0,0,0]
[{"$f":"IF(ISBLANK('Yılbaşından Bugüne Özeti'!A26),\"\",'Yılbaşından Bugüne Özeti'!A26)","v":""},{"$f":"IF(ISBLANK('Yılbaşından Bugüne Özeti'!B26),\"\",'Yılbaşından Bugüne Özeti'!B26)","v":""},0,0,0]
[{"$f":"IF(ISBLANK('Yılbaşından Bugüne Özeti'!A27),\"\",'Yılbaşından Bugüne Özeti'!A27)","v":""},{"$f":"IF(ISBLANK('Yılbaşından Bugüne Özeti'!B27),\"\",'Yılbaşından Bugüne Özeti'!B27)","v":""},0,0,0]
[{"$f":"IF(ISBLANK('Yılbaşından Bugüne Özeti'!A28),\"\",'Yılbaşından Bugüne Özeti'!A28)","v":""},{"$f":"IF(ISBLANK('Yılbaşından Bugüne Özeti'!B28),\"\",'Yılbaşından Bugüne Özeti'!B28)","v":""},0,0,0]
[{"$f":"IF(ISBLANK('Yılbaşından Bugüne Özeti'!A29),\"\",'Yılbaşından Bugüne Özeti'!A29)","v":""},{"$f":"IF(ISBLANK('Yılbaşından Bugüne Özeti'!B29),\"\",'Yılbaşından Bugüne Özeti'!B29)","v":""},0,0,0]
[{"$f":"IF(ISBLANK('Yılbaşından Bugüne Özeti'!A30),\"\",'Yılbaşından Bugüne Özeti'!A30)","v":""},{"$f":"IF(ISBLANK('Yılbaşından Bugüne Özeti'!B30),\"\",'Yılbaşından Bugüne Özeti'!B30)","v":""},0,0,0]
[{"$f":"IF(ISBLANK('Yılbaşından Bugüne Özeti'!A31),\"\",'Yılbaşından Bugüne Özeti'!A31)","v":""},{"$f":"IF(ISBLANK('Yılbaşından Bugüne Özeti'!B31),\"\",'Yılbaşından Bugüne Özeti'!B31)","v":""},0,0,0]
[{"$f":"IF(ISBLANK('Yılbaşından Bugüne Özeti'!A32),\"\",'Yılbaşından Bugüne Özeti'!A32)","v":""},{"$f":"IF(ISBLANK('Yılbaşından Bugüne Özeti'!B32),\"\",'Yılbaşından Bugüne Özeti'!B32)","v":""},0,0,0]
[{"$f":"IF(ISBLANK('Yılbaşından Bugüne Özeti'!A33),\"\",'Yılbaşından Bugüne Özeti'!A33)","v":""},{"$f":"IF(ISBLANK('Yılbaşından Bugüne Özeti'!B33),\"\",'Yılbaşından Bugüne Özeti'!B33)","v":""},0,0,0]
[{"$f":"IF(ISBLANK('Yılbaşından Bugüne Özeti'!A34),\"\",'Yılbaşından Bugüne Özeti'!A34)","v":""},{"$f":"IF(ISBLANK('Yılbaşından Bugüne Özeti'!B34),\"\",'Yılbaşından Bugüne Özeti'!B34)","v":""},0,0,0]
[{"$f":"IF(ISBLANK('Yılbaşından Bugüne Özeti'!A35),\"\",'Yılbaşından Bugüne Özeti'!A35)","v":""},{"$f":"IF(ISBLANK('Yılbaşından Bugüne Özeti'!B35),\"\",'Yılbaşından Bugüne Özeti'!B35)","v":""},0,0,0]
[{"$f":"IF(ISBLANK('Yılbaşından Bugüne Özeti'!A36),\"\",'Yılbaşından Bugüne Özeti'!A36)","v":""},{"$f":"IF(ISBLANK('Yılbaşından Bugüne Özeti'!B36),\"\",'Yılbaşından Bugüne Özeti'!B36)","v":""},0,0,0]

{"sheet":"2. Ç","index":2,"n_rows":36,"n_cols":96,"rows_kept":36,"merged":[[3,0,3,6]]}
[{"$f":"Şirket_Adı","v":"Şirket Adı"}]
["Çalışan Devam Durumu İzleme, 2. Çeyrek"]
["Tarih"]
[{"$f":"Şirket_Adı","v":"Şirket Adı"},{"$nulls":6},"GİZLİ"]
["Soyadı","Ad","Tatil","Kişisel","Hastalık","01.04","02.04","03.04","04.04","05.04","06.04","07.04","08.04","09.04","10.04","11.04","12.04","13.04","14.04","15.04","16.04","17.04","18.04","19.04","20.04","21.04","22.04","23.04","24.04","25.04","26.04","27.04","28.04","29.04","30.04","01.05","02.05","03.05","04.05","05.05","06.05","07.05","08.05","09.05","10.05","11.05","12.05","13.05","14.05","15.05","16.05","17.05","18.05","19.05","20.05","21.05","22.05","23.05","24.05","25.05","26.05","27.05","28.05","29.05","30.05","31.05","01.06","02.06","03.06","04.06","05.06","06.06","07.06","08.06","09.06","10.06","11.06","12.06","13.06","14.06","15.06","16.06","17.06","18.06","19.06","20.06","21.06","22.06","23.06","24.06","25.06","26.06","27.06","28.06","29.06","30.06"]
[{"$f":"IF(ISBLANK('Yılbaşından Bugüne Özeti'!A6),\"\",'Yılbaşından Bugüne Özeti'!A6)","v":"Soyadı"},{"$f":"IF(ISBLANK('Yılbaşından Bugüne Özeti'!B6),\"\",'Yılbaşından Bugüne Özeti'!B6)","v":"Ad"},{"$f":"COUNTIF($F6:$CR6, \"T\")","v":0},{"$f":"COUNTIF($F6:$CR6, \"K\")","v":0},{"$f":"COUNTIF($F6:$CR6, \"H\")","v":0}]
[{"$f":"IF(ISBLANK('Yılbaşından Bugüne Özeti'!A7),\"\",'Yılbaşından Bugüne Özeti'!A7)","v":""},{"$f":"IF(ISBLANK('Yılbaşından Bugüne Özeti'!B7),\"\",'Yılbaşından Bugüne Özeti'!B7)","v":""},0,0,0]
[{"$f":"IF(ISBLANK('Yılbaşından Bugüne Özeti'!A8),\"\",'Yılbaşından Bugüne Özeti'!A8)","v":""},{"$f":"IF(ISBLANK('Yılbaşından Bugüne Özeti'!B8),\"\",'Yılbaşından Bugüne Özeti'!B8)","v":""},0,0,0]
[{"$f":"IF(ISBLANK('Yılbaşından Bugüne Özeti'!A9),\"\",'Yılbaşından Bugüne Özeti'!A9)","v":""},{"$f":"IF(ISBLANK('Yılbaşından Bugüne Özeti'!B9),\"\",'Yılbaşından Bugüne Özeti'!B9)","v":""},0,0,0]
[{"$f":"IF(ISBLANK('Yılbaşından Bugüne Özeti'!A10),\"\",'Yılbaşından Bugüne Özeti'!A10)","v":""},{"$f":"IF(ISBLANK('Yılbaşından Bugüne Özeti'!B10),\"\",'Yılbaşından Bugüne Özeti'!B10)","v":""},0,0,0]
[{"$f":"IF(ISBLANK('Yılbaşından Bugüne Özeti'!A11),\"\",'Yılbaşından Bugüne Özeti'!A11)","v":""},{"$f":"IF(ISBLANK('Yılbaşından Bugüne Özeti'!B11),\"\",'Yılbaşından Bugüne Özeti'!B11)","v":""},0,0,0]
[{"$f":"IF(ISBLANK('Yılbaşından Bugüne Özeti'!A12),\"\",'Yılbaşından Bugüne Özeti'!A12)","v":""},{"$f":"IF(ISBLANK('Yılbaşından Bugüne Özeti'!B12),\"\",'Yılbaşından Bugüne Özeti'!B12)","v":""},0,0,0]
[{"$f":"IF(ISBLANK('Yılbaşından Bugüne Özeti'!A13),\"\",'Yılbaşından Bugüne Özeti'!A13)","v":""},{"$f":"IF(ISBLANK('Yılbaşından Bugüne Özeti'!B13),\"\",'Yılbaşından Bugüne Özeti'!B13)","v":""},0,0,0]
[{"$f":"IF(ISBLANK('Yılbaşından Bugüne Özeti'!A14),\"\",'Yılbaşından Bugüne Özeti'!A14)","v":""},{"$f":"IF(ISBLANK('Yılbaşından Bugüne Özeti'!B14),\"\",'Yılbaşından Bugüne Özeti'!B14)","v":""},0,0,0]
[{"$f":"IF(ISBLANK('Yılbaşından Bugüne Özeti'!A15),\"\",'Yılbaşından Bugüne Özeti'!A15)","v":""},{"$f":"IF(ISBLANK('Yılbaşından Bugüne Özeti'!B15),\"\",'Yılbaşından Bugüne Özeti'!B15)","v":""},0,0,0]
[{"$f":"IF(ISBLANK('Yılbaşından Bugüne Özeti'!A16),\"\",'Yılbaşından Bugüne Özeti'!A16)","v":""},{"$f":"IF(ISBLANK('Yılbaşından Bugüne Özeti'!B16),\"\",'Yılbaşından Bugüne Özeti'!B16)","v":""},0,0,0]
[{"$f":"IF(ISBLANK('Yılbaşından Bugüne Özeti'!A17),\"\",'Yılbaşından Bugüne Özeti'!A17)","v":""},{"$f":"IF(ISBLANK('Yılbaşından Bugüne Özeti'!B17),\"\",'Yılbaşından Bugüne Özeti'!B17)","v":""},0,0,0]
[{"$f":"IF(ISBLANK('Yılbaşından Bugüne Özeti'!A18),\"\",'Yılbaşından Bugüne Özeti'!A18)","v":""},{"$f":"IF(ISBLANK('Yılbaşından Bugüne Özeti'!B18),\"\",'Yılbaşından Bugüne Özeti'!B18)","v":""},0,0,0]
[{"$f":"IF(ISBLANK('Yılbaşından Bugüne Özeti'!A19),\"\",'Yılbaşından Bugüne Özeti'!A19)","v":""},{"$f":"IF(ISBLANK('Yılbaşından Bugüne Özeti'!B19),\"\",'Yılbaşından Bugüne Özeti'!B19)","v":""},0,0,0]
[{"$f":"IF(ISBLANK('Yılbaşından Bugüne Özeti'!A20),\"\",'Yılbaşından Bugüne Özeti'!A20)","v":""},{"$f":"IF(ISBLANK('Yılbaşından Bugüne Özeti'!B20),\"\",'Yılbaşından Bugüne Özeti'!B20)","v":""},0,0,0]
[{"$f":"IF(ISBLANK('Yılbaşından Bugüne Özeti'!A21),\"\",'Yılbaşından Bugüne Özeti'!A21)","v":""},{"$f":"IF(ISBLANK('Yılbaşından Bugüne Özeti'!B21),\"\",'Yılbaşından Bugüne Özeti'!B21)","v":""},0,0,0]
[{"$f":"IF(ISBLANK('Yılbaşından Bugüne Özeti'!A22),\"\",'Yılbaşından Bugüne Özeti'!A22)","v":""},{"$f":"IF(ISBLANK('Yılbaşından Bugüne Özeti'!B22),\"\",'Yılbaşından Bugüne Özeti'!B22)","v":""},0,0,0]
[{"$f":"IF(ISBLANK('Yılbaşından Bugüne Özeti'!A23),\"\",'Yılbaşından Bugüne Özeti'!A23)","v":""},{"$f":"IF(ISBLANK('Yılbaşından Bugüne Özeti'!B23),\"\",'Yılbaşından Bugüne Özeti'!B23)","v":""},0,0,0]
[{"$f":"IF(ISBLANK('Yılbaşından Bugüne Özeti'!A24),\"\",'Yılbaşından Bugüne Özeti'!A24)","v":""},{"$f":"IF(ISBLANK('Yılbaşından Bugüne Özeti'!B24),\"\",'Yılbaşından Bugüne Özeti'!B24)","v":""},0,0,0]
[{"$f":"IF(ISBLANK('Yılbaşından Bugüne Özeti'!A25),\"\",'Yılbaşından Bugüne Özeti'!A25)","v":""},{"$f":"IF(ISBLANK('Yılbaşından Bugüne Özeti'!B25),\"\",'Yılbaşından Bugüne Özeti'!B25)","v":""},0,0,0]
[{"$f":"IF(ISBLANK('Yılbaşından Bugüne Özeti'!A26),\"\",'Yılbaşından Bugüne Özeti'!A26)","v":""},{"$f":"IF(ISBLANK('Yılbaşından Bugüne Özeti'!B26),\"\",'Yılbaşından Bugüne Özeti'!B26)","v":""},0,0,0]
[{"$f":"IF(ISBLANK('Yılbaşından Bugüne Özeti'!A27),\"\",'Yılbaşından Bugüne Özeti'!A27)","v":""},{"$f":"IF(ISBLANK('Yılbaşından Bugüne Özeti'!B27),\"\",'Yılbaşından Bugüne Özeti'!B27)","v":""},0,0,0]
[{"$f":"IF(ISBLANK('Yılbaşından Bugüne Özeti'!A28),\"\",'Yılbaşından Bugüne Özeti'!A28)","v":""},{"$f":"IF(ISBLANK('Yılbaşından Bugüne Özeti'!B28),\"\",'Yılbaşından Bugüne Özeti'!B28)","v":""},0,0,0]
[{"$f":"IF(ISBLANK('Yılbaşından Bugüne Özeti'!A29),\"\",'Yılbaşından Bugüne Özeti'!A29)","v":""},{"$f":"IF(ISBLANK('Yılbaşından Bugüne Özeti'!B29),\"\",'Yılbaşından Bugüne Özeti'!B29)","v":""},0,0,0]
[{"$f":"IF(ISBLANK('Yılbaşından Bugüne Özeti'!A30),\"\",'Yılbaşından Bugüne Özeti'!A30)","v":""},{"$f":"IF(ISBLANK('Yılbaşından Bugüne Özeti'!B30),\"\",'Yılbaşından Bugüne Özeti'!B30)","v":""},0,0,0]
[{"$f":"IF(ISBLANK('Yılbaşından Bugüne Özeti'!A31),\"\",'Yılbaşından Bugüne Özeti'!A31)","v":""},{"$f":"IF(ISBLANK('Yılbaşından Bugüne Özeti'!B31),\"\",'Yılbaşından Bugüne Özeti'!B31)","v":""},0,0,0]
[{"$f":"IF(ISBLANK('Yılbaşından Bugüne Özeti'!A32),\"\",'Yılbaşından Bugüne Özeti'!A32)","v":""},{"$f":"IF(ISBLANK('Yılbaşından Bugüne Özeti'!B32),\"\",'Yılbaşından Bugüne Özeti'!B32)","v":""},0,0,0]
[{"$f":"IF(ISBLANK('Yılbaşından Bugüne Özeti'!A33),\"\",'Yılbaşından Bugüne Özeti'!A33)","v":""},{"$f":"IF(ISBLANK('Yılbaşından Bugüne Özeti'!B33),\"\",'Yılbaşından Bugüne Özeti'!B33)","v":""},0,0,0]
[{"$f":"IF(ISBLANK('Yılbaşından Bugüne Özeti'!A34),\"\",'Yılbaşından Bugüne Özeti'!A34)","v":""},{"$f":"IF(ISBLANK('Yılbaşından Bugüne Özeti'!B34),\"\",'Yılbaşından Bugüne Özeti'!B34)","v":""},0,0,0]
[{"$f":"IF(ISBLANK('Yılbaşından Bugüne Özeti'!A35),\"\",'Yılbaşından Bugüne Özeti'!A35)","v":""},{"$f":"IF(ISBLANK('Yılbaşından Bugüne Özeti'!B35),\"\",'Yılbaşından Bugüne Özeti'!B35)","v":""},0,0,0]
[{"$f":"IF(ISBLANK('Yılbaşından Bugüne Özeti'!A36),\"\",'Yılbaşından Bugüne Özeti'!A36)","v":""},{"$f":"IF(ISBLANK('Yılbaşından Bugüne Özeti'!B36),\"\",'Yılbaşından Bugüne Özeti'!B36)","v":""},0,0,0]

{"sheet":"3. Ç","index":3,"n_rows":36,"n_cols":97,"rows_kept":36,"merged":[[3,0,3,6]]}
[{"$f":"Şirket_Adı","v":"Şirket Adı"}]
["Çalışan Devam Durumu İzleme, 3. Çeyrek"]
["Tarih"]
[{"$f":"Şirket_Adı","v":"Şirket Adı"},{"$nulls":6},"GİZLİ"]
["Soyadı","Ad","Tatil","Kişisel","Hastalık","01.07","02.07","03.07","04.07","05.07","06.07","07.07","08.07","09.07","10.07","11.07","12.07","13.07","14.07","15.07","16.07","17.07","18.07","19.07","20.07","21.07","22.07","23.07","24.07","25.07","26.07","27.07","28.07","29.07","30.07","31.07","01.08","02.08","03.08","04.08","05.08","06.08","07.08","08.08","09.08","10.08","11.08","12.08","13.08","14.08","15.08","16.08","17.08","18.08","19.08","20.08","21.08","22.08","23.08","24.08","25.08","26.08","27.08","28.08","29.08","30.08","31.08","01.09","02.09","03.09","04.09","05.09","06.09","07.09","08.09","09.09","10.09","11.09","12.09","13.09","14.09","15.09","16.09","17.09","18.09","19.09","20.09","21.09","22.09","23.09","24.09","25.09","26.09","27.09","28.09","29.09","30.09"]
[{"$f":"IF(ISBLANK('Yılbaşından Bugüne Özeti'!A6),\"\",'Yılbaşından Bugüne Özeti'!A6)","v":"Soyadı"},{"$f":"IF(ISBLANK('Yılbaşından Bugüne Özeti'!B6),\"\",'Yılbaşından Bugüne Özeti'!B6)","v":"Ad"},{"$f":"COUNTIF($F6:$CS6, \"T\")","v":0},{"$f":"COUNTIF($F6:$CS6, \"K\")","v":0},{"$f":"COUNTIF($F6:$CS6, \"H\")","v":0}]
[{"$f":"IF(ISBLANK('Yılbaşından Bugüne Özeti'!A7),\"\",'Yılbaşından Bugüne Özeti'!A7)","v":""},{"$f":"IF(ISBLANK('Yılbaşından Bugüne Özeti'!B7),\"\",'Yılbaşından Bugüne Özeti'!B7)","v":""},0,0,0]
[{"$f":"IF(ISBLANK('Yılbaşından Bugüne Özeti'!A8),\"\",'Yılbaşından Bugüne Özeti'!A8)","v":""},{"$f":"IF(ISBLANK('Yılbaşından Bugüne Özeti'!B8),\"\",'Yılbaşından Bugüne Özeti'!B8)","v":""},0,0,0]
[{"$f":"IF(ISBLANK('Yılbaşından Bugüne Özeti'!A9),\"\",'Yılbaşından Bugüne Özeti'!A9)","v":""},{"$f":"IF(ISBLANK('Yılbaşından Bugüne Özeti'!B9),\"\",'Yılbaşından Bugüne Özeti'!B9)","v":""},0,0,0]
[{"$f":"IF(ISBLANK('Yılbaşından Bugüne Özeti'!A10),\"\",'Yılbaşından Bugüne Özeti'!A10)","v":""},{"$f":"IF(ISBLANK('Yılbaşından Bugüne Özeti'!B10),\"\",'Yılbaşından Bugüne Özeti'!B10)","v":""},0,0,0]
[{"$f":"IF(ISBLANK('Yılbaşından Bugüne Özeti'!A11),\"\",'Yılbaşından Bugüne Özeti'!A11)","v":""},{"$f":"IF(ISBLANK('Yılbaşından Bugüne Özeti'!B11),\"\",'Yılbaşından Bugüne Özeti'!B11)","v":""},0,0,0]
[{"$f":"IF(ISBLANK('Yılbaşından Bugüne Özeti'!A12),\"\",'Yılbaşından Bugüne Özeti'!A12)","v":""},{"$f":"IF(ISBLANK('Yılbaşından Bugüne Özeti'!B12),\"\",'Yılbaşından Bugüne Özeti'!B12)","v":""},0,0,0]
[{"$f":"IF(ISBLANK('Yılbaşından Bugüne Özeti'!A13),\"\",'Yılbaşından Bugüne Özeti'!A13)","v":""},{"$f":"IF(ISBLANK('Yılbaşından Bugüne Özeti'!B13),\"\",'Yılbaşından Bugüne Özeti'!B13)","v":""},0,0,0]
[{"$f":"IF(ISBLANK('Yılbaşından Bugüne Özeti'!A14),\"\",'Yılbaşından Bugüne Özeti'!A14)","v":""},{"$f":"IF(ISBLANK('Yılbaşından Bugüne Özeti'!B14),\"\",'Yılbaşından Bugüne Özeti'!B14)","v":""},0,0,0]
[{"$f":"IF(ISBLANK('Yılbaşından Bugüne Özeti'!A15),\"\",'Yılbaşından Bugüne Özeti'!A15)","v":""},{"$f":"IF(ISBLANK('Yılbaşından Bugüne Özeti'!B15),\"\",'Yılbaşından Bugüne Özeti'!B15)","v":""},0,0,0]
[{"$f":"IF(ISBLANK('Yılbaşından Bugüne Özeti'!A16),\"\",'Yılbaşından Bugüne Özeti'!A16)","v":""},{"$f":"IF(ISBLANK('Yılbaşından Bugüne Özeti'!B16),\"\",'Yılbaşından Bugüne Özeti'!B16)","v":""},0,0,0]
[{"$f":"IF(ISBLANK('Yılbaşından Bugüne Özeti'!A17),\"\",'Yılbaşından Bugüne Özeti'!A17)","v":""},{"$f":"IF(ISBLANK('Yılbaşından Bugüne Özeti'!B17),\"\",'Yılbaşından Bugüne Özeti'!B17)","v":""},0,0,0]
[{"$f":"IF(ISBLANK('Yılbaşından Bugüne Özeti'!A18),\"\",'Yılbaşından Bugüne Özeti'!A18)","v":""},{"$f":"IF(ISBLANK('Yılbaşından Bugüne Özeti'!B18),\"\",'Yılbaşından Bugüne Özeti'!B18)","v":""},0,0,0]
[{"$f":"IF(ISBLANK('Yılbaşından Bugüne Özeti'!A19),\"\",'Yılbaşından Bugüne Özeti'!A19)","v":""},{"$f":"IF(ISBLANK('Yılbaşından Bugüne Özeti'!B19),\"\",'Yılbaşından Bugüne Özeti'!B19)","v":""},0,0,0]
[{"$f":"IF(ISBLANK('Yılbaşından Bugüne Özeti'!A20),\"\",'Yılbaşından Bugüne Özeti'!A20)","v":""},{"$f":"IF(ISBLANK('Yılbaşından Bugüne Özeti'!B20),\"\",'Yılbaşından Bugüne Özeti'!B20)","v":""},0,0,0]
[{"$f":"IF(ISBLANK('Yılbaşından Bugüne Özeti'!A21),\"\",'Yılbaşından Bugüne Özeti'!A21)","v":""},{"$f":"IF(ISBLANK('Yılbaşından Bugüne Özeti'!B21),\"\",'Yılbaşından Bugüne Özeti'!B21)","v":""},0,0,0]
[{"$f":"IF(ISBLANK('Yılbaşından Bugüne Özeti'!A22),\"\",'Yılbaşından Bugüne Özeti'!A22)","v":""},{"$f":"IF(ISBLANK('Yılbaşından Bugüne Özeti'!B22),\"\",'Yılbaşından Bugüne Özeti'!B22)","v":""},0,0,0]
[{"$f":"IF(ISBLANK('Yılbaşından Bugüne Özeti'!A23),\"\",'Yılbaşından Bugüne Özeti'!A23)","v":""},{"$f":"IF(ISBLANK('Yılbaşından Bugüne Özeti'!B23),\"\",'Yılbaşından Bugüne Özeti'!B23)","v":""},0,0,0]
[{"$f":"IF(ISBLANK('Yılbaşından Bugüne Özeti'!A24),\"\",'Yılbaşından Bugüne Özeti'!A24)","v":""},{"$f":"IF(ISBLANK('Yılbaşından Bugüne Özeti'!B24),\"\",'Yılbaşından Bugüne Özeti'!B24)","v":""},0,0,0]
[{"$f":"IF(ISBLANK('Yılbaşından Bugüne Özeti'!A25),\"\",'Yılbaşından Bugüne Özeti'!A25)","v":""},{"$f":"IF(ISBLANK('Yılbaşından Bugüne Özeti'!B25),\"\",'Yılbaşından Bugüne Özeti'!B25)","v":""},0,0,0]
[{"$f":"IF(ISBLANK('Yılbaşından Bugüne Özeti'!A26),\"\",'Yılbaşından Bugüne Özeti'!A26)","v":""},{"$f":"IF(ISBLANK('Yılbaşından Bugüne Özeti'!B26),\"\",'Yılbaşından Bugüne Özeti'!B26)","v":""},0,0,0]
[{"$f":"IF(ISBLANK('Yılbaşından Bugüne Özeti'!A27),\"\",'Yılbaşından Bugüne Özeti'!A27)","v":""},{"$f":"IF(ISBLANK('Yılbaşından Bugüne Özeti'!B27),\"\",'Yılbaşından Bugüne Özeti'!B27)","v":""},0,0,0]
[{"$f":"IF(ISBLANK('Yılbaşından Bugüne Özeti'!A28),\"\",'Yılbaşından Bugüne Özeti'!A28)","v":""},{"$f":"IF(ISBLANK('Yılbaşından Bugüne Özeti'!B28),\"\",'Yılbaşından Bugüne Özeti'!B28)","v":""},0,0,0]
[{"$f":"IF(ISBLANK('Yılbaşından Bugüne Özeti'!A29),\"\",'Yılbaşından Bugüne Özeti'!A29)","v":""},{"$f":"IF(ISBLANK('Yılbaşından Bugüne Özeti'!B29),\"\",'Yılbaşından Bugüne Özeti'!B29)","v":""},0,0,0]
[{"$f":"IF(ISBLANK('Yılbaşından Bugüne Özeti'!A30),\"\",'Yılbaşından Bugüne Özeti'!A30)","v":""},{"$f":"IF(ISBLANK('Yılbaşından Bugüne Özeti'!B30),\"\",'Yılbaşından Bugüne Özeti'!B30)","v":""},0,0,0]
[{"$f":"IF(ISBLANK('Yılbaşından Bugüne Özeti'!A31),\"\",'Yılbaşından Bugüne Özeti'!A31)","v":""},{"$f":"IF(ISBLANK('Yılbaşından Bugüne Özeti'!B31),\"\",'Yılbaşından Bugüne Özeti'!B31)","v":""},0,0,0]
[{"$f":"IF(ISBLANK('Yılbaşından Bugüne Özeti'!A32),\"\",'Yılbaşından Bugüne Özeti'!A32)","v":""},{"$f":"IF(ISBLANK('Yılbaşından Bugüne Özeti'!B32),\"\",'Yılbaşından Bugüne Özeti'!B32)","v":""},0,0,0]
[{"$f":"IF(ISBLANK('Yılbaşından Bugüne Özeti'!A33),\"\",'Yılbaşından Bugüne Özeti'!A33)","v":""},{"$f":"IF(ISBLANK('Yılbaşından Bugüne Özeti'!B33),\"\",'Yılbaşından Bugüne Özeti'!B33)","v":""},0,0,0]
[{"$f":"IF(ISBLANK('Yılbaşından Bugüne Özeti'!A34),\"\",'Yılbaşından Bugüne Özeti'!A34)","v":""},{"$f":"IF(ISBLANK('Yılbaşından Bugüne Özeti'!B34),\"\",'Yılbaşından Bugüne Özeti'!B34)","v":""},0,0,0]
[{"$f":"IF(ISBLANK('Yılbaşından Bugüne Özeti'!A35),\"\",'Yılbaşından Bugüne Özeti'!A35)","v":""},{"$f":"IF(ISBLANK('Yılbaşından Bugüne Özeti'!B35),\"\",'Yılbaşından Bugüne Özeti'!B35)","v":""},0,0,0]
[{"$f":"IF(ISBLANK('Yılbaşından Bugüne Özeti'!A36),\"\",'Yılbaşından Bugüne Özeti'!A36)","v":""},{"$f":"IF(ISBLANK('Yılbaşından Bugüne Özeti'!B36),\"\",'Yılbaşından Bugüne Özeti'!B36)","v":""},0,0,0]

{"sheet":"4. Ç","index":4,"n_rows":36,"n_cols":97,"rows_kept":36,"merged":[[3,0,3,6]]}
[{"$f":"Şirket_Adı","v":"Şirket Adı"}]
["Çalışan Devam Durumu İzleme, 4. Çeyrek"]
["Tarih"]
[{"$f":"Şirket_Adı","v":"Şirket Adı"},{"$nulls":6},"GİZLİ"]
["Soyadı","Ad","Tatil","Kişisel","Hastalık","01.10","02.10","03.10","04.10","05.10","06.10","07.10","08.10","09.10","10.10","11.10","12.10","13.10","14.10","15.10","16.10","17.10","18.10","19.10","20.10","21.10","22.10","23.10","24.10","25.10","26.10","27.10","28.10","29.10","30.10","31.10","01.11","02.11","03.11","04.11","05.11","06.11","07.11","08.11","09.11","10.11","11.11","12.11","13.11","14.11","15.11","16.11","17.11","18.11","19.11","20.11","21.11","22.11","23.11","24.11","25.11","26.11","27.11","28.11","29.11","30.11","01.12","02.12","03.12","04.12","05.12","06.12","07.12","08.12","09.12","10.12","11.12","12.12","13.12","14.12","15.12","16.12","17.12","18.12","19.12","20.12","21.12","22.12","23.12","24.12","25.12","26.12","27.12","28.12","29.12","30.12","31.12"]
[{"$f":"IF(ISBLANK('Yılbaşından Bugüne Özeti'!A6),\"\",'Yılbaşından Bugüne Özeti'!A6)","v":"Soyadı"},{"$f":"IF(ISBLANK('Yılbaşından Bugüne Özeti'!B6),\"\",'Yılbaşından Bugüne Özeti'!B6)","v":"Ad"},{"$f":"COUNTIF($F6:$CS6, \"T\")","v":0},{"$f":"COUNTIF($F6:CS6, \"K\")","v":0},{"$f":"COUNTIF($F6:CS6, \"H\")","v":0}]
[{"$f":"IF(ISBLANK('Yılbaşından Bugüne Özeti'!A7),\"\",'Yılbaşından Bugüne Özeti'!A7)","v":""},{"$f":"IF(ISBLANK('Yılbaşından Bugüne Özeti'!B7),\"\",'Yılbaşından Bugüne Özeti'!B7)","v":""},0,{"$f":"COUNTIF($F7:CS7, \"K\")","v":0},{"$f":"COUNTIF($F7:CS7, \"H\")","v":0}]
[{"$f":"IF(ISBLANK('Yılbaşından Bugüne Özeti'!A8),\"\",'Yılbaşından Bugüne Özeti'!A8)","v":""},{"$f":"IF(ISBLANK('Yılbaşından Bugüne Özeti'!B8),\"\",'Yılbaşından Bugüne Özeti'!B8)","v":""},0,{"$f":"COUNTIF($F8:CS8, \"K\")","v":0},{"$f":"COUNTIF($F8:CS8, \"H\")","v":0}]
[{"$f":"IF(ISBLANK('Yılbaşından Bugüne Özeti'!A9),\"\",'Yılbaşından Bugüne Özeti'!A9)","v":""},{"$f":"IF(ISBLANK('Yılbaşından Bugüne Özeti'!B9),\"\",'Yılbaşından Bugüne Özeti'!B9)","v":""},0,{"$f":"COUNTIF($F9:CS9, \"K\")","v":0},{"$f":"COUNTIF($F9:CS9, \"H\")","v":0}]
[{"$f":"IF(ISBLANK('Yılbaşından Bugüne Özeti'!A10),\"\",'Yılbaşından Bugüne Özeti'!A10)","v":""},{"$f":"IF(ISBLANK('Yılbaşından Bugüne Özeti'!B10),\"\",'Yılbaşından Bugüne Özeti'!B10)","v":""},0,{"$f":"COUNTIF($F10:CS10, \"K\")","v":0},{"$f":"COUNTIF($F10:CS10, \"H\")","v":0}]
[{"$f":"IF(ISBLANK('Yılbaşından Bugüne Özeti'!A11),\"\",'Yılbaşından Bugüne Özeti'!A11)","v":""},{"$f":"IF(ISBLANK('Yılbaşından Bugüne Özeti'!B11),\"\",'Yılbaşından Bugüne Özeti'!B11)","v":""},0,{"$f":"COUNTIF($F11:CS11, \"K\")","v":0},{"$f":"COUNTIF($F11:CS11, \"H\")","v":0}]
[{"$f":"IF(ISBLANK('Yılbaşından Bugüne Özeti'!A12),\"\",'Yılbaşından Bugüne Özeti'!A12)","v":""},{"$f":"IF(ISBLANK('Yılbaşından Bugüne Özeti'!B12),\"\",'Yılbaşından Bugüne Özeti'!B12)","v":""},0,{"$f":"COUNTIF($F12:CS12, \"K\")","v":0},{"$f":"COUNTIF($F12:CS12, \"H\")","v":0}]
[{"$f":"IF(ISBLANK('Yılbaşından Bugüne Özeti'!A13),\"\",'Yılbaşından Bugüne Özeti'!A13)","v":""},{"$f":"IF(ISBLANK('Yılbaşından Bugüne Özeti'!B13),\"\",'Yılbaşından Bugüne Özeti'!B13)","v":""},0,{"$f":"COUNTIF($F13:CS13, \"K\")","v":0},{"$f":"COUNTIF($F13:CS13, \"H\")","v":0}]
[{"$f":"IF(ISBLANK('Yılbaşından Bugüne Özeti'!A14),\"\",'Yılbaşından Bugüne Özeti'!A14)","v":""},{"$f":"IF(ISBLANK('Yılbaşından Bugüne Özeti'!B14),\"\",'Yılbaşından Bugüne Özeti'!B14)","v":""},0,{"$f":"COUNTIF($F14:CS14, \"K\")","v":0},{"$f":"COUNTIF($F14:CS14, \"H\")","v":0}]
[{"$f":"IF(ISBLANK('Yılbaşından Bugüne Özeti'!A15),\"\",'Yılbaşından Bugüne Özeti'!A15)","v":""},{"$f":"IF(ISBLANK('Yılbaşından Bugüne Özeti'!B15),\"\",'Yılbaşından Bugüne Özeti'!B15)","v":""},0,{"$f":"COUNTIF($F15:CS15, \"K\")","v":0},{"$f":"COUNTIF($F15:CS15, \"H\")","v":0}]
[{"$f":"IF(ISBLANK('Yılbaşından Bugüne Özeti'!A16),\"\",'Yılbaşından Bugüne Özeti'!A16)","v":""},{"$f":"IF(ISBLANK('Yılbaşından Bugüne Özeti'!B16),\"\",'Yılbaşından Bugüne Özeti'!B16)","v":""},0,{"$f":"COUNTIF($F16:CS16, \"K\")","v":0},{"$f":"COUNTIF($F16:CS16, \"H\")","v":0}]
[{"$f":"IF(ISBLANK('Yılbaşından Bugüne Özeti'!A17),\"\",'Yılbaşından Bugüne Özeti'!A17)","v":""},{"$f":"IF(ISBLANK('Yılbaşından Bugüne Özeti'!B17),\"\",'Yılbaşından Bugüne Özeti'!B17)","v":""},0,{"$f":"COUNTIF($F17:CS17, \"K\")","v":0},{"$f":"COUNTIF($F17:CS17, \"H\")","v":0}]
[{"$f":"IF(ISBLANK('Yılbaşından Bugüne Özeti'!A18),\"\",'Yılbaşından Bugüne Özeti'!A18)","v":""},{"$f":"IF(ISBLANK('Yılbaşından Bugüne Özeti'!B18),\"\",'Yılbaşından Bugüne Özeti'!B18)","v":""},0,{"$f":"COUNTIF($F18:CS18, \"K\")","v":0},{"$f":"COUNTIF($F18:CS18, \"H\")","v":0}]
[{"$f":"IF(ISBLANK('Yılbaşından Bugüne Özeti'!A19),\"\",'Yılbaşından Bugüne Özeti'!A19)","v":""},{"$f":"IF(ISBLANK('Yılbaşından Bugüne Özeti'!B19),\"\",'Yılbaşından Bugüne Özeti'!B19)","v":""},0,{"$f":"COUNTIF($F19:CS19, \"K\")","v":0},{"$f":"COUNTIF($F19:CS19, \"H\")","v":0}]
[{"$f":"IF(ISBLANK('Yılbaşından Bugüne Özeti'!A20),\"\",'Yılbaşından Bugüne Özeti'!A20)","v":""},{"$f":"IF(ISBLANK('Yılbaşından Bugüne Özeti'!B20),\"\",'Yılbaşından Bugüne Özeti'!B20)","v":""},0,{"$f":"COUNTIF($F20:CS20, \"K\")","v":0},{"$f":"COUNTIF($F20:CS20, \"H\")","v":0}]
[{"$f":"IF(ISBLANK('Yılbaşından Bugüne Özeti'!A21),\"\",'Yılbaşından Bugüne Özeti'!A21)","v":""},{"$f":"IF(ISBLANK('Yılbaşından Bugüne Özeti'!B21),\"\",'Yılbaşından Bugüne Özeti'!B21)","v":""},0,{"$f":"COUNTIF($F21:CS21, \"K\")","v":0},{"$f":"COUNTIF($F21:CS21, \"H\")","v":0}]
[{"$f":"IF(ISBLANK('Yılbaşından Bugüne Özeti'!A22),\"\",'Yılbaşından Bugüne Özeti'!A22)","v":""},{"$f":"IF(ISBLANK('Yılbaşından Bugüne Özeti'!B22),\"\",'Yılbaşından Bugüne Özeti'!B22)","v":""},0,{"$f":"COUNTIF($F22:CS22, \"K\")","v":0},{"$f":"COUNTIF($F22:CS22, \"H\")","v":0}]
[{"$f":"IF(ISBLANK('Yılbaşından Bugüne Özeti'!A23),\"\",'Yılbaşından Bugüne Özeti'!A23)","v":""},{"$f":"IF(ISBLANK('Yılbaşından Bugüne Özeti'!B23),\"\",'Yılbaşından Bugüne Özeti'!B23)","v":""},0,{"$f":"COUNTIF($F23:CS23, \"K\")","v":0},{"$f":"COUNTIF($F23:CS23, \"H\")","v":0}]
[{"$f":"IF(ISBLANK('Yılbaşından Bugüne Özeti'!A24),\"\",'Yılbaşından Bugüne Özeti'!A24)","v":""},{"$f":"IF(ISBLANK('Yılbaşından Bugüne Özeti'!B24),\"\",'Yılbaşından Bugüne Özeti'!B24)","v":""},0,{"$f":"COUNTIF($F24:CS24, \"K\")","v":0},{"$f":"COUNTIF($F24:CS24, \"H\")","v":0}]
[{"$f":"IF(ISBLANK('Yılbaşından Bugüne Özeti'!A25),\"\",'Yılbaşından Bugüne Özeti'!A25)","v":""},{"$f":"IF(ISBLANK('Yılbaşından Bugüne Özeti'!B25),\"\",'Yılbaşından Bugüne Özeti'!B25)","v":""},0,{"$f":"COUNTIF($F25:CS25, \"K\")","v":0},{"$f":"COUNTIF($F25:CS25, \"H\")","v":0}]
[{"$f":"IF(ISBLANK('Yılbaşından Bugüne Özeti'!A26),\"\",'Yılbaşından Bugüne Özeti'!A26)","v":""},{"$f":"IF(ISBLANK('Yılbaşından Bugüne Özeti'!B26),\"\",'Yılbaşından Bugüne Özeti'!B26)","v":""},0,{"$f":"COUNTIF($F26:CS26, \"K\")","v":0},{"$f":"COUNTIF($F26:CS26, \"H\")","v":0}]
[{"$f":"IF(ISBLANK('Yılbaşından Bugüne Özeti'!A27),\"\",'Yılbaşından Bugüne Özeti'!A27)","v":""},{"$f":"IF(ISBLANK('Yılbaşından Bugüne Özeti'!B27),\"\",'Yılbaşından Bugüne Özeti'!B27)","v":""},0,{"$f":"COUNTIF($F27:CS27, \"K\")","v":0},{"$f":"COUNTIF($F27:CS27, \"H\")","v":0}]
[{"$f":"IF(ISBLANK('Yılbaşından Bugüne Özeti'!A28),\"\",'Yılbaşından Bugüne Özeti'!A28)","v":""},{"$f":"IF(ISBLANK('Yılbaşından Bugüne Özeti'!B28),\"\",'Yılbaşından Bugüne Özeti'!B28)","v":""},0,{"$f":"COUNTIF($F28:CS28, \"K\")","v":0},{"$f":"COUNTIF($F28:CS28, \"H\")","v":0}]
[{"$f":"IF(ISBLANK('Yılbaşından Bugüne Özeti'!A29),\"\",'Yılbaşından Bugüne Özeti'!A29)","v":""},{"$f":"IF(ISBLANK('Yılbaşından Bugüne Özeti'!B29),\"\",'Yılbaşından Bugüne Özeti'!B29)","v":""},0,{"$f":"COUNTIF($F29:CS29, \"K\")","v":0},{"$f":"COUNTIF($F29:CS29, \"H\")","v":0}]
[{"$f":"IF(ISBLANK('Yılbaşından Bugüne Özeti'!A30),\"\",'Yılbaşından Bugüne Özeti'!A30)","v":""},{"$f":"IF(ISBLANK('Yılbaşından Bugüne Özeti'!B30),\"\",'Yılbaşından Bugüne Özeti'!B30)","v":""},0,{"$f":"COUNTIF($F30:CS30, \"K\")","v":0},{"$f":"COUNTIF($F30:CS30, \"H\")","v":0}]
[{"$f":"IF(ISBLANK('Yılbaşından Bugüne Özeti'!A31),\"\",'Yılbaşından Bugüne Özeti'!A31)","v":""},{"$f":"IF(ISBLANK('Yılbaşından Bugüne Özeti'!B31),\"\",'Yılbaşından Bugüne Özeti'!B31)","v":""},0,{"$f":"COUNTIF($F31:CS31, \"K\")","v":0},{"$f":"COUNTIF($F31:CS31, \"H\")","v":0}]
[{"$f":"IF(ISBLANK('Yılbaşından Bugüne Özeti'!A32),\"\",'Yılbaşından Bugüne Özeti'!A32)","v":""},{"$f":"IF(ISBLANK('Yılbaşından Bugüne Özeti'!B32),\"\",'Yılbaşından Bugüne Özeti'!B32)","v":""},0,{"$f":"COUNTIF($F32:CS32, \"K\")","v":0},{"$f":"COUNTIF($F32:CS32, \"H\")","v":0}]
[{"$f":"IF(ISBLANK('Yılbaşından Bugüne Özeti'!A33),\"\",'Yılbaşından Bugüne Özeti'!A33)","v":""},{"$f":"IF(ISBLANK('Yılbaşından Bugüne Özeti'!B33),\"\",'Yılbaşından Bugüne Özeti'!B33)","v":""},0,{"$f":"COUNTIF($F33:CS33, \"K\")","v":0},{"$f":"COUNTIF($F33:CS33, \"H\")","v":0}]
[{"$f":"IF(ISBLANK('Yılbaşından Bugüne Özeti'!A34),\"\",'Yılbaşından Bugüne Özeti'!A34)","v":""},{"$f":"IF(ISBLANK('Yılbaşından Bugüne Özeti'!B34),\"\",'Yılbaşından Bugüne Özeti'!B34)","v":""},0,{"$f":"COUNTIF($F34:CS34, \"K\")","v":0},{"$f":"COUNTIF($F34:CS34, \"H\")","v":0}]
[{"$f":"IF(ISBLANK('Yılbaşından Bugüne Özeti'!A35),\"\",'Yılbaşından Bugüne Özeti'!A35)","v":""},{"$f":"IF(ISBLANK('Yılbaşından Bugüne Özeti'!B35),\"\",'Yılbaşından Bugüne Özeti'!B35)","v":""},0,{"$f":"COUNTIF($F35:CS35, \"K\")","v":0},{"$f":"COUNTIF($F35:CS35, \"H\")","v":0}]
[{"$f":"IF(ISBLANK('Yılbaşından Bugüne Özeti'!A36),\"\",'Yılbaşından Bugüne Özeti'!A36)","v":""},{"$f":"IF(ISBLANK('Yılbaşından Bugüne Özeti'!B36),\"\",'Yılbaşından Bugüne Özeti'!B36)","v":""},0,{"$f":"COUNTIF($F36:CS36, \"K\")","v":0},{"$f":"COUNTIF($F36:CS36, \"H\")","v":0}]