{"text_format":"3","workbook":"xlsx","n_sheets":4,"sheets":["Sammanfattning av månadsbudget","Intäkter","Personalkostnader","Rörelsekostnader"],"not_rendered":{"charts":1,"defined_names":14},"read":"whole","date_system":"1900"}

{"sheet":"Sammanfattning av månadsbudget","index":0,"n_rows":17,"n_cols":5,"rows_kept":17,"merged":[[0,1,0,3],[1,1,1,3],[1,4,1,5]]}
[null,"FÖRETAGETS NAMN"]
[null,"MÅNADSBUDGET",null,null,"Datum"]
[]
[null,"BUDGETSUMMOR","BERÄKNADE","FAKTISKA","SKILLNAD"]
[null,"Intäkter",{"$f":"Intäkter[[#Totals],[BERÄKNADE]]","v":{"v":63300,"d":"63,300.00"}},{"$f":"Intäkter[[#Totals],[FAKTISKA]]","v":{"v":57450,"d":"57,450.00"}},{"$f":"Summor[[#This Row],[FAKTISKA]]-Summor[[#This Row],[BERÄKNADE]]","v":{"v":-5850,"d":"-5,850.00 "}}]
[null,"Utgifter",{"$f":"Rörelsekostnader[[#Totals],[BERÄKNADE]]+Personalkostnader[[#Totals],[BERÄKNADE]]","v":{"v":54500,"d":"54,500.00"}},{"$f":"Rörelsekostnader[[#Totals],[FAKTISKA]]+Personalkostnader[[#Totals],[FAKTISKA]]","v":{"v":49630,"d":"49,630.00"}},{"$f":"Summor[[#This Row],[BERÄKNADE]]-Summor[[#This Row],[FAKTISKA]]","v":{"v":4870,"d":"4,870.00"}}]
[null,"Saldo (intäkter minus utgifter)",{"$f":"C5-C6","v":{"v":8800,"d":"8,800.00"}},{"$f":"D5-D6","v":{"v":7820,"d":"7,820.00"}},{"$f":"Summor[[#Totals],[FAKTISKA]]-Summor[[#Totals],[BERÄKNADE]]","v":{"v":-980,"d":"-980.00 "}}]
[]
[]
[null,"VILKA ÄR MINA 5 HÖGSTA RÖRELSEKOSTNADER?"]
[null,"UTGIFTER","BELOPP","% AV UTGIFTER","15 % AVDRAG"]
[null,{"$f":"INDEX(Rörelsekostnader[],MATCH(Top5Expenses[[#This Row],[BELOPP]],Rörelsekostnader[5 HÖGSTA BELOPP],0),1)","v":"Underhåll eller reparationer"},{"$f":"LARGE(Rörelsekostnader[5 HÖGSTA BELOPP],1)","v":{"v":4600.000014,"d":"4,600.00"}},{"$f":"Top5Expenses[[#This Row],[BELOPP]]/$D$6","v":{"v":0.09268587576062866,"d":"9.3%"}},{"$f":"Top5Expenses[[#This Row],[BELOPP]]*0.15","v":{"v":690.0000021,"d":"690.00"}}]
[null,{"$f":"INDEX(Rörelsekostnader[],MATCH(Top5Expenses[[#This Row],[BELOPP]],Rörelsekostnader[5 HÖGSTA BELOPP],0),1)","v":"Material"},{"$f":"LARGE(Rörelsekostnader[5 HÖGSTA BELOPP],2)","v":{"v":4500.00002,"d":"4,500.00"}},{"$f":"Top5Expenses[[#This Row],[BELOPP]]/$D$6","v":{"v":0.09067096554503326,"d":"9.1%"}},{"$f":"Top5Expenses[[#This Row],[BELOPP]]*0.15","v":{"v":675.000003,"d":"675.00"}}]
[null,{"$f":"INDEX(Rörelsekostnader[],MATCH(Top5Expenses[[#This Row],[BELOPP]],Rörelsekostnader[5 HÖGSTA BELOPP],0),1)","v":"Hyra eller amortering"},{"$f":"LARGE(Rörelsekostnader[5 HÖGSTA BELOPP],3)","v":{"v":4500.000017,"d":"4,500.00"}},{"$f":"Top5Expenses[[#This Row],[BELOPP]]/$D$6","v":{"v":0.09067096548458595,"d":"9.1%"}},{"$f":"Top5Expenses[[#This Row],[BELOPP]]*0.15","v":{"v":675.00000255,"d":"675.00"}}]
[null,{"$f":"INDEX(Rörelsekostnader[],MATCH(Top5Expenses[[#This Row],[BELOPP]],Rörelsekostnader[5 HÖGSTA BELOPP],0),1)","v":"Skatter"},{"$f":"LARGE(Rörelsekostnader[5 HÖGSTA BELOPP],4)","v":{"v":3200.000021,"d":"3,200.00"}},{"$f":"Top5Expenses[[#This Row],[BELOPP]]/$D$6","v":{"v":0.06447713119081201,"d":"6.4%"}},{"$f":"Top5Expenses[[#This Row],[BELOPP]]*0.15","v":{"v":480.00000314999994,"d":"480.00"}}]
[null,{"$f":"INDEX(Rörelsekostnader[],MATCH(Top5Expenses[[#This Row],[BELOPP]],Rörelsekostnader[5 HÖGSTA BELOPP],0),1)","v":"Reklam"},{"$f":"LARGE(Rörelsekostnader[5 HÖGSTA BELOPP],5)","v":{"v":2500.000005,"d":"2,500.00"}},{"$f":"Top5Expenses[[#This Row],[BELOPP]]/$D$6","v":{"v":0.05037275851299617,"d":"5.0%"}},{"$f":"Top5Expenses[[#This Row],[BELOPP]]*0.15","v":{"v":375.00000074999997,"d":"375.00"}}]
[null,"Summa",{"$f":"SUBTOTAL(109,Top5Expenses[BELOPP])","v":{"v":19300.000077000004,"d":"19,300.00"}},{"$f":"SUBTOTAL(109,Top5Expenses[% AV UTGIFTER])","v":{"v":0.388877696494056,"d":"38.9%"}},{"$f":"SUBTOTAL(109,Top5Expenses[15 % AVDRAG])","v":{"v":2895.0000115499997,"d":"2,895.00"}}]

{"sheet":"Intäkter","index":1,"n_rows":8,"n_cols":6,"rows_kept":8}
[null,{"$f":"FÖRETAGETSNAMN","v":"FÖRETAGETS NAMN"}]
[null,{"$f":"BUDGET_Rubrik","v":"MÅNADSBUDGET"}]
[]
[null,"INTÄKTER","BERÄKNADE","FAKTISKA","5 HÖGSTA BELOPP","SKILLNAD"]
[null,"Nettoförsäljning",{"v":60000,"d":"60,000.00"},{"v":54000,"d":"54,000.00"},{"$f":"Intäkter[[#This Row],[FAKTISKA]]+(10^-6)*ROW(Intäkter[[#This Row],[FAKTISKA]])","v":{"v":54000.000005,"d":"54,000.00"}},{"$f":"Intäkter[[#This Row],[FAKTISKA]]-Intäkter[[#This Row],[BERÄKNADE]]","v":{"v":-6000,"d":"-6,000.00 "}}]
[null,"Ränteintäkter",{"v":3000,"d":"3,000.00"},{"v":3000,"d":"3,000.00"},{"$f":"Intäkter[[#This Row],[FAKTISKA]]+(10^-6)*ROW(Intäkter[[#This Row],[FAKTISKA]])","v":{"v":3000.000006,"d":"3,000.00"}},{"$f":"Intäkter[[#This Row],[FAKTISKA]]-Intäkter[[#This Row],[BERÄKNADE]]","v":{"v":0,"d":"0.00"}}]
[null,"Tillgångsförsäljning (vinst/förlust)",{"v":300,"d":"300.00"},{"v":450,"d":"450.00"},{"$f":"Intäkter[[#This Row],[FAKTISKA]]+(10^-6)*ROW(Intäkter[[#This Row],[FAKTISKA]])","v":{"v":450.000007,"d":"450.00"}},{"$f":"Intäkter[[#This Row],[FAKTISKA]]-Intäkter[[#This Row],[BERÄKNADE]]","v":{"v":150,"d":"150.00"}}]
[null,"Totala intäkter",{"$f":"SUBTOTAL(109,Intäkter[BERÄKNADE])","v":{"v":63300,"d":"63,300.00"}},{"$f":"SUBTOTAL(109,Intäkter[FAKTISKA])","v":{"v":57450,"d":"57,450.00"}},null,{"$f":"SUBTOTAL(109,Intäkter[SKILLNAD])","v":{"v":-5850,"d":"-5,850.00 "}}]

{"sheet":"Personalkostnader","index":2,"n_rows":8,"n_cols":6,"rows_kept":8}
[null,{"$f":"FÖRETAGETSNAMN","v":"FÖRETAGETS NAMN"}]
[null,{"$f":"BUDGET_Rubrik","v":"MÅNADSBUDGET"}]
[]
[null,"PERSONALKOSTNADER","BERÄKNADE","FAKTISKA","5 HÖGSTA BELOPP","SKILLNAD"]
[null,"Lön",{"v":9500,"d":"9,500.00"},{"v":9600,"d":"9,600.00"},{"$f":"Personalkostnader[[#This Row],[FAKTISKA]]+(10^-6)*ROW(Personalkostnader[[#This Row],[FAKTISKA]])","v":{"v":9600.000005,"d":"9,600.00"}},{"$f":"Personalkostnader[[#This Row],[BERÄKNADE]]-Personalkostnader[[#This Row],[FAKTISKA]]","v":{"v":-100,"d":"-100.00 "}}]
[null,"Anställningsförmåner",{"v":4000,"d":"4,000.00"},{"v":0,"d":"0.00"},{"$f":"Personalkostnader[[#This Row],[FAKTISKA]]+(10^-6)*ROW(Personalkostnader[[#This Row],[FAKTISKA]])","v":{"v":0.000006,"d":"0.00"}},{"$f":"Personalkostnader[[#This Row],[BERÄKNADE]]-Personalkostnader[[#This Row],[FAKTISKA]]","v":{"v":4000,"d":"4,000.00"}}]
[null,"Provision",{"v":5000,"d":"5,000.00"},{"v":4500,"d":"4,500.00"},{"$f":"Personalkostnader[[#This Row],[FAKTISKA]]+(10^-6)*ROW(Personalkostnader[[#This Row],[FAKTISKA]])","v":{"v":4500.000007,"d":"4,500.00"}},{"$f":"Personalkostnader[[#This Row],[BERÄKNADE]]-Personalkostnader[[#This Row],[FAKTISKA]]","v":{"v":500,"d":"500.00"}}]
[null,"Totala personalkostnader",{"$f":"SUBTOTAL(109,Personalkostnader[BERÄKNADE])","v":{"v":18500,"d":"18,500.00"}},{"$f":"SUBTOTAL(109,Personalkostnader[FAKTISKA])","v":{"v":14100,"d":"14,100.00"}},null,{"$f":"SUBTOTAL(109,Personalkostnader[SKILLNAD])","v":{"v":4400,"d":"4,400.00"}}]

{"sheet":"Rörelsekostnader","index":3,"n_rows":25,"n_cols":6,"rows_kept":25}
[null,{"$f":"FÖRETAGETSNAMN","v":"FÖRETAGETS NAMN"}]
[null,{"$f":"BUDGET_Rubrik","v":"MÅNADSBUDGET"}]
[]
[null,"RÖRELSEKOSTNADER","BERÄKNADE","FAKTISKA","5 HÖGSTA BELOPP","SKILLNAD"]
[null,"Reklam",{"v":3000,"d":"3,000.00"},{"v":2500,"d":"2,500.00"},{"$f":"Rörelsekostnader[[#This Row],[FAKTISKA]]+(10^-6)*ROW(Rörelsekostnader[[#This Row],[FAKTISKA]])","v":{"v":2500.000005,"d":"2,500.00"}},{"$f":"Rörelsekostnader[[#This Row],[BERÄKNADE]]-Rörelsekostnader[[#This Row],[FAKTISKA]]","v":{"v":500,"d":"500.00"}}]
[null,"Osäkra fordringar",{"v":2000,"d":"2,000.00"},{"v":2000,"d":"2,000.00"},{"$f":"Rörelsekostnader[[#This Row],[FAKTISKA]]+(10^-6)*ROW(Rörelsekostnader[[#This Row],[FAKTISKA]])","v":{"v":2000.000006,"d":"2,000.00"}},{"$f":"Rörelsekostnader[[#This Row],[BERÄKNADE]]-Rörelsekostnader[[#This Row],[FAKTISKA]]","v":{"v":0,"d":"0.00"}}]
[null,"Kassarabatter",{"v":1500,"d":"1,500.00"},{"v":2175,"d":"2,175.00"},{"$f":"Rörelsekostnader[[#This Row],[FAKTISKA]]+(10^-6)*ROW(Rörelsekostnader[[#This Row],[FAKTISKA]])","v":{"v":2175.000007,"d":"2,175.00"}},{"$f":"Rörelsekostnader[[#This Row],[BERÄKNADE]]-Rörelsekostnader[[#This Row],[FAKTISKA]]","v":{"v":-675,"d":"-675.00 "}}]
[null,"Leveranskostnader",{"v":2000,"d":"2,000.00"},{"v":1500,"d":"1,500.00"},{"$f":"Rörelsekostnader[[#This Row],[FAKTISKA]]+(10^-6)*ROW(Rörelsekostnader[[#This Row],[FAKTISKA]])","v":{"v":1500.000008,"d":"1,500.00"}},{"$f":"Rörelsekostnader[[#This Row],[BERÄKNADE]]-Rörelsekostnader[[#This Row],[FAKTISKA]]","v":{"v":500,"d":"500.00"}}]
[null,"Avskrivning",{"v":1000,"d":"1,000.00"},{"v":1000,"d":"1,000.00"},{"$f":"Rörelsekostnader[[#This Row],[FAKTISKA]]+(10^-6)*ROW(Rörelsekostnader[[#This Row],[FAKTISKA]])","v":{"v":1000.000009,"d":"1,000.00"}},{"$f":"Rörelsekostnader[[#This Row],[BERÄKNADE]]-Rörelsekostnader[[#This Row],[FAKTISKA]]","v":{"v":0,"d":"0.00"}}]
[null,"Avgifter och prenumerationer",{"v":500,"d":"500.00"},{"v":525,"d":"525.00"},{"$f":"Rörelsekostnader[[#This Row],[FAKTISKA]]+(10^-6)*ROW(Rörelsekostnader[[#This Row],[FAKTISKA]])","v":{"v":525.00001,"d":"525.00"}},{"$f":"Rörelsekostnader[[#This Row],[BERÄKNADE]]-Rörelsekostnader[[#This Row],[FAKTISKA]]","v":{"v":-25,"d":"-25.00 "}}]
[null,"Försäkring",{"v":1300,"d":"1,300.00"},{"v":1275,"d":"1,275.00"},{"$f":"Rörelsekostnader[[#This Row],[FAKTISKA]]+(10^-6)*ROW(Rörelsekostnader[[#This Row],[FAKTISKA]])","v":{"v":1275.000011,"d":"1,275.00"}},{"$f":"Rörelsekostnader[[#This Row],[BERÄKNADE]]-Rörelsekostnader[[#This Row],[FAKTISKA]]","v":{"v":25,"d":"25.00"}}]
[null,"Ränta",{"v":2000,"d":"2,000.00"},{"v":2200,"d":"2,200.00"},{"$f":"Rörelsekostnader[[#This Row],[FAKTISKA]]+(10^-6)*ROW(Rörelsekostnader[[#This Row],[FAKTISKA]])","v":{"v":2200.000012,"d":"2,200.00"}},{"$f":"Rörelsekostnader[[#This Row],[BERÄKNADE]]-Rörelsekostnader[[#This Row],[FAKTISKA]]","v":{"v":-200,"d":"-200.00 "}}]
[null,"Juridiskt och revision",{"v":1000,"d":"1,000.00"},{"v":800,"d":"800.00"},{"$f":"Rörelsekostnader[[#This Row],[FAKTISKA]]+(10^-6)*ROW(Rörelsekostnader[[#This Row],[FAKTISKA]])","v":{"v":800.000013,"d":"800.00"}},{"$f":"Rörelsekostnader[[#This Row],[BERÄKNADE]]-Rörelsekostnader[[#This Row],[FAKTISKA]]","v":{"v":200,"d":"200.00"}}]
[null,"Underhåll eller reparationer",{"v":4500,"d":"4,500.00"},{"v":4600,"d":"4,600.00"},{"$f":"Rörelsekostnader[[#This Row],[FAKTISKA]]+(10^-6)*ROW(Rörelsekostnader[[#This Row],[FAKTISKA]])","v":{"v":4600.000014,"d":"4,600.00"}},{"$f":"Rörelsekostnader[[#This Row],[BERÄKNADE]]-Rörelsekostnader[[#This Row],[FAKTISKA]]","v":{"v":-100,"d":"-100.00 "}}]
[null,"Kontorsmaterial",{"v":800,"d":"800.00"},{"v":750,"d":"750.00"},{"$f":"Rörelsekostnader[[#This Row],[FAKTISKA]]+(10^-6)*ROW(Rörelsekostnader[[#This Row],[FAKTISKA]])","v":{"v":750.000015,"d":"750.00"}},{"$f":"Rörelsekostnader[[#This Row],[BERÄKNADE]]-Rörelsekostnader[[#This Row],[FAKTISKA]]","v":{"v":50,"d":"50.00"}}]
[null,"Porto",{"v":400,"d":"400.00"},{"v":350,"d":"350.00"},{"$f":"Rörelsekostnader[[#This Row],[FAKTISKA]]+(10^-6)*ROW(Rörelsekostnader[[#This Row],[FAKTISKA]])","v":{"v":350.000016,"d":"350.00"}},{"$f":"Rörelsekostnader[[#This Row],[BERÄKNADE]]-Rörelsekostnader[[#This Row],[FAKTISKA]]","v":{"v":50,"d":"50.00"}}]
[null,"Hyra eller amortering",{"v":4100,"d":"4,100.00"},{"v":4500,"d":"4,500.00"},{"$f":"Rörelsekostnader[[#This Row],[FAKTISKA]]+(10^-6)*ROW(Rörelsekostnader[[#This Row],[FAKTISKA]])","v":{"v":4500.000017,"d":"4,500.00"}},{"$f":"Rörelsekostnader[[#This Row],[BERÄKNADE]]-Rörelsekostnader[[#This Row],[FAKTISKA]]","v":{"v":-400,"d":"-400.00 "}}]
[null,"Försäljningsutgifter",{"v":350,"d":"350.00"},{"v":400,"d":"400.00"},{"$f":"Rörelsekostnader[[#This Row],[FAKTISKA]]+(10^-6)*ROW(Rörelsekostnader[[#This Row],[FAKTISKA]])","v":{"v":400.000018,"d":"400.00"}},{"$f":"Rörelsekostnader[[#This Row],[BERÄKNADE]]-Rörelsekostnader[[#This Row],[FAKTISKA]]","v":{"v":-50,"d":"-50.00 "}}]
[null,"Frakt och lager",{"v":900,"d":"900.00"},{"v":840,"d":"840.00"},{"$f":"Rörelsekostnader[[#This Row],[FAKTISKA]]+(10^-6)*ROW(Rörelsekostnader[[#This Row],[FAKTISKA]])","v":{"v":840.000019,"d":"840.00"}},{"$f":"Rörelsekostnader[[#This Row],[BERÄKNADE]]-Rörelsekostnader[[#This Row],[FAKTISKA]]","v":{"v":60,"d":"60.00"}}]
[null,"Material",{"v":5000,"d":"5,000.00"},{"v":4500,"d":"4,500.00"},{"$f":"Rörelsekostnader[[#This Row],[FAKTISKA]]+(10^-6)*ROW(Rörelsekostnader[[#This Row],[FAKTISKA]])","v":{"v":4500.00002,"d":"4,500.00"}},{"$f":"Rörelsekostnader[[#This Row],[BERÄKNADE]]-Rörelsekostnader[[#This Row],[FAKTISKA]]","v":{"v":500,"d":"500.00"}}]
[null,"Skatter",{"v":3000,"d":"3,000.00"},{"v":3200,"d":"3,200.00"},{"$f":"Rörelsekostnader[[#This Row],[FAKTISKA]]+(10^-6)*ROW(Rörelsekostnader[[#This Row],[FAKTISKA]])","v":{"v":3200.000021,"d":"3,200.00"}},{"$f":"Rörelsekostnader[[#This Row],[BERÄKNADE]]-Rörelsekostnader[[#This Row],[FAKTISKA]]","v":{"v":-200,"d":"-200.00 "}}]
[null,"Telefon",{"v":250,"d":"250.00"},{"v":280,"d":"280.00"},{"$f":"Rörelsekostnader[[#This Row],[FAKTISKA]]+(10^-6)*ROW(Rörelsekostnader[[#This Row],[FAKTISKA]])","v":{"v":280.000022,"d":"280.00"}},{"$f":"Rörelsekostnader[[#This Row],[BERÄKNADE]]-Rörelsekostnader[[#This Row],[FAKTISKA]]","v":{"v":-30,"d":"-30.00 "}}]
[null,"Kraftförsörjning",{"v":1400,"d":"1,400.00"},{"v":1385,"d":"1,385.00"},{"$f":"Rörelsekostnader[[#This Row],[FAKTISKA]]+(10^-6)*ROW(Rörelsekostnader[[#This Row],[FAKTISKA]])","v":{"v":1385.000023,"d":"1,385.00"}},{"$f":"Rörelsekostnader[[#This Row],[BERÄKNADE]]-Rörelsekostnader[[#This Row],[FAKTISKA]]","v":{"v":15,"d":"15.00"}}]
[null,"Övrigt",{"v":1000,"d":"1,000.00"},{"v":750,"d":"750.00"},{"$f":"Rörelsekostnader[[#This Row],[FAKTISKA]]+(10^-6)*ROW(Rörelsekostnader[[#This Row],[FAKTISKA]])","v":{"v":750.000024,"d":"750.00"}},{"$f":"Rörelsekostnader[[#This Row],[BERÄKNADE]]-Rörelsekostnader[[#This Row],[FAKTISKA]]","v":{"v":250,"d":"250.00"}}]
[null,"Totala rörelsekostnader",{"$f":"SUBTOTAL(109,Rörelsekostnader[BERÄKNADE])","v":{"v":36000,"d":"36,000.00"}},{"$f":"SUBTOTAL(109,Rörelsekostnader[FAKTISKA])","v":{"v":35530,"d":"35,530.00"}},null,{"$f":"SUBTOTAL(109,Rörelsekostnader[SKILLNAD])","v":{"v":470,"d":"470.00"}}]