{"text_format":"3","workbook":"xlsx","n_sheets":3,"sheets":["Utbildningslogg","Kurslista","Personalinformation"],"not_rendered":{"defined_names":13},"read":"whole","date_system":"1900"}

{"sheet":"Utbildningslogg","index":0,"n_rows":23,"n_cols":9,"rows_kept":23}
[]
[]
[null,null,"UTBILDNINGSLOGG"]
{"$rows_empty":8}
[null,null,"UTBILDNINGSDATUM","NAMN","KURS","LEDARE","GENOMFÖRD","GODKÄND/EJ GODKÄND","ANTECKNINGAR"]
[null,null,"2012-06-01","Cecilia Rylander","Introduktion för nyanställda",{"$f":"IF(tab_Utbildningslogg[[#This Row],[KURS]]=\"\",\"\",IFERROR(VLOOKUP(tab_Utbildningslogg[[#This Row],[KURS]],tab_Kurslista[],2,0),\"Hittades inte\"))","v":"David Johansson"},"Ja","Godkänd","Utmärkt kursledare ."]
[null,null,"2012-06-02","Nils Ljunggren","Introduktion för nyanställda",{"$f":"IF(tab_Utbildningslogg[[#This Row],[KURS]]=\"\",\"\",IFERROR(VLOOKUP(tab_Utbildningslogg[[#This Row],[KURS]],tab_Kurslista[],2,0),\"Hittades inte\"))","v":"David Johansson"},"Ja","Ej godkänd","Var tvungen att avsluta i förtid och kunde inte slutföra den."]
[null,null,"2012-06-03","Lars Wester","Introduktion för nyanställda",{"$f":"IF(tab_Utbildningslogg[[#This Row],[KURS]]=\"\",\"\",IFERROR(VLOOKUP(tab_Utbildningslogg[[#This Row],[KURS]],tab_Kurslista[],2,0),\"Hittades inte\"))","v":"David Johansson"},"Ja","Godkänd","Sista tillfället det här kvartalet."]
[null,null,"2012-06-03","Nils Ljunggren","Introduktion för nyanställda",{"$f":"IF(tab_Utbildningslogg[[#This Row],[KURS]]=\"\",\"\",IFERROR(VLOOKUP(tab_Utbildningslogg[[#This Row],[KURS]],tab_Kurslista[],2,0),\"Hittades inte\"))","v":"David Johansson"},"Ja","Godkänd","Sista tillfället det här kvartalet."]
[null,null,"2012-06-04","Nils Ljunggren","Personalverksamhet",{"$f":"IF(tab_Utbildningslogg[[#This Row],[KURS]]=\"\",\"\",IFERROR(VLOOKUP(tab_Utbildningslogg[[#This Row],[KURS]],tab_Kurslista[],2,0),\"Hittades inte\"))","v":"Per Johansson"},"Ja","Godkänd","Första tillfället det här kvartalet"]
[null,null,"2012-06-04","Lars Wester","Personalverksamhet",{"$f":"IF(tab_Utbildningslogg[[#This Row],[KURS]]=\"\",\"\",IFERROR(VLOOKUP(tab_Utbildningslogg[[#This Row],[KURS]],tab_Kurslista[],2,0),\"Hittades inte\"))","v":"Per Johansson"},"Ja","Godkänd","Första tillfället det här kvartalet"]
[null,null,"2012-06-04","Lars Wester","Redovisning på mellannivå",{"$f":"IF(tab_Utbildningslogg[[#This Row],[KURS]]=\"\",\"\",IFERROR(VLOOKUP(tab_Utbildningslogg[[#This Row],[KURS]],tab_Kurslista[],2,0),\"Hittades inte\"))","v":"Per Johansson"},"Ja","Godkänd","Endast inbjudna deltagare."]
[null,null,"2012-06-04","Cecilia Rylander","Personalverksamhet",{"$f":"IF(tab_Utbildningslogg[[#This Row],[KURS]]=\"\",\"\",IFERROR(VLOOKUP(tab_Utbildningslogg[[#This Row],[KURS]],tab_Kurslista[],2,0),\"Hittades inte\"))","v":"Per Johansson"},"Ja","Godkänd","Första tillfället det här kvartalet"]
[null,null,"2012-06-05","Cecilia Rylander","Redovisning på mellannivå",{"$f":"IF(tab_Utbildningslogg[[#This Row],[KURS]]=\"\",\"\",IFERROR(VLOOKUP(tab_Utbildningslogg[[#This Row],[KURS]],tab_Kurslista[],2,0),\"Hittades inte\"))","v":"Per Johansson"},"Nej","Framtida","Ännu inte slutförd."]
[null,null,"2012-06-05","Nils Ljunggren","Avancerad redovisning",{"$f":"IF(tab_Utbildningslogg[[#This Row],[KURS]]=\"\",\"\",IFERROR(VLOOKUP(tab_Utbildningslogg[[#This Row],[KURS]],tab_Kurslista[],2,0),\"Hittades inte\"))","v":"David Johansson"},"Nej","Framtida","Ännu inte slutförd."]
[{"$nulls":5},{"$f":"IF(tab_Utbildningslogg[[#This Row],[KURS]]=\"\",\"\",IFERROR(VLOOKUP(tab_Utbildningslogg[[#This Row],[KURS]],tab_Kurslista[],2,0),\"Hittades inte\"))","v":""}]

{"sheet":"Kurslista","index":1,"n_rows":10,"n_cols":6,"rows_kept":10}
[]
[]
[null,null,"KURSLISTA"]
[]
[null,null,"RUBRIK","LEDARE","BESKRIVNING","TIDER"]
[null,null,"Introduktion för nyanställda","David Johansson","En grundkurs för nyanställd personal. Ger kunskap om avdelningens mål och förväntningar, samt om tidsramar och gränser.",2]
[null,null,"Personalverksamhet","Per Johansson","Grundläggande personalverksamhet, vilken omfattar personalhandboken.",1]
[null,null,"Personalverksamhet","David Johansson","Grundläggande redovisningsrutiner och riktlinjer",1.5]
[null,null,"Redovisning på mellannivå","Per Johansson","Mellanliggande redovisningsrutiner och riktlinjer",2]
[null,null,"Avancerad redovisning","David Johansson","Avancerade redovisningsrutiner och riktlinjer",2]

{"sheet":"Personalinformation","index":2,"n_rows":9,"n_cols":5,"rows_kept":9}
[]
[]
[null,null,"PERSONALINFORMATION"]
[]
[null,null,"NAMN","AVDELNING","RUBRIK"]
[null,null,"Cecilia Rylander","Försäljning","Huvudrevisor"]
[null,null,"Nils Ljunggren","Redovisning","Revisor"]
[null,null,"Lars Wester","Redovisning","Revisor"]
[null,null,"Katarina Larsson","Redovisning","Revisor"]