{"text_format":"3","workbook":"xlsx","n_sheets":3,"sheets":["Försäljningsuppgifter","Försäljningsrapport","Lager"],"not_rendered":{"defined_names":10,"pivot_tables":1},"read":"whole","date_system":"1900"}

{"sheet":"Försäljningsuppgifter","index":0,"n_rows":13,"n_cols":11,"rows_kept":13}
[]
[null,"DAGSKASSA"]
[]
[]
[]
[{"$nulls":10}," "]
[{"$nulls":10}," "]
[null,"DATUM","TID","TRANSAKTIONSNUMMER","SKU/PRODUKTNUMMER","BESKRIVNING","FÖRSÄLJNINGSBELOPP","MOMS %","MOMS","SUMMA"]
[null,"2012-02-01","10:30:00",1001,90001,{"$f":"IFERROR(IF(ISNA(VLOOKUP(tab_Försäljningsinformation[[#This Row],[SKU/PRODUKTNUMMER]],tab_Lager[],2,0)),\"\",VLOOKUP(tab_Försäljningsinformation[[#This Row],[SKU/PRODUKTNUMMER]],tab_Lager[],2,0)),\"No description found\")","v":"Filt"},{"v":74.95,"d":"$74.95"},{"v":0.05,"d":"5.00%"},{"$f":"tab_Försäljningsinformation[[#This Row],[FÖRSÄLJNINGSBELOPP]]*tab_Försäljningsinformation[[#This Row],[MOMS %]]","v":{"v":3.7475000000000005,"d":"3.75 kr"}},{"$f":"tab_Försäljningsinformation[[#This Row],[FÖRSÄLJNINGSBELOPP]]+tab_Försäljningsinformation[[#This Row],[MOMS]]","v":{"v":78.6975,"d":"78.70 kr"}}]
[null,"2012-02-01","10:33:00",1002,90023,{"$f":"IFERROR(IF(ISNA(VLOOKUP(tab_Försäljningsinformation[[#This Row],[SKU/PRODUKTNUMMER]],tab_Lager[],2,0)),\"\",VLOOKUP(tab_Försäljningsinformation[[#This Row],[SKU/PRODUKTNUMMER]],tab_Lager[],2,0)),\"No description found\")","v":"Bordsduk, rund 1,8 m"},{"v":34.99,"d":"$34.99"},{"v":0.05,"d":"5.00%"},{"$f":"tab_Försäljningsinformation[[#This Row],[FÖRSÄLJNINGSBELOPP]]*tab_Försäljningsinformation[[#This Row],[MOMS %]]","v":{"v":1.7495000000000003,"d":"1.75 kr"}},{"$f":"tab_Försäljningsinformation[[#This Row],[FÖRSÄLJNINGSBELOPP]]+tab_Försäljningsinformation[[#This Row],[MOMS]]","v":{"v":36.7395,"d":"36.74 kr"}}]
[null,"2012-02-01","10:45:00",1003,90005,{"$f":"IFERROR(IF(ISNA(VLOOKUP(tab_Försäljningsinformation[[#This Row],[SKU/PRODUKTNUMMER]],tab_Lager[],2,0)),\"\",VLOOKUP(tab_Försäljningsinformation[[#This Row],[SKU/PRODUKTNUMMER]],tab_Lager[],2,0)),\"No description found\")","v":"Rund tallrik"},{"v":55.95,"d":"$55.95"},{"v":0.05,"d":"5.00%"},{"$f":"tab_Försäljningsinformation[[#This Row],[FÖRSÄLJNINGSBELOPP]]*tab_Försäljningsinformation[[#This Row],[MOMS %]]","v":{"v":2.7975000000000003,"d":"2.80 kr"}},{"$f":"tab_Försäljningsinformation[[#This Row],[FÖRSÄLJNINGSBELOPP]]+tab_Försäljningsinformation[[#This Row],[MOMS]]","v":{"v":58.7475,"d":"58.75 kr"}}]
[null,"2012-02-01","10:55:00",1004,90004,{"$f":"IFERROR(IF(ISNA(VLOOKUP(tab_Försäljningsinformation[[#This Row],[SKU/PRODUKTNUMMER]],tab_Lager[],2,0)),\"\",VLOOKUP(tab_Försäljningsinformation[[#This Row],[SKU/PRODUKTNUMMER]],tab_Lager[],2,0)),\"No description found\")","v":"Fyrkantig tallrik"},{"v":2.95,"d":"$2.95"},{"v":0.05,"d":"5.00%"},{"$f":"tab_Försäljningsinformation[[#This Row],[FÖRSÄLJNINGSBELOPP]]*tab_Försäljningsinformation[[#This Row],[MOMS %]]","v":{"v":0.14750000000000002,"d":"0.15 kr"}},{"$f":"tab_Försäljningsinformation[[#This Row],[FÖRSÄLJNINGSBELOPP]]+tab_Försäljningsinformation[[#This Row],[MOMS]]","v":{"v":3.0975,"d":"3.10 kr"}}]
[null,"2012-02-01","11:45:00",1005,90002,{"$f":"IFERROR(IF(ISNA(VLOOKUP(tab_Försäljningsinformation[[#This Row],[SKU/PRODUKTNUMMER]],tab_Lager[],2,0)),\"\",VLOOKUP(tab_Försäljningsinformation[[#This Row],[SKU/PRODUKTNUMMER]],tab_Lager[],2,0)),\"No description found\")","v":"Kudde"},{"v":14.98,"d":"$14.98"},{"v":0.05,"d":"5.00%"},{"$f":"tab_Försäljningsinformation[[#This Row],[FÖRSÄLJNINGSBELOPP]]*tab_Försäljningsinformation[[#This Row],[MOMS %]]","v":{"v":0.7490000000000001,"d":"0.75 kr"}},{"$f":"tab_Försäljningsinformation[[#This Row],[FÖRSÄLJNINGSBELOPP]]+tab_Försäljningsinformation[[#This Row],[MOMS]]","v":{"v":15.729000000000001,"d":"15.73 kr"}}]

{"sheet":"Försäljningsrapport","index":1,"n_rows":14,"n_cols":7,"rows_kept":14}
[]
[null,"DAGSKASSA"]
[]
[]
[]
[]
[]
[null,"SKU/PRODUKTNUMMER","BESKRIVNING","DATUM","Försäljningsbelopp ","Moms ","Summa "]
[null,90001,"Filt","2012-02-01",{"v":74.95,"d":"74.95 kr"},{"v":3.7475000000000005,"d":"3.75 kr"},{"v":78.6975,"d":"78.70 kr"}]
[null,90002,"Kudde","2012-02-01",{"v":14.98,"d":"14.98 kr"},{"v":0.7490000000000001,"d":"0.75 kr"},{"v":15.729000000000001,"d":"15.73 kr"}]
[null,90004,"Fyrkantig tallrik","2012-02-01",{"v":2.95,"d":"2.95 kr"},{"v":0.14750000000000002,"d":"0.15 kr"},{"v":3.0975,"d":"3.10 kr"}]
[null,90005,"Rund tallrik","2012-02-01",{"v":55.95,"d":"55.95 kr"},{"v":2.7975000000000003,"d":"2.80 kr"},{"v":58.7475,"d":"58.75 kr"}]
[null,90023,"Bordsduk, rund 1,8 m","2012-02-01",{"v":34.99,"d":"34.99 kr"},{"v":1.7495000000000003,"d":"1.75 kr"},{"v":36.7395,"d":"36.74 kr"}]
[null,"Totalsumma",null,null,{"v":183.82000000000002,"d":"183.82 kr"},{"v":9.191000000000003,"d":"9.19 kr"},{"v":193.011,"d":"193.01 kr"}]

{"sheet":"Lager","index":2,"n_rows":31,"n_cols":3,"rows_kept":31}
[]
[null,"DAGSKASSA"]
[]
[]
[]
[]
[]
[null,"SKU/PRODUKTNUMMER","BESKRIVNING"]
[null,90001,"Filt"]
[null,90002,"Kudde"]
[null,90003,"Lakan"]
[null,90004,"Fyrkantig tallrik"]
[null,90005,"Rund tallrik"]
[null,90006,"Skål, stor"]
[null,90007,"Skål, liten"]
[null,90008,"Rund tallrik, liten"]
[null,90009,"Gaffel, liten"]
[null,90010,"Galler, stor"]
[null,90011,"Sked, liten"]
[null,90012,"Sked, stor"]
[null,90013,"Smörkniv, liten"]
[null,90014,"Smörkniv, stor"]
[null,90015,"Bordsduk, 3 x 1,5 m"]
[null,90016,"Bordsduk, 2,5 x 1,5 m"]
[null,90017,"Bordsduk, 2,5 x 2,5 m"]
[null,90018,"Bordsduk, 1,8 x 1,8 m"]
[null,90019,"Bordsduk, 1,8 x 1,2 m"]
[null,90020,"Bordsduk, 1,2 x 1,2 m"]
[null,90021,"Bordsduk, rund 3 m"]
[null,90022,"Bordsduk, rund 2,4 m"]
[null,90023,"Bordsduk, rund 1,8 m"]