{"text_format":"3","workbook":"xlsx","n_sheets":9,"sheets":["Sammanfattning","Ämne 1","Ämne 3","Ämne 2","Ämne 4","Ämne 5","Ämne 6","Ämne 7","Betygstabell"],"not_rendered":{"defined_names":9},"read":"whole","date_system":"1900"}

{"sheet":"Sammanfattning","index":0,"n_rows":12,"n_cols":7,"rows_kept":12,"merged":[[1,1,1,2]]}
[]
[null,"Skolans namn",null,"  Ditt namn:",null," Termin/läsår:"]
[]
[null,"Ämnen","Poäng","Procent","Betyg","Medelbetyg","Viktat medelbetyg"]
[null,"Ämne 1",{"v":3,"d":"3.0"},{"$f":"'Ämne 1'!D$36","v":{"v":0.865,"d":"86.50%"}},{"$f":"IF(D5<>\"\",HLOOKUP(D5,Betygstabell!$C$5:$O$7,2),\"\")","v":"B"},{"$f":"IF(D5<>\"\",HLOOKUP(D5,Betygstabell!$C$5:$O$7,3),\"\")","v":{"v":3,"d":"3.00"}},{"$f":"IF(F5<>\"\",F5*C5/(SUM($C$5:$C$11)), \"\")","v":{"v":0.5625,"d":"0.56"}}]
[null,"Ämne 2",{"v":4,"d":"4.0"},{"$f":"'Ämne 2'!D$36","v":""},{"$f":"IF(D6<>\"\",HLOOKUP(D6,Betygstabell!$C$5:$O$7,2),\"\")","v":""},{"$f":"IF(D6<>\"\",HLOOKUP(D6,Betygstabell!$C$5:$O$7,3),\"\")","v":""},""]
[null,"Ämne 3",{"v":2,"d":"2.0"},{"$f":"'Ämne 3'!D$36","v":""},{"$f":"IF(D7<>\"\",HLOOKUP(D7,Betygstabell!$C$5:$O$7,2),\"\")","v":""},{"$f":"IF(D7<>\"\",HLOOKUP(D7,Betygstabell!$C$5:$O$7,3),\"\")","v":""},""]
[null,"Ämne 4",{"v":4,"d":"4.0"},{"$f":"'Ämne 4'!D$36","v":""},{"$f":"IF(D8<>\"\",HLOOKUP(D8,Betygstabell!$C$5:$O$7,2),\"\")","v":""},{"$f":"IF(D8<>\"\",HLOOKUP(D8,Betygstabell!$C$5:$O$7,3),\"\")","v":""},""]
[null,"Ämne 5",{"v":1,"d":"1.0"},{"$f":"'Ämne 5'!D$36","v":""},{"$f":"IF(D9<>\"\",HLOOKUP(D9,Betygstabell!$C$5:$O$7,2),\"\")","v":""},{"$f":"IF(D9<>\"\",HLOOKUP(D9,Betygstabell!$C$5:$O$7,3),\"\")","v":""},""]
[null,"Ämne 6",{"v":1,"d":"1.0"},{"$f":"'Ämne 6'!D$36","v":""},{"$f":"IF(D10<>\"\",HLOOKUP(D10,Betygstabell!$C$5:$O$7,2),\"\")","v":""},{"$f":"IF(D10<>\"\",HLOOKUP(D10,Betygstabell!$C$5:$O$7,3),\"\")","v":""},""]
[null,"Ämne 7",{"v":1,"d":"1.0"},{"$f":"'Ämne 7'!D$36","v":""},{"$f":"IF(D11<>\"\",HLOOKUP(D11,Betygstabell!$C$5:$O$7,2),\"\")","v":""},{"$f":"IF(D11<>\"\",HLOOKUP(D11,Betygstabell!$C$5:$O$7,3),\"\")","v":""},""]
[null,"Summa",{"$f":"SUM(C5:C11)","v":16},{"$f":"AVERAGE(D5:D11)","v":{"v":0.865,"d":"86.50%"}},{"$f":"IF(D12<>\"\",HLOOKUP(D12,Betygstabell!$C$5:$O$7,2),\"\")","v":"B"},{"$f":"AVERAGE(F5:F11)","v":{"v":3,"d":"3.00"}},{"$f":"SUM(G5:G11)","v":{"v":0.5625,"d":"0.56"}}]

{"sheet":"Ämne 1","index":1,"n_rows":38,"n_cols":8,"rows_kept":38,"merged":[[1,1,1,2]]}
[]
[null,{"$f":"Sammanfattning!B5","v":"Ämne 1"}]
[null,"Lärare:",null,null,"Procent av totalt antal möjliga poäng",null,null,{"$f":"IF(SUM($C$35:$H$35) <> 0,SUM($C$34:$H$34)/SUM($C$35:$H$35),\"\")","v":{"v":0.865,"d":"86.50%"}}]
[null,"E-post:",null,null,"Aktuellt betyg",null,null,{"$f":"SUM($C$34:$H$34)","v":{"v":0.17300000000000001,"d":"17.30%"}}]
[]
[null,"Uppgifter","Hemläxa","Uppsatser","Frågor","Projekt","Centralprov","Slutprov"]
[null,"Vikt",{"v":0.1,"d":"10.0%"},{"v":0.1,"d":"10.0%"},{"v":0.15,"d":"15.0%"},{"v":0.15,"d":"15.0%"},{"v":0.2,"d":"20.0%"},{"v":0.3,"d":"30.0%"}]
[null,"Första hemläxan",0.88]
[null,"Arbete om andra världskriget",null,0.85]
{"$rows_empty":24}
[null,"Totalt antal poäng",{"$f":"IF(COUNT(C8:C33) <> 0,AVERAGE(C8:C33) *C7, \"\")","v":{"v":0.08800000000000001,"d":"0.0880"}},{"v":0.085,"d":"0.0850"},"","","",""]
[null,"Totalt antal möjliga poäng",{"$f":"IF(COUNT(C8:C33)<>0,C7,\"\")","v":0.1},0.1,"","","",""]
[null,"Procent av totalt antal möjliga poäng",null,{"$f":"IF(SUM($C$35:$H$35) <> 0,SUM($C$34:$H$34)/SUM($C$35:$H$35),\"\")","v":{"v":0.865,"d":"86.50%"}}]
[null,"Skriv betyg:","Skriv hur många poäng du har fått genom antal möjliga poäng (till exempel 15/17)."]
[null,null,"Skriv poängen i procent (till exempel 85 %)."]

{"sheet":"Ämne 3","index":2,"n_rows":38,"n_cols":8,"rows_kept":38,"merged":[[1,1,1,2]]}
[]
[null,{"$f":"Sammanfattning!B7","v":"Ämne 3"}]
[null,"Lärare:",null,null,"Procent av totalt antal möjliga poäng",null,null,{"$f":"IF(SUM($C$35:$H$35) <> 0,SUM($C$34:$H$34)/SUM($C$35:$H$35),\"\")","v":""}]
[null,"E-post:",null,null,"Aktuellt betyg",null,null,{"$f":"SUM($C$34:$H$34)","v":{"v":0,"d":"0.00%"}}]
[]
[null,"Uppgifter","Hemläxa","Uppsatser","Frågor","Projekt","Centralprov","Slutprov"]
[null,"Vikt",{"v":0.1,"d":"10.0%"},{"v":0.1,"d":"10.0%"},{"v":0.15,"d":"15.0%"},{"v":0.15,"d":"15.0%"},{"v":0.2,"d":"20.0%"},{"v":0.3,"d":"30.0%"}]
{"$rows_empty":26}
[null,"Totalt antal poäng",{"$f":"IF(COUNT(C8:C33) <> 0,AVERAGE(C8:C33) *C7, \"\")","v":""},"","","","",""]
[null,"Totalt antal möjliga poäng",{"$f":"IF(COUNT(C8:C33)<>0,C7,\"\")","v":""},"","","","",""]
[null,"Procent av totalt antal möjliga poäng",null,{"$f":"IF(SUM($C$35:$H$35) <> 0,SUM($C$34:$H$34)/SUM($C$35:$H$35),\"\")","v":""}]
[null,"Skriv betyg:","Skriv hur många poäng du har fått genom antal möjliga poäng (till exempel 15/17)."]
[null,null,"Skriv poängen i procent (till exempel 85 %)."]

{"sheet":"Ämne 2","index":3,"n_rows":38,"n_cols":8,"rows_kept":38,"merged":[[1,1,1,2]]}
[]
[null,{"$f":"Sammanfattning!B6","v":"Ämne 2"}]
[null,"Lärare:",null,null,"Procent av totalt antal möjliga poäng",null,null,{"$f":"IF(SUM($C$35:$H$35) <> 0,SUM($C$34:$H$34)/SUM($C$35:$H$35),\"\")","v":""}]
[null,"E-post:",null,null,"Aktuellt betyg",null,null,{"$f":"SUM($C$34:$H$34)","v":{"v":0,"d":"0.00%"}}]
[]
[null,"Uppgifter","Hemläxa","Uppsatser","Frågor","Projekt","Centralprov","Slutprov"]
[null,"Vikt",{"v":0.1,"d":"10.0%"},{"v":0.1,"d":"10.0%"},{"v":0.15,"d":"15.0%"},{"v":0.15,"d":"15.0%"},{"v":0.2,"d":"20.0%"},{"v":0.3,"d":"30.0%"}]
{"$rows_empty":26}
[null,"Totalt antal poäng",{"$f":"IF(COUNT(C8:C33) <> 0,AVERAGE(C8:C33) *C7, \"\")","v":""},"","","","",""]
[null,"Totalt antal möjliga poäng",{"$f":"IF(COUNT(C8:C33)<>0,C7,\"\")","v":""},"","","","",""]
[null,"Procent av totalt antal möjliga poäng",null,{"$f":"IF(SUM($C$35:$H$35) <> 0,SUM($C$34:$H$34)/SUM($C$35:$H$35),\"\")","v":""}]
[null,"Skriv betyg:","Skriv hur många poäng du har fått genom antal möjliga poäng (till exempel 15/17)."]
[null,null,"Skriv poängen i procent (till exempel 85 %)."]

{"sheet":"Ämne 4","index":4,"n_rows":38,"n_cols":8,"rows_kept":38,"merged":[[1,1,1,2]]}
[]
[null,{"$f":"Sammanfattning!B8","v":"Ämne 4"}]
[null,"Lärare:",null,null,"Procent av totalt antal möjliga poäng"]
[null,"E-post:",null,null,"Aktuellt betyg",null,null,{"$f":"SUM($C$34:$H$34)","v":{"v":0,"d":"0.00%"}}]
[]
[null,"Uppgifter","Hemläxa","Uppsatser","Frågor","Projekt","Centralprov","Slutprov"]
[null,"Vikt",{"v":0.1,"d":"10.0%"},{"v":0.1,"d":"10.0%"},{"v":0.15,"d":"15.0%"},{"v":0.15,"d":"15.0%"},{"v":0.2,"d":"20.0%"},{"v":0.3,"d":"30.0%"}]
{"$rows_empty":26}
[null,"Totalt antal poäng",{"$f":"IF(COUNT(C8:C33) <> 0,AVERAGE(C8:C33) *C7, \"\")","v":""},"","","","",""]
[null,"Totalt antal möjliga poäng",{"$f":"IF(COUNT(C8:C33)<>0,C7,\"\")","v":""},"","","","",""]
[null,"Procent av totalt antal möjliga poäng",null,{"$f":"IF(SUM($C$35:$H$35) <> 0,SUM($C$34:$H$34)/SUM($C$35:$H$35),\"\")","v":""}]
[null,"Skriv betyg:","Skriv hur många poäng du har fått genom antal möjliga poäng (till exempel 15/17)."]
[null,null,"Skriv poängen i procent (till exempel 85 %)."]

{"sheet":"Ämne 5","index":5,"n_rows":38,"n_cols":8,"rows_kept":38,"merged":[[1,1,1,2]]}
[]
[null,{"$f":"Sammanfattning!B9","v":"Ämne 5"}]
[null,"Lärare:",null,null,"Procent av totalt antal möjliga poäng",null,null,{"$f":"IF(SUM($C$35:$H$35) <> 0,SUM($C$34:$H$34)/SUM($C$35:$H$35),\"\")","v":""}]
[null,"E-post:",null,null,"Aktuellt betyg",null,null,{"$f":"SUM($C$34:$H$34)","v":{"v":0,"d":"0.00%"}}]
[]
[null,"Uppgifter","Hemläxa","Uppsatser","Frågor","Projekt","Centralprov","Slutprov"]
[null,"Vikt",{"v":0.1,"d":"10.0%"},{"v":0.1,"d":"10.0%"},{"v":0.15,"d":"15.0%"},{"v":0.15,"d":"15.0%"},{"v":0.2,"d":"20.0%"},{"v":0.3,"d":"30.0%"}]
{"$rows_empty":26}
[null,"Totalt antal poäng",{"$f":"IF(COUNT(C8:C33) <> 0,AVERAGE(C8:C33) *C7, \"\")","v":""},"","","","",""]
[null,"Totalt antal möjliga poäng",{"$f":"IF(COUNT(C8:C33)<>0,C7,\"\")","v":""},"","","","",""]
[null,"Procent av totalt antal möjliga poäng",null,{"$f":"IF(SUM($C$35:$H$35) <> 0,SUM($C$34:$H$34)/SUM($C$35:$H$35),\"\")","v":""}]
[null,"Skriv betyg:","Skriv hur många poäng du har fått genom antal möjliga poäng (till exempel 15/17)."]
[null,null,"Skriv poängen i procent (till exempel 85 %)."]

{"sheet":"Ämne 6","index":6,"n_rows":38,"n_cols":8,"rows_kept":38,"merged":[[1,1,1,2]]}
[]
[null,{"$f":"Sammanfattning!B10","v":"Ämne 6"}]
[null,"Lärare:",null,null,"Procent av totalt antal möjliga poäng",null,null,{"$f":"IF(SUM($C$35:$H$35) <> 0,SUM($C$34:$H$34)/SUM($C$35:$H$35),\"\")","v":""}]
[null,"E-post:",null,null,"Aktuellt betyg",null,null,{"$f":"SUM($C$34:$H$34)","v":{"v":0,"d":"0.00%"}}]
[]
[null,"Uppgifter","Hemläxa","Uppsatser","Frågor","Projekt","Centralprov","Slutprov"]
[null,"Vikt",{"v":0.1,"d":"10.0%"},{"v":0.2,"d":"20.0%"},{"v":0.15,"d":"15.0%"},{"v":0.15,"d":"15.0%"},{"v":0.2,"d":"20.0%"},{"v":0.3,"d":"30.0%"}]
{"$rows_empty":26}
[null,"Totalt antal poäng",{"$f":"IF(COUNT(C8:C33) <> 0,AVERAGE(C8:C33) *C7, \"\")","v":""},"","","","",""]
[null,"Totalt antal möjliga poäng",{"$f":"IF(COUNT(C8:C33)<>0,C7,\"\")","v":""},"","","","",""]
[null,"Procent av totalt antal möjliga poäng",null,{"$f":"IF(SUM($C$35:$H$35) <> 0,SUM($C$34:$H$34)/SUM($C$35:$H$35),\"\")","v":""},{"$f":"IF(SUM($C$35:$H$35) <> 0,SUM($C$34:$H$34)/SUM($C$35:$H$35),\"\")","v":""}]
[null,"Skriv betyg:","Skriv hur många poäng du har fått genom antal möjliga poäng (till exempel 15/17)."]
[null,null,"Skriv poängen i procent (till exempel 85 %)."]

{"sheet":"Ämne 7","index":7,"n_rows":38,"n_cols":8,"rows_kept":38,"merged":[[1,1,1,2]]}
[]
[null,{"$f":"Sammanfattning!B11","v":"Ämne 7"}]
[null,"Lärare:",null,null,"Procent av totalt antal möjliga poäng",null,null,{"$f":"IF(SUM($C$35:$H$35) <> 0,SUM($C$34:$H$34)/SUM($C$35:$H$35),\"\")","v":""}]
[null,"E-post:",null,null,"Aktuellt betyg",null,null,{"$f":"SUM($C$34:$H$34)","v":{"v":0,"d":"0.00%"}}]
[]
[null,"Uppgifter","Hemläxa","Uppsatser","Frågor","Projekt","Centralprov","Slutprov"]
[null,"Vikt",{"v":0.1,"d":"10.0%"},{"v":0.1,"d":"10.0%"},{"v":0.15,"d":"15.0%"},{"v":0.15,"d":"15.0%"},{"v":0.2,"d":"20.0%"},{"v":0.3,"d":"30.0%"}]
{"$rows_empty":26}
[null,"Totalt antal poäng",{"$f":"IF(COUNT(C8:C33) <> 0,AVERAGE(C8:C33) *C7, \"\")","v":""},"","","","",""]
[null,"Totalt antal möjliga poäng",{"$f":"IF(COUNT(C8:C33)<>0,C7,\"\")","v":""},"","","","",""]
[null,"Procent av totalt antal möjliga poäng",null,{"$f":"IF(SUM($C$35:$H$35) <> 0,SUM($C$34:$H$34)/SUM($C$35:$H$35),\"\")","v":""}]
[null,"Skriv betyg:","Skriv hur många poäng du har fått genom antal möjliga poäng (till exempel 15/17)."]
[null,null,"Skriv poängen i procent (till exempel 85 %)."]

{"sheet":"Betygstabell","index":8,"n_rows":7,"n_cols":15,"rows_kept":7}
[]
[]
[]
[null,"Betygstabell"]
[null,"Medelbetyg",{"v":0,"d":"0%"},{"v":0.6,"d":"60%"},{"v":0.63,"d":"63%"},{"v":0.67,"d":"67%"},{"v":0.7,"d":"70%"},{"v":0.73,"d":"73%"},{"v":0.77,"d":"77%"},{"v":0.8,"d":"80%"},{"v":0.83,"d":"83%"},{"v":0.87,"d":"87%"},{"v":0.9,"d":"90%"},{"v":0.93,"d":"93%"},{"v":0.97,"d":"97%"}]
[null,"Betyg","F","D-","D","D+","C-","C","C+","B-","B","B+","A-","A","A+"]
[null,"Medelbetyg",{"v":0,"d":"0.00"},0.67,{"v":1,"d":"1.00"},1.33,1.67,{"v":2,"d":"2.00"},2.33,2.67,{"v":3,"d":"3.00"},3.33,3.67,{"v":4,"d":"4.00"},{"v":4,"d":"4.00"}]