{"text_format":"3","workbook":"xlsx","n_sheets":3,"sheets":["Evidencija obuke","Lista kurseva","Informacije o osoblju"],"not_rendered":{"defined_names":13},"read":"whole","date_system":"1900"}

{"sheet":"Evidencija obuke","index":0,"n_rows":23,"n_cols":9,"rows_kept":23}
[]
[]
[null,null,"EVIDENCIJA OBUKE"]
{"$rows_empty":8}
[null,null,"DATUM OBUKE","IME","KURS","PREDAVAČ","POHAĐAO","POLOŽIO/PAO","BELEŠKE"]
[null,null,"2012-06-01","Katarina Aleksić","Predstavljanje zaposlenog",{"$f":"IF(tblTrainingLog[[#This Row],[KURS]]=\"\",\"\",IFERROR(VLOOKUP(tblTrainingLog[[#This Row],[KURS]],tblCourseList[],2,0),\"Not Found\"))","v":"Kosta Jovanović"},"Da","Položio","Odličan predavač."]
[null,null,"2012-06-02","Milica Lukić","Predstavljanje zaposlenog",{"$f":"IF(tblTrainingLog[[#This Row],[KURS]]=\"\",\"\",IFERROR(VLOOKUP(tblTrainingLog[[#This Row],[KURS]],tblCourseList[],2,0),\"Not Found\"))","v":"Kosta Jovanović"},"Da","Pao","Morao je da napusti ranije, nije mogao da dovrši."]
[null,null,"2012-06-03","Rajko Varivoda","Predstavljanje zaposlenog",{"$f":"IF(tblTrainingLog[[#This Row],[KURS]]=\"\",\"\",IFERROR(VLOOKUP(tblTrainingLog[[#This Row],[KURS]],tblCourseList[],2,0),\"Not Found\"))","v":"Kosta Jovanović"},"Da","Položio","Poslednja ponuda u ovom kvartalu."]
[null,null,"2012-06-03","Milica Lukić","Predstavljanje zaposlenog",{"$f":"IF(tblTrainingLog[[#This Row],[KURS]]=\"\",\"\",IFERROR(VLOOKUP(tblTrainingLog[[#This Row],[KURS]],tblCourseList[],2,0),\"Not Found\"))","v":"Kosta Jovanović"},"Da","Položio","Poslednja ponuda u ovom kvartalu."]
[null,null,"2012-06-04","Milica Lukić","Poslovi zaposlenog",{"$f":"IF(tblTrainingLog[[#This Row],[KURS]]=\"\",\"\",IFERROR(VLOOKUP(tblTrainingLog[[#This Row],[KURS]],tblCourseList[],2,0),\"Not Found\"))","v":"Koviljka Jordić"},"Da","Položio","Prva ponuda za ovaj kvartal"]
[null,null,"2012-06-04","Rajko Varivoda","Poslovi zaposlenog",{"$f":"IF(tblTrainingLog[[#This Row],[KURS]]=\"\",\"\",IFERROR(VLOOKUP(tblTrainingLog[[#This Row],[KURS]],tblCourseList[],2,0),\"Not Found\"))","v":"Koviljka Jordić"},"Da","Položio","Prva ponuda za ovaj kvartal"]
[null,null,"2012-06-04","Rajko Varivoda","Računovodstvo – srednji nivo",{"$f":"IF(tblTrainingLog[[#This Row],[KURS]]=\"\",\"\",IFERROR(VLOOKUP(tblTrainingLog[[#This Row],[KURS]],tblCourseList[],2,0),\"Not Found\"))","v":"Koviljka Jordić"},"Da","Položio","Samo pozvana publika."]
[null,null,"2012-06-04","Katarina Aleksić","Poslovi zaposlenog",{"$f":"IF(tblTrainingLog[[#This Row],[KURS]]=\"\",\"\",IFERROR(VLOOKUP(tblTrainingLog[[#This Row],[KURS]],tblCourseList[],2,0),\"Not Found\"))","v":"Koviljka Jordić"},"Da","Položio","Prva ponuda za ovaj kvartal"]
[null,null,"2012-06-05","Katarina Aleksić","Računovodstvo – srednji nivo",{"$f":"IF(tblTrainingLog[[#This Row],[KURS]]=\"\",\"\",IFERROR(VLOOKUP(tblTrainingLog[[#This Row],[KURS]],tblCourseList[],2,0),\"Not Found\"))","v":"Koviljka Jordić"},"Ne","Buduća","Još nije pohađao."]
[null,null,"2012-06-05","Milica Lukić","Računovodstvo – napredni nivo",{"$f":"IF(tblTrainingLog[[#This Row],[KURS]]=\"\",\"\",IFERROR(VLOOKUP(tblTrainingLog[[#This Row],[KURS]],tblCourseList[],2,0),\"Not Found\"))","v":"Kosta Jovanović"},"Ne","Buduća","Još nije pohađao."]
[{"$nulls":5},{"$f":"IF(tblTrainingLog[[#This Row],[KURS]]=\"\",\"\",IFERROR(VLOOKUP(tblTrainingLog[[#This Row],[KURS]],tblCourseList[],2,0),\"Not Found\"))","v":""}]

{"sheet":"Lista kurseva","index":1,"n_rows":10,"n_cols":6,"rows_kept":10}
[]
[]
[null,null,"LISTA KURSEVA"]
[]
[null,null,"NASLOV","PREDAVAČ","OPIS","SATI"]
[null,null,"Predstavljanje zaposlenog","Kosta Jovanović","Predstavljanje osnovnog kursa novim zaposlenima. Definiše ciljeve i očekivanja po sektorima kao i vremenske okvire i ograničenja.",2]
[null,null,"Poslovi zaposlenog","Koviljka Jordić","Osnovni poslovi zaposlenog, obuhvata priručnik za zaposlene.",1]
[null,null,"Poslovi zaposlenog","Kosta Jovanović","Osnovne procedure i smernice u računovodstvu",1.5]
[null,null,"Računovodstvo – srednji nivo","Koviljka Jordić","Procedure i smernice u računovodstvu srednjeg nivoa",2]
[null,null,"Računovodstvo – napredni nivo","Kosta Jovanović","Napredne procedure i smernice u računovodstvu",2]

{"sheet":"Informacije o osoblju","index":2,"n_rows":9,"n_cols":5,"rows_kept":9}
[]
[]
[null,null,"INFORMACIJE O OSOBLJU"]
[]
[null,null,"IME","SEKTOR","NASLOV"]
[null,null,"Katarina Aleksić","Prodaja","Glavni računovođa"]
[null,null,"Milica Lukić","Računovodstvo","Računovođa"]
[null,null,"Rajko Varivoda","Računovodstvo","Računovođa"]
[null,null,"Katarina Lazarević","Računovodstvo","Računovođa"]