{"text_format":"3","workbook":"xlsx","n_sheets":3,"sheets":["Početak","Mesečni budžet za koledž","chart_calcs"],"not_rendered":{"charts":4,"defined_names":19},"read":"whole","date_system":"1900"}

{"sheet":"Početak","index":0,"n_rows":8,"n_cols":2,"rows_kept":8}
[null,"OSNOVNI PODACI O OVOM PREDLOŠKU"]
[null,"Koristite radni list „Mesečni budžet za fakultet“ za praćenje prihoda, troškova i protoka novca."]
[null,"Unesite mesečne prihode i troškove za izračunavanje ukupnog prihoda i troškova."]
[null,"Protok novca se automatski izračunava i grafikon protoka novca se automatski ažurira."]
[null,"Izaberite klizač da biste dobili dijagrame prihoda, troškova i protoka novca za mesec i godinu."]
[null,"Napomena: "]
[null,"Dodatna uputstva navedena su u koloni A na radnom listu. Taj tekst je namerno skriven. Da biste uklonili tekst, izaberite kolonu A, a zatim izaberite stavku „IZBRIŠI“. Da biste otkrili tekst, izaberite kolonu A, a zatim promenite boju fonta."]
[null," "]

{"sheet":"Mesečni budžet za koledž","index":1,"n_rows":72,"n_cols":17,"rows_kept":72}
[null,"Mesečni budžet za koledž",{"$nulls":14},{"$f":"\"\"","v":""}]
[{"$nulls":16},""]
[{"$nulls":16},""]
[null,{"$f":"chart_calcs!$D$6","v":"januar prihod:"},null,null,{"$f":"chart_calcs!$D$7","v":"januar troškovi:"},{"$nulls":7},{"$f":"chart_calcs!$D$8","v":"januar priliv novca:"},{"$nulls":3},""]
[null,{"$f":"\" \"&chart_calcs!$F$6","v":" 1.225 RSD"},null,null,{"$f":"\" \"&chart_calcs!$F$7","v":" 1.056 RSD"},{"$nulls":7},{"$f":"\" \"&chart_calcs!$F$8","v":" 169 RSD"},{"$nulls":3},""]
[{"$nulls":16},""]
[{"$nulls":16},""]
[{"$nulls":16},""]
[{"$nulls":16},""]
[{"$nulls":16},""]
[{"$nulls":16},""]
[{"$nulls":16},""]
[{"$nulls":16},""]
[{"$nulls":16},""]
[{"$nulls":16},""]
[{"$nulls":16},""]
[{"$nulls":16},""]
[{"$nulls":16},""]
[{"$nulls":16},""]
[{"$nulls":16},""]
[]
[]
[]
[]
[null,"JAN"]
[{"$nulls":15},{"$f":"SelectedPeriod","v":"JAN "}]
[null,"Mesečni protok novca nakon troškova",{"$f":"FirstMonth","v":"JAN "},{"$f":"NextMonth","v":"FEB "},"MAR ","APR ","MAJ ","JUN ","JUL ","AVG ","SEP ","OKT ","NOV ","DEC ","GODINA  ","% POV "]
[null,"Protok novca",{"$f":"C37-C72","v":169},69,192,199,204,{"v":-771,"d":"-771 "},124,154,{"v":-721,"d":"-721 "},109,34,{"v":-61,"d":"-61 "},{"$f":"SUM(C28:N28)","v":{"v":-299,"d":"-299 "}},{"$f":"INDEX($C28:$O28,,SelectedPeriodColumn)/INDEX($C$37:$O$37,,SelectedPeriodColumn)","v":{"v":0.13795918367346938,"d":"13.8%"}}]
[null,"Kumulativni protok novca",{"$f":"SUM($C$28:C$28)","v":169},{"$f":"SUM($C$28:D$28)","v":238},{"$f":"SUM($C$28:E$28)","v":430},{"$f":"SUM($C$28:F$28)","v":629},{"$f":"SUM($C$28:G$28)","v":833},{"$f":"SUM($C$28:H$28)","v":62},{"$f":"SUM($C$28:I$28)","v":186},{"$f":"SUM($C$28:J$28)","v":340},{"$f":"SUM($C$28:K$28)","v":{"v":-381,"d":"-381 "}},{"$f":"SUM($C$28:L$28)","v":{"v":-272,"d":"-272 "}},{"$f":"SUM($C$28:M$28)","v":{"v":-238,"d":"-238 "}},{"$f":"SUM($C$28:N$28)","v":{"v":-299,"d":"-299 "}}]
[]
[null,"MESEČNI PRIHOD",{"$f":"FirstMonth","v":"JAN "},{"$f":"NextMonth","v":"FEB "},"MAR ","APR ","MAJ ","JUN ","JUL ","AVG ","SEP ","OKT ","NOV ","DEC ","GODINA  ","% POV "]
[null,"Finansijska pomoć (donacije, stipendije, krediti) koji su vam isplaćeni",0,0,750,750,750,750,750,750,750,750,750,750,{"$f":"SUM(C32:N32)","v":{"v":7500,"d":"7,500 "}},{"$f":"INDEX($C32:$O32,,SelectedPeriodColumn)/INDEX($C$37:$O$37,,SelectedPeriodColumn)","v":{"v":0,"d":"0.0%"}}]
[null,"Plate nakon oporezivanja",450,450,450,450,450,450,450,450,550,350,350,350,{"v":5200,"d":"5,200 "},{"$f":"INDEX($C33:$O33,,SelectedPeriodColumn)/INDEX($C$37:$O$37,,SelectedPeriodColumn)","v":{"v":0.3673469387755102,"d":"36.7%"}}]
[null,"Finansijska pomoć od porodice",200,200,{"v":1000,"d":"1,000"},350,350,350,350,350,350,350,350,350,{"v":4550,"d":"4,550 "},{"$f":"INDEX($C34:$O34,,SelectedPeriodColumn)/INDEX($C$37:$O$37,,SelectedPeriodColumn)","v":{"v":0.16326530612244897,"d":"16.3%"}}]
[null,"Isplate iz ušteđevine",500,350,150,0,0,0,0,0,0,0,0,0,{"v":1000,"d":"1,000 "},{"$f":"INDEX($C35:$O35,,SelectedPeriodColumn)/INDEX($C$37:$O$37,,SelectedPeriodColumn)","v":{"v":0.40816326530612246,"d":"40.8%"}}]
[null,"Ostalo (podrška za dete, javnu pomoć, pokloni itd.)",75,75,75,75,75,75,75,75,75,75,75,75,{"v":900,"d":"900 "},{"$f":"INDEX($C36:$O36,,SelectedPeriodColumn)/INDEX($C$37:$O$37,,SelectedPeriodColumn)","v":{"v":0.061224489795918366,"d":"6.1%"}}]
[null,"UKUPAN PRIHOD",{"$f":"SUM(C32:C36)","v":{"v":1225,"d":"1,225"}},{"v":1075,"d":"1,075"},{"v":2425,"d":"2,425"},{"v":1625,"d":"1,625"},{"v":1625,"d":"1,625"},{"v":1625,"d":"1,625"},{"v":1625,"d":"1,625"},{"v":1625,"d":"1,625"},{"v":1725,"d":"1,725"},{"v":1525,"d":"1,525"},{"v":1525,"d":"1,525"},{"v":1525,"d":"1,525"},{"v":19150,"d":"19,150"},{"$f":"INDEX($C37:$O37,,SelectedPeriodColumn)/INDEX($C$37:$O$37,,SelectedPeriodColumn)","v":{"v":1,"d":"100.0%"}}]
[]
[null,"MESEČNI TROŠAK",{"$f":"FirstMonth","v":"JAN "},{"$f":"NextMonth","v":"FEB "},"MAR ","APR ","MAJ ","JUN ","JUL ","AVG ","SEP ","OKT ","NOV ","DEC ","GODINA  ","% POV "]
[null,"smeštaj i ishrana",{"$f":"SUM(C41:C43)","v":{"v":565,"d":"565 "}},{"v":565,"d":"565 "},{"v":565,"d":"565 "},{"v":565,"d":"565 "},{"v":565,"d":"565 "},{"v":565,"d":"565 "},{"v":565,"d":"565 "},{"v":565,"d":"565 "},{"v":565,"d":"565 "},{"v":565,"d":"565 "},{"v":565,"d":"565 "},{"v":565,"d":"565 "},{"$f":"SUM(C40:N40)","v":{"v":6780,"d":"6,780 "}},{"$f":"INDEX($C40:$O40,,SelectedPeriodColumn)/INDEX($C$72:$O$72,,SelectedPeriodColumn)","v":{"v":0.5350378787878788,"d":"53.5%"}}]
[null,null,315,315,315,315,315,315,315,315,315,315,315,315,{"$f":"SUM(C41:N41)","v":{"v":3780,"d":"3,780 "}},{"$f":"INDEX($C41:$O41,,SelectedPeriodColumn)/INDEX($C$72:$O$72,,SelectedPeriodColumn)","v":{"v":0.29829545454545453,"d":"29.8%"}}]
[null,null,200,200,200,200,200,200,200,200,200,200,200,200,{"$f":"SUM(C42:N42)","v":{"v":2400,"d":"2,400 "}},{"$f":"INDEX($C42:$O42,,SelectedPeriodColumn)/INDEX($C$72:$O$72,,SelectedPeriodColumn)","v":{"v":0.1893939393939394,"d":"18.9%"}}]
[null,null,50,50,50,50,50,50,50,50,50,50,50,50,{"$f":"SUM(C43:N43)","v":{"v":600,"d":"600 "}},{"$f":"INDEX($C43:$O43,,SelectedPeriodColumn)/INDEX($C$72:$O$72,,SelectedPeriodColumn)","v":{"v":0.04734848484848485,"d":"4.7%"}}]
[]
[null,"obuka i naknade",{"$f":"SUM(C46:C47)","v":{"v":0,"d":"0 "}},{"v":0,"d":"0 "},{"v":750,"d":"750 "},{"v":0,"d":"0 "},{"v":0,"d":"0 "},{"v":650,"d":"650 "},{"v":0,"d":"0 "},{"v":0,"d":"0 "},{"v":650,"d":"650 "},{"v":0,"d":"0 "},{"v":0,"d":"0 "},{"v":0,"d":"0 "},{"$f":"SUM(C45:N45)","v":{"v":2050,"d":"2,050 "}},{"$f":"INDEX($C45:$O45,,SelectedPeriodColumn)/INDEX($C$72:$O$72,,SelectedPeriodColumn)","v":{"v":0,"d":"0.0%"}}]
[null,null,0,0,500,0,0,500,0,0,500,0,0,0,{"$f":"SUM(C46:N46)","v":{"v":1500,"d":"1,500 "}},{"$f":"INDEX($C46:$O46,,SelectedPeriodColumn)/INDEX($C$72:$O$72,,SelectedPeriodColumn)","v":{"v":0,"d":"0.0%"}}]
[null,null,0,0,250,0,0,150,0,0,150,0,0,0,{"$f":"SUM(C47:N47)","v":{"v":550,"d":"550 "}},{"$f":"INDEX($C47:$O47,,SelectedPeriodColumn)/INDEX($C$72:$O$72,,SelectedPeriodColumn)","v":{"v":0,"d":"0.0%"}}]
[]
[null,"knjige i zalihe",{"$f":"SUM(C50:C51)","v":{"v":0,"d":"0 "}},{"v":0,"d":"0 "},{"v":325,"d":"325 "},{"v":20,"d":"20 "},{"v":20,"d":"20 "},{"v":325,"d":"325 "},{"v":10,"d":"10 "},{"v":10,"d":"10 "},{"v":400,"d":"400 "},{"v":15,"d":"15 "},{"v":15,"d":"15 "},{"v":15,"d":"15 "},{"$f":"SUM(C49:N49)","v":{"v":1155,"d":"1,155 "}},{"$f":"INDEX($C49:$O49,,SelectedPeriodColumn)/INDEX($C$72:$O$72,,SelectedPeriodColumn)","v":{"v":0,"d":"0.0%"}}]
[null,null,0,0,225,0,0,275,0,0,325,0,0,0,{"$f":"SUM(C50:N50)","v":{"v":825,"d":"825 "}},{"$f":"INDEX($C50:$O50,,SelectedPeriodColumn)/INDEX($C$72:$O$72,,SelectedPeriodColumn)","v":{"v":0,"d":"0.0%"}}]
[null,null,0,0,100,20,20,50,10,10,75,15,15,15,{"$f":"SUM(C51:N51)","v":{"v":330,"d":"330 "}},{"$f":"INDEX($C51:$O51,,SelectedPeriodColumn)/INDEX($C$72:$O$72,,SelectedPeriodColumn)","v":{"v":0,"d":"0.0%"}}]
[]
[null,"Prevoz",{"$f":"SUM(C54:C57)","v":{"v":224,"d":"224 "}},{"v":174,"d":"174 "},{"v":174,"d":"174 "},{"v":219,"d":"219 "},{"v":174,"d":"174 "},{"v":174,"d":"174 "},{"v":274,"d":"274 "},{"v":219,"d":"219 "},{"v":174,"d":"174 "},{"v":174,"d":"174 "},{"v":224,"d":"224 "},{"v":269,"d":"269 "},{"$f":"SUM(C53:N53)","v":{"v":2473,"d":"2,473 "}},{"$f":"INDEX($C53:$O53,,SelectedPeriodColumn)/INDEX($C$72:$O$72,,SelectedPeriodColumn)","v":{"v":0.21212121212121213,"d":"21.2%"}}]
[null,null,30,30,30,75,30,30,30,75,30,30,30,75,{"$f":"SUM(C54:N54)","v":{"v":495,"d":"495 "}},{"$f":"INDEX($C54:$O54,,SelectedPeriodColumn)/INDEX($C$72:$O$72,,SelectedPeriodColumn)","v":{"v":0.028409090909090908,"d":"2.8%"}}]
[null,null,129,129,129,129,129,129,129,129,129,129,129,129,{"$f":"SUM(C55:N55)","v":{"v":1548,"d":"1,548 "}},{"$f":"INDEX($C55:$O55,,SelectedPeriodColumn)/INDEX($C$72:$O$72,,SelectedPeriodColumn)","v":{"v":0.12215909090909091,"d":"12.2%"}}]
[null,null,15,15,15,15,15,15,15,15,15,15,15,15,{"$f":"SUM(C56:N56)","v":{"v":180,"d":"180 "}},{"$f":"INDEX($C56:$O56,,SelectedPeriodColumn)/INDEX($C$72:$O$72,,SelectedPeriodColumn)","v":{"v":0.014204545454545454,"d":"1.4%"}}]
[null,null,50,0,0,0,0,0,100,0,0,0,50,50,{"$f":"SUM(C57:N57)","v":{"v":250,"d":"250 "}},{"$f":"INDEX($C57:$O57,,SelectedPeriodColumn)/INDEX($C$72:$O$72,,SelectedPeriodColumn)","v":{"v":0.04734848484848485,"d":"4.7%"}}]
[]
[null,"Opcionalni",{"$f":"SUM(C60:C65)","v":{"v":69,"d":"69 "}},{"v":69,"d":"69 "},{"v":169,"d":"169 "},{"v":369,"d":"369 "},{"v":419,"d":"419 "},{"v":444,"d":"444 "},{"v":419,"d":"419 "},{"v":419,"d":"419 "},{"v":394,"d":"394 "},{"v":394,"d":"394 "},{"v":419,"d":"419 "},{"v":469,"d":"469 "},{"$f":"SUM(C59:N59)","v":{"v":4053,"d":"4,053 "}},{"$f":"INDEX($C59:$O59,,SelectedPeriodColumn)/INDEX($C$72:$O$72,,SelectedPeriodColumn)","v":{"v":0.06534090909090909,"d":"6.5%"}}]
[null,null,0,0,0,50,100,100,100,100,75,75,100,100,{"v":800,"d":"800 "},{"$f":"INDEX($C60:$O60,,SelectedPeriodColumn)/INDEX($C$72:$O$72,,SelectedPeriodColumn)","v":{"v":0,"d":"0.0%"}}]
[null,null,69,69,69,69,69,69,69,69,69,69,69,69,{"v":828,"d":"828 "},{"$f":"INDEX($C61:$O61,,SelectedPeriodColumn)/INDEX($C$72:$O$72,,SelectedPeriodColumn)","v":{"v":0.06534090909090909,"d":"6.5%"}}]
[null,null,0,0,0,0,0,25,0,0,0,0,0,50,{"v":75,"d":"75 "},{"$f":"INDEX($C62:$O62,,SelectedPeriodColumn)/INDEX($C$72:$O$72,,SelectedPeriodColumn)","v":{"v":0,"d":"0.0%"}}]
[null,null,0,0,100,100,100,100,100,100,100,100,100,100,{"v":1000,"d":"1,000 "},{"$f":"INDEX($C63:$O63,,SelectedPeriodColumn)/INDEX($C$72:$O$72,,SelectedPeriodColumn)","v":{"v":0,"d":"0.0%"}}]
[null,null,0,0,0,50,50,50,50,50,50,50,50,50,{"v":450,"d":"450 "},{"$f":"INDEX($C64:$O64,,SelectedPeriodColumn)/INDEX($C$72:$O$72,,SelectedPeriodColumn)","v":{"v":0,"d":"0.0%"}}]
[null,null,0,0,0,100,100,100,100,100,100,100,100,100,{"v":900,"d":"900 "},{"$f":"INDEX($C65:$O65,,SelectedPeriodColumn)/INDEX($C$72:$O$72,,SelectedPeriodColumn)","v":{"v":0,"d":"0.0%"}}]
[]
[null,"Ostali troškovi",{"$f":"SUM(C68:C70)","v":{"v":198,"d":"198 "}},{"$f":"SUM(D68:D70)","v":{"v":198,"d":"198 "}},{"v":250,"d":"250 "},{"v":253,"d":"253 "},{"v":243,"d":"243 "},{"v":238,"d":"238 "},{"v":233,"d":"233 "},{"v":258,"d":"258 "},{"v":263,"d":"263 "},{"v":268,"d":"268 "},{"v":268,"d":"268 "},{"v":268,"d":"268 "},{"$f":"SUM(C67:N67)","v":{"v":2938,"d":"2,938 "}},{"$f":"INDEX($C67:$O67,,SelectedPeriodColumn)/INDEX($C$72:$O$72,,SelectedPeriodColumn)","v":{"v":0.1875,"d":"18.8%"}}]
[null,null,123,123,123,123,123,123,123,123,123,123,123,123,{"$f":"SUM(C68:N68)","v":{"v":1476,"d":"1,476 "}},{"$f":"INDEX($C68:$O68,,SelectedPeriodColumn)/INDEX($C$72:$O$72,,SelectedPeriodColumn)","v":{"v":0.11647727272727272,"d":"11.6%"}}]
[null,null,0,0,52,55,45,40,35,60,65,70,70,70,{"$f":"SUM(C69:N69)","v":{"v":562,"d":"562 "}},{"$f":"INDEX($C69:$O69,,SelectedPeriodColumn)/INDEX($C$72:$O$72,,SelectedPeriodColumn)","v":{"v":0,"d":"0.0%"}}]
[null,null,75,75,75,75,75,75,75,75,75,75,75,75,{"$f":"SUM(C70:N70)","v":{"v":900,"d":"900 "}},{"$f":"INDEX($C70:$O70,,SelectedPeriodColumn)/INDEX($C$72:$O$72,,SelectedPeriodColumn)","v":{"v":0.07102272727272728,"d":"7.1%"}}]
[]
[null,"UKUPNI TROŠKOVI",{"$f":"SUM(C40,C45,C49,C53,C59,C67)","v":{"v":1056,"d":"1,056"}},{"v":1006,"d":"1,006"},{"v":2233,"d":"2,233"},{"v":1426,"d":"1,426"},{"v":1421,"d":"1,421"},{"v":2396,"d":"2,396"},{"v":1501,"d":"1,501"},{"v":1471,"d":"1,471"},{"v":2446,"d":"2,446"},{"v":1416,"d":"1,416"},{"v":1491,"d":"1,491"},{"v":1586,"d":"1,586"},{"$f":"SUM(C72:N72)","v":{"v":19449,"d":"19,449"}},{"$f":"INDEX($C72:$O72,,SelectedPeriodColumn)/INDEX($C$72:$O$72,,SelectedPeriodColumn)","v":{"v":1,"d":"100.0%"}}]

{"sheet":"chart_calcs","index":2,"n_rows":23,"n_cols":16,"rows_kept":23,"hidden":true}
["*** Ovaj list bi trebalo da ostane skriven ***"]
[]
[{"$nulls":3},{"$f":"IFERROR(LOWER(TEXT(VALUE(SelectedPeriod&\" 1\"),\"mmmm\")),\"godina\")","v":"januar"}]
[]
[{"$nulls":3},"Dinamički naslovi grafikona"]
[{"$nulls":3},{"$f":"D3&\" prihod:\"","v":"januar prihod:"},null,{"$f":"TEXT(INDEX('Mesečni budžet za koledž'!$C$37:$O$37,,SelectedPeriodColumn),\"#.##0 RSD\")","v":"1.225 RSD"}]
[{"$nulls":3},{"$f":"D3&\" troškovi:\"","v":"januar troškovi:"},null,{"$f":"TEXT(INDEX('Mesečni budžet za koledž'!$C$72:$O$72,,SelectedPeriodColumn),\"#.##0 RSD\")","v":"1.056 RSD"}]
[{"$nulls":3},{"$f":"D3&\" priliv novca:\"","v":"januar priliv novca:"},{"$f":"INDEX('Mesečni budžet za koledž'!C28:O28,ScrollBarValue)","v":169},{"$f":"TEXT(E8,\"#.##0 RSD\")","v":"169 RSD"}]
[]
[]
[]
[{"$nulls":3},{"$f":"LOWER('Mesečni budžet za koledž'!C27)","v":"jan "},{"$f":"LOWER('Mesečni budžet za koledž'!D27)","v":"feb "},{"$f":"LOWER('Mesečni budžet za koledž'!E27)","v":"mar "},{"$f":"LOWER('Mesečni budžet za koledž'!F27)","v":"apr "},{"$f":"LOWER('Mesečni budžet za koledž'!G27)","v":"maj "},{"$f":"LOWER('Mesečni budžet za koledž'!H27)","v":"jun "},{"$f":"LOWER('Mesečni budžet za koledž'!I27)","v":"jul "},{"$f":"LOWER('Mesečni budžet za koledž'!J27)","v":"avg "},{"$f":"LOWER('Mesečni budžet za koledž'!K27)","v":"sep "},{"$f":"LOWER('Mesečni budžet za koledž'!L27)","v":"okt "},{"$f":"LOWER('Mesečni budžet za koledž'!M27)","v":"nov "},{"$f":"LOWER('Mesečni budžet za koledž'!N27)","v":"dec "},{"$f":"LOWER('Mesečni budžet za koledž'!O27)","v":"godina  "}]
[null,null,"Vrednost trake za pomeranje: ",1]
[null,null,"Grafikon protoka novca: ",{"$f":"IF(SelectedPeriod='Mesečni budžet za koledž'!C$31,IF('Mesečni budžet za koledž'!$C$28:$O$28>=0,'Mesečni budžet za koledž'!$C$28:$O$28,NA()),NA())","v":69},{"$f":"IF(SelectedPeriod='Mesečni budžet za koledž'!D$31,IF('Mesečni budžet za koledž'!$C$28:$O$28>=0,'Mesečni budžet za koledž'!$C$28:$O$28,NA()),NA())","v":{"$error":"#N/A"}},{"$f":"IF(SelectedPeriod='Mesečni budžet za koledž'!E$31,IF('Mesečni budžet za koledž'!$C$28:$O$28>=0,'Mesečni budžet za koledž'!$C$28:$O$28,NA()),NA())","v":{"$error":"#N/A"}},{"$f":"IF(SelectedPeriod='Mesečni budžet za koledž'!F$31,IF('Mesečni budžet za koledž'!$C$28:$O$28>=0,'Mesečni budžet za koledž'!$C$28:$O$28,NA()),NA())","v":{"$error":"#N/A"}},{"$f":"IF(SelectedPeriod='Mesečni budžet za koledž'!G$31,IF('Mesečni budžet za koledž'!$C$28:$O$28>=0,'Mesečni budžet za koledž'!$C$28:$O$28,NA()),NA())","v":{"$error":"#N/A"}},{"$f":"IF(SelectedPeriod='Mesečni budžet za koledž'!H$31,IF('Mesečni budžet za koledž'!$C$28:$O$28>=0,'Mesečni budžet za koledž'!$C$28:$O$28,NA()),NA())","v":{"$error":"#N/A"}},{"$f":"IF(SelectedPeriod='Mesečni budžet za koledž'!I$31,IF('Mesečni budžet za koledž'!$C$28:$O$28>=0,'Mesečni budžet za koledž'!$C$28:$O$28,NA()),NA())","v":{"$error":"#N/A"}},{"$f":"IF(SelectedPeriod='Mesečni budžet za koledž'!J$31,IF('Mesečni budžet za koledž'!$C$28:$O$28>=0,'Mesečni budžet za koledž'!$C$28:$O$28,NA()),NA())","v":{"$error":"#N/A"}},{"$f":"IF(SelectedPeriod='Mesečni budžet za koledž'!K$31,IF('Mesečni budžet za koledž'!$C$28:$O$28>=0,'Mesečni budžet za koledž'!$C$28:$O$28,NA()),NA())","v":{"$error":"#N/A"}},{"$f":"IF(SelectedPeriod='Mesečni budžet za koledž'!L$31,IF('Mesečni budžet za koledž'!$C$28:$O$28>=0,'Mesečni budžet za koledž'!$C$28:$O$28,NA()),NA())","v":{"$error":"#N/A"}},{"$f":"IF(SelectedPeriod='Mesečni budžet za koledž'!M$31,IF('Mesečni budžet za koledž'!$C$28:$O$28>=0,'Mesečni budžet za koledž'!$C$28:$O$28,NA()),NA())","v":{"$error":"#N/A"}},{"$f":"IF(SelectedPeriod='Mesečni budžet za koledž'!N$31,IF('Mesečni budžet za koledž'!$C$28:$O$28>=0,'Mesečni budžet za koledž'!$C$28:$O$28,NA()),NA())","v":{"$error":"#N/A"}},{"$f":"IF(SelectedPeriod='Mesečni budžet za koledž'!O$31,IF('Mesečni budžet za koledž'!$C$28:$O$28>=0,'Mesečni budžet za koledž'!$C$28:$O$28,NA()),NA())","v":{"$error":"#N/A"}}]
[null,null,"Kumulativno: ",{"$f":"IF(SelectedPeriod='Mesečni budžet za koledž'!C$31,IF('Mesečni budžet za koledž'!$C$28:$O$28<0,'Mesečni budžet za koledž'!$C$28:$O$28,NA()),NA())","v":{"$error":"#N/A"}},{"$f":"IF(SelectedPeriod='Mesečni budžet za koledž'!D$31,IF('Mesečni budžet za koledž'!$C$28:$O$28<0,'Mesečni budžet za koledž'!$C$28:$O$28,NA()),NA())","v":{"$error":"#N/A"}},{"$f":"IF(SelectedPeriod='Mesečni budžet za koledž'!E$31,IF('Mesečni budžet za koledž'!$C$28:$O$28<0,'Mesečni budžet za koledž'!$C$28:$O$28,NA()),NA())","v":{"$error":"#N/A"}},{"$f":"IF(SelectedPeriod='Mesečni budžet za koledž'!F$31,IF('Mesečni budžet za koledž'!$C$28:$O$28<0,'Mesečni budžet za koledž'!$C$28:$O$28,NA()),NA())","v":{"$error":"#N/A"}},{"$f":"IF(SelectedPeriod='Mesečni budžet za koledž'!G$31,IF('Mesečni budžet za koledž'!$C$28:$O$28<0,'Mesečni budžet za koledž'!$C$28:$O$28,NA()),NA())","v":{"$error":"#N/A"}},{"$f":"IF(SelectedPeriod='Mesečni budžet za koledž'!H$31,IF('Mesečni budžet za koledž'!$C$28:$O$28<0,'Mesečni budžet za koledž'!$C$28:$O$28,NA()),NA())","v":{"$error":"#N/A"}},{"$f":"IF(SelectedPeriod='Mesečni budžet za koledž'!I$31,IF('Mesečni budžet za koledž'!$C$28:$O$28<0,'Mesečni budžet za koledž'!$C$28:$O$28,NA()),NA())","v":{"$error":"#N/A"}},{"$f":"IF(SelectedPeriod='Mesečni budžet za koledž'!J$31,IF('Mesečni budžet za koledž'!$C$28:$O$28<0,'Mesečni budžet za koledž'!$C$28:$O$28,NA()),NA())","v":{"$error":"#N/A"}},{"$f":"IF(SelectedPeriod='Mesečni budžet za koledž'!K$31,IF('Mesečni budžet za koledž'!$C$28:$O$28<0,'Mesečni budžet za koledž'!$C$28:$O$28,NA()),NA())","v":{"$error":"#N/A"}},{"$f":"IF(SelectedPeriod='Mesečni budžet za koledž'!L$31,IF('Mesečni budžet za koledž'!$C$28:$O$28<0,'Mesečni budžet za koledž'!$C$28:$O$28,NA()),NA())","v":{"$error":"#N/A"}},{"$f":"IF(SelectedPeriod='Mesečni budžet za koledž'!M$31,IF('Mesečni budžet za koledž'!$C$28:$O$28<0,'Mesečni budžet za koledž'!$C$28:$O$28,NA()),NA())","v":{"$error":"#N/A"}},{"$f":"IF(SelectedPeriod='Mesečni budžet za koledž'!N$31,IF('Mesečni budžet za koledž'!$C$28:$O$28<0,'Mesečni budžet za koledž'!$C$28:$O$28,NA()),NA())","v":{"$error":"#N/A"}},{"$f":"IF(SelectedPeriod='Mesečni budžet za koledž'!O$31,IF('Mesečni budžet za koledž'!$C$28:$O$28<0,'Mesečni budžet za koledž'!$C$28:$O$28,NA()),NA())","v":{"$error":"#N/A"}}]
[]
[]
[null,null,"PODACI GRAFIKONA PRIHODA"]
[null,null,"Finansijska pomoć (donacije, stipendije, krediti) koji su vam isplaćeni",{"$f":"'Mesečni budžet za koledž'!P32","v":{"v":0,"d":"0.0%"}}]
[null,null,"Plate nakon oporezivanja",{"$f":"'Mesečni budžet za koledž'!P33","v":{"v":0.3673469387755102,"d":"36.7%"}}]
[null,null,"Finansijska pomoć od porodice",{"$f":"'Mesečni budžet za koledž'!P34","v":{"v":0.16326530612244897,"d":"16.3%"}}]
[null,null,"Isplate iz ušteđevine",{"$f":"'Mesečni budžet za koledž'!P35","v":{"v":0.40816326530612246,"d":"40.8%"}}]
[null,null,"Ostalo (podrška za dete, javnu pomoć, pokloni itd.)",{"$f":"'Mesečni budžet za koledž'!P36","v":{"v":0.061224489795918366,"d":"6.1%"}}]