{"text_format":"3","workbook":"xlsx","n_sheets":3,"sheets":["Unos podataka","Izveštaj o prodaji","Prognoza prodaje"],"not_rendered":{"charts":5,"defined_names":8,"pivot_tables":1},"read":"whole","date_system":"1900"}

{"sheet":"Unos podataka","index":0,"n_rows":24,"n_cols":17,"rows_kept":24}
[{"$nulls":9},{"$f":"365*2","v":730}]
[null,"MESEČNO UNOS PODATAKA"]
[{"$nulls":11},"UKUPNE VREDNOSTI",null,null,"PROGNOZA"]
[]
[null,"DATUM","PREDUZEĆE","IZNOS","PLANIRANO","TROŠKOVI","PRIHOD","MESEC:","KVARTAL","GODINA","MESEC:2","KVARTAL3","GODIŠNJE","MESEC","KVARTAL4","GODINA ","GODINA 5"]
[null,{"$f":"40657+(365*2)","v":"2013-04-23"},"A. Korporacija „Datum“",{"v":6400,"d":"6,400.00 Din."},{"v":6200,"d":"6,200.00 Din."},{"v":4450,"d":"4,450.00 Din."},{"$f":"tblData[[#This Row],[IZNOS]]-tblData[[#This Row],[TROŠKOVI]]","v":{"v":1950,"d":"1,950.00 Din."}},{"$f":"DATE(YEAR('Unos podataka'!$B6),MONTH('Unos podataka'!$B6),1)","v":"2013-04-01"},{"$f":"LOOKUP(MONTH('Unos podataka'!$H6),{1,1;2,1;3,1;4,2;5,2;6,2;7,3;8,3;9,3;10,4;11,4;12,4})","v":{"v":2,"d":"Kvartal 2"}},{"$f":"YEAR('Unos podataka'!$B6)","v":2013},{"$f":"MONTH(tblData[[#This Row],[DATUM]])","v":4},{"$f":"SUMIFS(tblData[IZNOS],tblData[DATUM],\">=\"&EOMONTH(tblData[[#This Row],[DATUM]],-1)+1,tblData[DATUM],\"<=\"&EOMONTH(tblData[[#This Row],[DATUM]],0))","v":{"v":14600,"d":"14,600.00 Din."}},{"$f":"SUMIFS(tblData[IZNOS],tblData[DATUM],\">=\"&DATE(YEAR(tblData[[#This Row],[DATUM]]),1,1),tblData[DATUM],\"<=\"&DATE(YEAR(tblData[[#This Row],[DATUM]]),12,31),tblData[KVARTAL],tblData[[#This Row],[KVARTAL]])","v":{"v":50800,"d":"50,800.00 Din."}},{"$f":"SUMIFS(tblData[IZNOS],tblData[DATUM],\">=\"&DATE(YEAR(tblData[[#This Row],[DATUM]]),1,1),tblData[DATUM],\"<=\"&DATE(YEAR(tblData[[#This Row],[DATUM]]),12,31))","v":{"v":143800,"d":"143,800.00 Din."}},{"$f":"IFERROR(TREND($L$6:INDEX($L:$L,ROW(),1),$K$6:INDEX($K:$K,ROW(),1),IF(MONTH(tblData[[#This Row],[DATUM]])=12,13,MONTH(tblData[[#This Row],[DATUM]])+1)),\"\")","v":{"v":14600,"d":"14,600.00 Din."}},{"$f":"IFERROR(TREND($M$6:INDEX($M:$M,ROW(),1),$I$6:INDEX($I:$I,ROW(),1),IF(tblData[[#This Row],[KVARTAL]]=4,5,tblData[[#This Row],[KVARTAL]]+1)),\"\")","v":{"v":50800,"d":"50,800.00 Din."}},{"$f":"IFERROR(TREND($N$6:INDEX($N:$N,ROW(),1),$J$6:INDEX($J:$J,ROW(),1),tblData[[#This Row],[GODINA]]+1),\"\")","v":{"v":143800,"d":"143,800.00 Din."}}]
[null,{"$f":"40659+(365*2)","v":"2013-04-25"},"Apoteka „Kolo“",{"v":8200,"d":"8,200.00 Din."},{"v":8000,"d":"8,000.00 Din."},{"v":6400,"d":"6,400.00 Din."},{"$f":"tblData[[#This Row],[IZNOS]]-tblData[[#This Row],[TROŠKOVI]]","v":{"v":1800,"d":"1,800.00 Din."}},{"$f":"DATE(YEAR('Unos podataka'!$B7),MONTH('Unos podataka'!$B7),1)","v":"2013-04-01"},{"$f":"LOOKUP(MONTH('Unos podataka'!$H7),{1,1;2,1;3,1;4,2;5,2;6,2;7,3;8,3;9,3;10,4;11,4;12,4})","v":{"v":2,"d":"Kvartal 2"}},{"$f":"YEAR('Unos podataka'!$B7)","v":2013},{"$f":"MONTH(tblData[[#This Row],[DATUM]])","v":4},{"$f":"SUMIFS(tblData[IZNOS],tblData[DATUM],\">=\"&EOMONTH(tblData[[#This Row],[DATUM]],-1)+1,tblData[DATUM],\"<=\"&EOMONTH(tblData[[#This Row],[DATUM]],0))","v":{"v":14600,"d":"14,600.00 Din."}},{"$f":"SUMIFS(tblData[IZNOS],tblData[DATUM],\">=\"&DATE(YEAR(tblData[[#This Row],[DATUM]]),1,1),tblData[DATUM],\"<=\"&DATE(YEAR(tblData[[#This Row],[DATUM]]),12,31),tblData[KVARTAL],tblData[[#This Row],[KVARTAL]])","v":{"v":50800,"d":"50,800.00 Din."}},{"$f":"SUMIFS(tblData[IZNOS],tblData[DATUM],\">=\"&DATE(YEAR(tblData[[#This Row],[DATUM]]),1,1),tblData[DATUM],\"<=\"&DATE(YEAR(tblData[[#This Row],[DATUM]]),12,31))","v":{"v":143800,"d":"143,800.00 Din."}},{"$f":"IFERROR(TREND($L$6:INDEX($L:$L,ROW(),1),$K$6:INDEX($K:$K,ROW(),1),IF(MONTH(tblData[[#This Row],[DATUM]])=12,13,MONTH(tblData[[#This Row],[DATUM]])+1)),\"\")","v":{"v":14600,"d":"14,600.00 Din."}},{"$f":"IFERROR(TREND($M$6:INDEX($M:$M,ROW(),1),$I$6:INDEX($I:$I,ROW(),1),IF(tblData[[#This Row],[KVARTAL]]=4,5,tblData[[#This Row],[KVARTAL]]+1)),\"\")","v":{"v":50800,"d":"50,800.00 Din."}},{"$f":"IFERROR(TREND($N$6:INDEX($N:$N,ROW(),1),$J$6:INDEX($J:$J,ROW(),1),tblData[[#This Row],[GODINA]]+1),\"\")","v":{"v":143800,"d":"143,800.00 Din."}}]
[null,{"$f":"40671+(365*2)","v":"2013-05-07"},"Servis „Express“",{"v":4400,"d":"4,400.00 Din."},{"v":4200,"d":"4,200.00 Din."},{"v":2600,"d":"2,600.00 Din."},{"$f":"tblData[[#This Row],[IZNOS]]-tblData[[#This Row],[TROŠKOVI]]","v":{"v":1800,"d":"1,800.00 Din."}},{"$f":"DATE(YEAR('Unos podataka'!$B8),MONTH('Unos podataka'!$B8),1)","v":"2013-05-01"},{"$f":"LOOKUP(MONTH('Unos podataka'!$H8),{1,1;2,1;3,1;4,2;5,2;6,2;7,3;8,3;9,3;10,4;11,4;12,4})","v":{"v":2,"d":"Kvartal 2"}},{"$f":"YEAR('Unos podataka'!$B8)","v":2013},{"$f":"MONTH(tblData[[#This Row],[DATUM]])","v":5},{"$f":"SUMIFS(tblData[IZNOS],tblData[DATUM],\">=\"&EOMONTH(tblData[[#This Row],[DATUM]],-1)+1,tblData[DATUM],\"<=\"&EOMONTH(tblData[[#This Row],[DATUM]],0))","v":{"v":21800,"d":"21,800.00 Din."}},{"$f":"SUMIFS(tblData[IZNOS],tblData[DATUM],\">=\"&DATE(YEAR(tblData[[#This Row],[DATUM]]),1,1),tblData[DATUM],\"<=\"&DATE(YEAR(tblData[[#This Row],[DATUM]]),12,31),tblData[KVARTAL],tblData[[#This Row],[KVARTAL]])","v":{"v":50800,"d":"50,800.00 Din."}},{"$f":"SUMIFS(tblData[IZNOS],tblData[DATUM],\">=\"&DATE(YEAR(tblData[[#This Row],[DATUM]]),1,1),tblData[DATUM],\"<=\"&DATE(YEAR(tblData[[#This Row],[DATUM]]),12,31))","v":{"v":143800,"d":"143,800.00 Din."}},{"$f":"IFERROR(TREND($L$6:INDEX($L:$L,ROW(),1),$K$6:INDEX($K:$K,ROW(),1),IF(MONTH(tblData[[#This Row],[DATUM]])=12,13,MONTH(tblData[[#This Row],[DATUM]])+1)),\"\")","v":{"v":28999.999999999996,"d":"29,000.00 Din."}},{"$f":"IFERROR(TREND($M$6:INDEX($M:$M,ROW(),1),$I$6:INDEX($I:$I,ROW(),1),IF(tblData[[#This Row],[KVARTAL]]=4,5,tblData[[#This Row],[KVARTAL]]+1)),\"\")","v":{"v":50800,"d":"50,800.00 Din."}},{"$f":"IFERROR(TREND($N$6:INDEX($N:$N,ROW(),1),$J$6:INDEX($J:$J,ROW(),1),tblData[[#This Row],[GODINA]]+1),\"\")","v":{"v":143800,"d":"143,800.00 Din."}}]
[null,{"$f":"40678+(365*2)","v":"2013-05-14"},"Proseware, Inc.",{"v":5400,"d":"5,400.00 Din."},{"v":5500,"d":"5,500.00 Din."},{"v":4500,"d":"4,500.00 Din."},{"$f":"tblData[[#This Row],[IZNOS]]-tblData[[#This Row],[TROŠKOVI]]","v":{"v":900,"d":"900.00 Din."}},{"$f":"DATE(YEAR('Unos podataka'!$B9),MONTH('Unos podataka'!$B9),1)","v":"2013-05-01"},{"$f":"LOOKUP(MONTH('Unos podataka'!$H9),{1,1;2,1;3,1;4,2;5,2;6,2;7,3;8,3;9,3;10,4;11,4;12,4})","v":{"v":2,"d":"Kvartal 2"}},{"$f":"YEAR('Unos podataka'!$B9)","v":2013},{"$f":"MONTH(tblData[[#This Row],[DATUM]])","v":5},{"$f":"SUMIFS(tblData[IZNOS],tblData[DATUM],\">=\"&EOMONTH(tblData[[#This Row],[DATUM]],-1)+1,tblData[DATUM],\"<=\"&EOMONTH(tblData[[#This Row],[DATUM]],0))","v":{"v":21800,"d":"21,800.00 Din."}},{"$f":"SUMIFS(tblData[IZNOS],tblData[DATUM],\">=\"&DATE(YEAR(tblData[[#This Row],[DATUM]]),1,1),tblData[DATUM],\"<=\"&DATE(YEAR(tblData[[#This Row],[DATUM]]),12,31),tblData[KVARTAL],tblData[[#This Row],[KVARTAL]])","v":{"v":50800,"d":"50,800.00 Din."}},{"$f":"SUMIFS(tblData[IZNOS],tblData[DATUM],\">=\"&DATE(YEAR(tblData[[#This Row],[DATUM]]),1,1),tblData[DATUM],\"<=\"&DATE(YEAR(tblData[[#This Row],[DATUM]]),12,31))","v":{"v":143800,"d":"143,800.00 Din."}},{"$f":"IFERROR(TREND($L$6:INDEX($L:$L,ROW(),1),$K$6:INDEX($K:$K,ROW(),1),IF(MONTH(tblData[[#This Row],[DATUM]])=12,13,MONTH(tblData[[#This Row],[DATUM]])+1)),\"\")","v":{"v":29000,"d":"29,000.00 Din."}},{"$f":"IFERROR(TREND($M$6:INDEX($M:$M,ROW(),1),$I$6:INDEX($I:$I,ROW(),1),IF(tblData[[#This Row],[KVARTAL]]=4,5,tblData[[#This Row],[KVARTAL]]+1)),\"\")","v":{"v":50800,"d":"50,800.00 Din."}},{"$f":"IFERROR(TREND($N$6:INDEX($N:$N,ROW(),1),$J$6:INDEX($J:$J,ROW(),1),tblData[[#This Row],[GODINA]]+1),\"\")","v":{"v":143800,"d":"143,800.00 Din."}}]
[null,{"$f":"40678+(365*2)","v":"2013-05-14"},"Škola likovnih umetnosti",{"v":5800,"d":"5,800.00 Din."},{"v":6000,"d":"6,000.00 Din."},{"v":4500,"d":"4,500.00 Din."},{"$f":"tblData[[#This Row],[IZNOS]]-tblData[[#This Row],[TROŠKOVI]]","v":{"v":1300,"d":"1,300.00 Din."}},{"$f":"DATE(YEAR('Unos podataka'!$B10),MONTH('Unos podataka'!$B10),1)","v":"2013-05-01"},{"$f":"LOOKUP(MONTH('Unos podataka'!$H10),{1,1;2,1;3,1;4,2;5,2;6,2;7,3;8,3;9,3;10,4;11,4;12,4})","v":{"v":2,"d":"Kvartal 2"}},{"$f":"YEAR('Unos podataka'!$B10)","v":2013},{"$f":"MONTH(tblData[[#This Row],[DATUM]])","v":5},{"$f":"SUMIFS(tblData[IZNOS],tblData[DATUM],\">=\"&EOMONTH(tblData[[#This Row],[DATUM]],-1)+1,tblData[DATUM],\"<=\"&EOMONTH(tblData[[#This Row],[DATUM]],0))","v":{"v":21800,"d":"21,800.00 Din."}},{"$f":"SUMIFS(tblData[IZNOS],tblData[DATUM],\">=\"&DATE(YEAR(tblData[[#This Row],[DATUM]]),1,1),tblData[DATUM],\"<=\"&DATE(YEAR(tblData[[#This Row],[DATUM]]),12,31),tblData[KVARTAL],tblData[[#This Row],[KVARTAL]])","v":{"v":50800,"d":"50,800.00 Din."}},{"$f":"SUMIFS(tblData[IZNOS],tblData[DATUM],\">=\"&DATE(YEAR(tblData[[#This Row],[DATUM]]),1,1),tblData[DATUM],\"<=\"&DATE(YEAR(tblData[[#This Row],[DATUM]]),12,31))","v":{"v":143800,"d":"143,800.00 Din."}},{"$f":"IFERROR(TREND($L$6:INDEX($L:$L,ROW(),1),$K$6:INDEX($K:$K,ROW(),1),IF(MONTH(tblData[[#This Row],[DATUM]])=12,13,MONTH(tblData[[#This Row],[DATUM]])+1)),\"\")","v":{"v":29000,"d":"29,000.00 Din."}},{"$f":"IFERROR(TREND($M$6:INDEX($M:$M,ROW(),1),$I$6:INDEX($I:$I,ROW(),1),IF(tblData[[#This Row],[KVARTAL]]=4,5,tblData[[#This Row],[KVARTAL]]+1)),\"\")","v":{"v":50800,"d":"50,800.00 Din."}},{"$f":"IFERROR(TREND($N$6:INDEX($N:$N,ROW(),1),$J$6:INDEX($J:$J,ROW(),1),tblData[[#This Row],[GODINA]]+1),\"\")","v":{"v":143800,"d":"143,800.00 Din."}}]
[null,{"$f":"40693+(365*2)","v":"2013-05-29"},"Top Consulting",{"v":6200,"d":"6,200.00 Din."},{"v":6000,"d":"6,000.00 Din."},{"v":4500,"d":"4,500.00 Din."},{"$f":"tblData[[#This Row],[IZNOS]]-tblData[[#This Row],[TROŠKOVI]]","v":{"v":1700,"d":"1,700.00 Din."}},{"$f":"DATE(YEAR('Unos podataka'!$B11),MONTH('Unos podataka'!$B11),1)","v":"2013-05-01"},{"$f":"LOOKUP(MONTH('Unos podataka'!$H11),{1,1;2,1;3,1;4,2;5,2;6,2;7,3;8,3;9,3;10,4;11,4;12,4})","v":{"v":2,"d":"Kvartal 2"}},{"$f":"YEAR('Unos podataka'!$B11)","v":2013},{"$f":"MONTH(tblData[[#This Row],[DATUM]])","v":5},{"$f":"SUMIFS(tblData[IZNOS],tblData[DATUM],\">=\"&EOMONTH(tblData[[#This Row],[DATUM]],-1)+1,tblData[DATUM],\"<=\"&EOMONTH(tblData[[#This Row],[DATUM]],0))","v":{"v":21800,"d":"21,800.00 Din."}},{"$f":"SUMIFS(tblData[IZNOS],tblData[DATUM],\">=\"&DATE(YEAR(tblData[[#This Row],[DATUM]]),1,1),tblData[DATUM],\"<=\"&DATE(YEAR(tblData[[#This Row],[DATUM]]),12,31),tblData[KVARTAL],tblData[[#This Row],[KVARTAL]])","v":{"v":50800,"d":"50,800.00 Din."}},{"$f":"SUMIFS(tblData[IZNOS],tblData[DATUM],\">=\"&DATE(YEAR(tblData[[#This Row],[DATUM]]),1,1),tblData[DATUM],\"<=\"&DATE(YEAR(tblData[[#This Row],[DATUM]]),12,31))","v":{"v":143800,"d":"143,800.00 Din."}},{"$f":"IFERROR(TREND($L$6:INDEX($L:$L,ROW(),1),$K$6:INDEX($K:$K,ROW(),1),IF(MONTH(tblData[[#This Row],[DATUM]])=12,13,MONTH(tblData[[#This Row],[DATUM]])+1)),\"\")","v":{"v":29000,"d":"29,000.00 Din."}},{"$f":"IFERROR(TREND($M$6:INDEX($M:$M,ROW(),1),$I$6:INDEX($I:$I,ROW(),1),IF(tblData[[#This Row],[KVARTAL]]=4,5,tblData[[#This Row],[KVARTAL]]+1)),\"\")","v":{"v":50800,"d":"50,800.00 Din."}},{"$f":"IFERROR(TREND($N$6:INDEX($N:$N,ROW(),1),$J$6:INDEX($J:$J,ROW(),1),tblData[[#This Row],[GODINA]]+1),\"\")","v":{"v":143800,"d":"143,800.00 Din."}}]
[null,{"$f":"40705+(365*2)","v":"2013-06-10"},"A. Korporacija „Datum“",{"v":6900,"d":"6,900.00 Din."},{"v":7500,"d":"7,500.00 Din."},{"v":5400,"d":"5,400.00 Din."},{"$f":"tblData[[#This Row],[IZNOS]]-tblData[[#This Row],[TROŠKOVI]]","v":{"v":1500,"d":"1,500.00 Din."}},{"$f":"DATE(YEAR('Unos podataka'!$B12),MONTH('Unos podataka'!$B12),1)","v":"2013-06-01"},{"$f":"LOOKUP(MONTH('Unos podataka'!$H12),{1,1;2,1;3,1;4,2;5,2;6,2;7,3;8,3;9,3;10,4;11,4;12,4})","v":{"v":2,"d":"Kvartal 2"}},{"$f":"YEAR('Unos podataka'!$B12)","v":2013},{"$f":"MONTH(tblData[[#This Row],[DATUM]])","v":6},{"$f":"SUMIFS(tblData[IZNOS],tblData[DATUM],\">=\"&EOMONTH(tblData[[#This Row],[DATUM]],-1)+1,tblData[DATUM],\"<=\"&EOMONTH(tblData[[#This Row],[DATUM]],0))","v":{"v":14400,"d":"14,400.00 Din."}},{"$f":"SUMIFS(tblData[IZNOS],tblData[DATUM],\">=\"&DATE(YEAR(tblData[[#This Row],[DATUM]]),1,1),tblData[DATUM],\"<=\"&DATE(YEAR(tblData[[#This Row],[DATUM]]),12,31),tblData[KVARTAL],tblData[[#This Row],[KVARTAL]])","v":{"v":50800,"d":"50,800.00 Din."}},{"$f":"SUMIFS(tblData[IZNOS],tblData[DATUM],\">=\"&DATE(YEAR(tblData[[#This Row],[DATUM]]),1,1),tblData[DATUM],\"<=\"&DATE(YEAR(tblData[[#This Row],[DATUM]]),12,31))","v":{"v":143800,"d":"143,800.00 Din."}},{"$f":"IFERROR(TREND($L$6:INDEX($L:$L,ROW(),1),$K$6:INDEX($K:$K,ROW(),1),IF(MONTH(tblData[[#This Row],[DATUM]])=12,13,MONTH(tblData[[#This Row],[DATUM]])+1)),\"\")","v":{"v":21600.000000000004,"d":"21,600.00 Din."}},{"$f":"IFERROR(TREND($M$6:INDEX($M:$M,ROW(),1),$I$6:INDEX($I:$I,ROW(),1),IF(tblData[[#This Row],[KVARTAL]]=4,5,tblData[[#This Row],[KVARTAL]]+1)),\"\")","v":{"v":50800,"d":"50,800.00 Din."}},{"$f":"IFERROR(TREND($N$6:INDEX($N:$N,ROW(),1),$J$6:INDEX($J:$J,ROW(),1),tblData[[#This Row],[GODINA]]+1),\"\")","v":{"v":143800,"d":"143,800.00 Din."}}]
[null,{"$f":"40716+(365*2)","v":"2013-06-21"},"Apoteka „Kolo“",{"v":7500,"d":"7,500.00 Din."},{"v":7200,"d":"7,200.00 Din."},{"v":6500,"d":"6,500.00 Din."},{"$f":"tblData[[#This Row],[IZNOS]]-tblData[[#This Row],[TROŠKOVI]]","v":{"v":1000,"d":"1,000.00 Din."}},{"$f":"DATE(YEAR('Unos podataka'!$B13),MONTH('Unos podataka'!$B13),1)","v":"2013-06-01"},{"$f":"LOOKUP(MONTH('Unos podataka'!$H13),{1,1;2,1;3,1;4,2;5,2;6,2;7,3;8,3;9,3;10,4;11,4;12,4})","v":{"v":2,"d":"Kvartal 2"}},{"$f":"YEAR('Unos podataka'!$B13)","v":2013},{"$f":"MONTH(tblData[[#This Row],[DATUM]])","v":6},{"$f":"SUMIFS(tblData[IZNOS],tblData[DATUM],\">=\"&EOMONTH(tblData[[#This Row],[DATUM]],-1)+1,tblData[DATUM],\"<=\"&EOMONTH(tblData[[#This Row],[DATUM]],0))","v":{"v":14400,"d":"14,400.00 Din."}},{"$f":"SUMIFS(tblData[IZNOS],tblData[DATUM],\">=\"&DATE(YEAR(tblData[[#This Row],[DATUM]]),1,1),tblData[DATUM],\"<=\"&DATE(YEAR(tblData[[#This Row],[DATUM]]),12,31),tblData[KVARTAL],tblData[[#This Row],[KVARTAL]])","v":{"v":50800,"d":"50,800.00 Din."}},{"$f":"SUMIFS(tblData[IZNOS],tblData[DATUM],\">=\"&DATE(YEAR(tblData[[#This Row],[DATUM]]),1,1),tblData[DATUM],\"<=\"&DATE(YEAR(tblData[[#This Row],[DATUM]]),12,31))","v":{"v":143800,"d":"143,800.00 Din."}},{"$f":"IFERROR(TREND($L$6:INDEX($L:$L,ROW(),1),$K$6:INDEX($K:$K,ROW(),1),IF(MONTH(tblData[[#This Row],[DATUM]])=12,13,MONTH(tblData[[#This Row],[DATUM]])+1)),\"\")","v":{"v":17950,"d":"17,950.00 Din."}},{"$f":"IFERROR(TREND($M$6:INDEX($M:$M,ROW(),1),$I$6:INDEX($I:$I,ROW(),1),IF(tblData[[#This Row],[KVARTAL]]=4,5,tblData[[#This Row],[KVARTAL]]+1)),\"\")","v":{"v":50800,"d":"50,800.00 Din."}},{"$f":"IFERROR(TREND($N$6:INDEX($N:$N,ROW(),1),$J$6:INDEX($J:$J,ROW(),1),tblData[[#This Row],[GODINA]]+1),\"\")","v":{"v":143800,"d":"143,800.00 Din."}}]
[null,{"$f":"40731+(365*2)","v":"2013-07-06"},"Servis „Express“",{"v":8700,"d":"8,700.00 Din."},{"v":8500,"d":"8,500.00 Din."},{"v":7250,"d":"7,250.00 Din."},{"$f":"tblData[[#This Row],[IZNOS]]-tblData[[#This Row],[TROŠKOVI]]","v":{"v":1450,"d":"1,450.00 Din."}},{"$f":"DATE(YEAR('Unos podataka'!$B14),MONTH('Unos podataka'!$B14),1)","v":"2013-07-01"},{"$f":"LOOKUP(MONTH('Unos podataka'!$H14),{1,1;2,1;3,1;4,2;5,2;6,2;7,3;8,3;9,3;10,4;11,4;12,4})","v":{"v":3,"d":"Kvartal 3"}},{"$f":"YEAR('Unos podataka'!$B14)","v":2013},{"$f":"MONTH(tblData[[#This Row],[DATUM]])","v":7},{"$f":"SUMIFS(tblData[IZNOS],tblData[DATUM],\">=\"&EOMONTH(tblData[[#This Row],[DATUM]],-1)+1,tblData[DATUM],\"<=\"&EOMONTH(tblData[[#This Row],[DATUM]],0))","v":{"v":8700,"d":"8,700.00 Din."}},{"$f":"SUMIFS(tblData[IZNOS],tblData[DATUM],\">=\"&DATE(YEAR(tblData[[#This Row],[DATUM]]),1,1),tblData[DATUM],\"<=\"&DATE(YEAR(tblData[[#This Row],[DATUM]]),12,31),tblData[KVARTAL],tblData[[#This Row],[KVARTAL]])","v":{"v":49100,"d":"49,100.00 Din."}},{"$f":"SUMIFS(tblData[IZNOS],tblData[DATUM],\">=\"&DATE(YEAR(tblData[[#This Row],[DATUM]]),1,1),tblData[DATUM],\"<=\"&DATE(YEAR(tblData[[#This Row],[DATUM]]),12,31))","v":{"v":143800,"d":"143,800.00 Din."}},{"$f":"IFERROR(TREND($L$6:INDEX($L:$L,ROW(),1),$K$6:INDEX($K:$K,ROW(),1),IF(MONTH(tblData[[#This Row],[DATUM]])=12,13,MONTH(tblData[[#This Row],[DATUM]])+1)),\"\")","v":{"v":10776.470588235294,"d":"10,776.47 Din."}},{"$f":"IFERROR(TREND($M$6:INDEX($M:$M,ROW(),1),$I$6:INDEX($I:$I,ROW(),1),IF(tblData[[#This Row],[KVARTAL]]=4,5,tblData[[#This Row],[KVARTAL]]+1)),\"\")","v":{"v":47400,"d":"47,400.00 Din."}},{"$f":"IFERROR(TREND($N$6:INDEX($N:$N,ROW(),1),$J$6:INDEX($J:$J,ROW(),1),tblData[[#This Row],[GODINA]]+1),\"\")","v":{"v":143800,"d":"143,800.00 Din."}}]
[null,{"$f":"40761+(365*2)","v":"2013-08-05"},"Proseware, Inc.",{"v":8500,"d":"8,500.00 Din."},{"v":8300,"d":"8,300.00 Din."},{"v":7100,"d":"7,100.00 Din."},{"$f":"tblData[[#This Row],[IZNOS]]-tblData[[#This Row],[TROŠKOVI]]","v":{"v":1400,"d":"1,400.00 Din."}},{"$f":"DATE(YEAR('Unos podataka'!$B15),MONTH('Unos podataka'!$B15),1)","v":"2013-08-01"},{"$f":"LOOKUP(MONTH('Unos podataka'!$H15),{1,1;2,1;3,1;4,2;5,2;6,2;7,3;8,3;9,3;10,4;11,4;12,4})","v":{"v":3,"d":"Kvartal 3"}},{"$f":"YEAR('Unos podataka'!$B15)","v":2013},{"$f":"MONTH(tblData[[#This Row],[DATUM]])","v":8},{"$f":"SUMIFS(tblData[IZNOS],tblData[DATUM],\">=\"&EOMONTH(tblData[[#This Row],[DATUM]],-1)+1,tblData[DATUM],\"<=\"&EOMONTH(tblData[[#This Row],[DATUM]],0))","v":{"v":16400,"d":"16,400.00 Din."}},{"$f":"SUMIFS(tblData[IZNOS],tblData[DATUM],\">=\"&DATE(YEAR(tblData[[#This Row],[DATUM]]),1,1),tblData[DATUM],\"<=\"&DATE(YEAR(tblData[[#This Row],[DATUM]]),12,31),tblData[KVARTAL],tblData[[#This Row],[KVARTAL]])","v":{"v":49100,"d":"49,100.00 Din."}},{"$f":"SUMIFS(tblData[IZNOS],tblData[DATUM],\">=\"&DATE(YEAR(tblData[[#This Row],[DATUM]]),1,1),tblData[DATUM],\"<=\"&DATE(YEAR(tblData[[#This Row],[DATUM]]),12,31))","v":{"v":143800,"d":"143,800.00 Din."}},{"$f":"IFERROR(TREND($L$6:INDEX($L:$L,ROW(),1),$K$6:INDEX($K:$K,ROW(),1),IF(MONTH(tblData[[#This Row],[DATUM]])=12,13,MONTH(tblData[[#This Row],[DATUM]])+1)),\"\")","v":{"v":12455.862068965516,"d":"12,455.86 Din."}},{"$f":"IFERROR(TREND($M$6:INDEX($M:$M,ROW(),1),$I$6:INDEX($I:$I,ROW(),1),IF(tblData[[#This Row],[KVARTAL]]=4,5,tblData[[#This Row],[KVARTAL]]+1)),\"\")","v":{"v":47400,"d":"47,400.00 Din."}},{"$f":"IFERROR(TREND($N$6:INDEX($N:$N,ROW(),1),$J$6:INDEX($J:$J,ROW(),1),tblData[[#This Row],[GODINA]]+1),\"\")","v":{"v":143800,"d":"143,800.00 Din."}}]
{"$rows_left_out":10}
{"sheet":"Izveštaj o prodaji","index":1,"n_rows":28,"n_cols":6,"rows_kept":28}
[]
[null,"MESEČNO IZVEŠTAJ O PRODAJI"]
[]
[]
[null,"GODINA","KVARTAL","MESEC:","PREDUZEĆE","UKUPAN PRIHOD"]
[null,2013,{"v":2,"d":"Kvartal 2"},"2013-04-01","A. Korporacija „Datum“",{"v":6400,"d":"6,400.00 Din."}]
[{"$nulls":4},"Apoteka „Kolo“",{"v":8200,"d":"8,200.00 Din."}]
[{"$nulls":3},"2013-05-01","Proseware, Inc.",{"v":5400,"d":"5,400.00 Din."}]
[{"$nulls":4},"Servis „Express“",{"v":4400,"d":"4,400.00 Din."}]
[{"$nulls":4},"Škola likovnih umetnosti",{"v":5800,"d":"5,800.00 Din."}]
[{"$nulls":4},"Top Consulting",{"v":6200,"d":"6,200.00 Din."}]
[{"$nulls":3},"2013-06-01","A. Korporacija „Datum“",{"v":6900,"d":"6,900.00 Din."}]
[{"$nulls":4},"Apoteka „Kolo“",{"v":7500,"d":"7,500.00 Din."}]
[null,null,"Kvartal 2 Zbir",null,null,{"v":50800,"d":"50,800.00 Din."}]
[null,null,{"v":3,"d":"Kvartal 3"},"2013-07-01","Servis „Express“",{"v":8700,"d":"8,700.00 Din."}]
{"$rows_left_out":14}
{"sheet":"Prognoza prodaje","index":2,"n_rows":43,"n_cols":10,"rows_kept":43}
[]
[null,"MESEČNO PROGNOZA PRODAJE"]
[null,{"$f":"\"DANAŠNJI DATUM: \"&UPPER(TEXT(TODAY(),\"d.mmm.yy\"))","v":"DANAŠNJI DATUM: 29.OKT.12"},null,{"$f":"--TRIM(RIGHT(B3,LEN(B3)-FIND(\":\",B3)))","v":"2012-10-29"}]
[]
[null,"OVOG MESECA","STVARNO","PLAN","ODSTUPANJE","%","STVARNO DO OVOG DATUMA","PLAN DO OVOG DATUMA","ODSTUPANJA DO OVOG DATUMA","DO OVOG DATUMA UKUPNO %"]
[null,"Količina",{"$f":"COUNTIF('Unos podataka'!$B$6:$B$24,\">=\"&DATE(fYear,MONTH(fDate),1))-COUNTIF('Unos podataka'!$B$6:$B$24,\">\"&EOMONTH(fDate,0))","v":0},{"$nulls":3},{"$f":"COUNTIF(tblData[DATUM],\"<=\"&EOMONTH(fDate,0))","v":0}]
[null,"Prodaja",{"$f":"SUMIF(tblData[DATUM],\">=\"&DATE(fYear,MONTH(fDate),1),tblData[IZNOS])-SUMIF(tblData[DATUM],\">\"&EOMONTH(fDate,0),tblData[IZNOS])","v":{"v":0,"d":"0.00 Din."}},{"$f":"SUMIF('Unos podataka'!$B$6:$B$24,\">=\"&DATE(fYear,MONTH(fDate),1),'Unos podataka'!$E$6:$E$24)-SUMIF('Unos podataka'!$B$6:$B$24,\">\"&EOMONTH(fDate,0),'Unos podataka'!$E$6:$E$24)","v":{"v":0,"d":"0.00 Din."}},{"$f":"D7-C7","v":{"v":0,"d":"0.00 Din."}},{"$f":"IFERROR(D7/C7,\"-\")","v":"-"},{"$f":"SUMIF(tblData[DATUM],\"<=\"&EOMONTH(fDate,0),tblData[IZNOS])","v":{"v":0,"d":"0.00 Din."}},{"$f":"SUMIF(tblData[DATUM],\"<=\"&EOMONTH(fDate,0),tblData[PLANIRANO])","v":{"v":0,"d":"0.00 Din."}},{"$f":"H7-G7","v":{"v":0,"d":"0.00 Din."}},{"$f":"IFERROR(H7/G7,\"\")","v":""}]
[null,"Prihodi",{"$f":"(SUMIF(tblData[DATUM],\">=\"&DATE(fYear,MONTH(fDate),1),tblData[IZNOS])-SUMIF(tblData[DATUM],\">\"&EOMONTH(fDate,0),tblData[IZNOS]))-(SUMIF(tblData[DATUM],\">=\"&DATE(fYear,MONTH(fDate),1),tblData[TROŠKOVI])-SUMIF(tblData[DATUM],\">\"&EOMONTH(fDate,0),tblData[TROŠKOVI]))","v":{"v":0,"d":"0.00 Din."}},{"$f":"(SUMIF('Unos podataka'!$B$6:$B$24,\">=\"&DATE(fYear,MONTH(fDate),1),'Unos podataka'!$E$6:$E$24)-SUMIF('Unos podataka'!$B$6:$B$24,\">\"&EOMONTH(fDate,0),'Unos podataka'!$E$6:$E$24))-(SUMIF('Unos podataka'!$B$6:$B$24,\">=\"&DATE(fYear,MONTH(fDate),1),'Unos podataka'!$F$6:$F$24)-SUMIF('Unos podataka'!$B$6:$B$24,\">\"&EOMONTH(fDate,0),'Unos podataka'!$F$6:$F$24))","v":{"v":0,"d":"0.00 Din."}},{"$f":"D8-C8","v":{"v":0,"d":"0.00 Din."}},{"$f":"IFERROR(D8/C8,\"-\")","v":"-"},{"$f":"SUMIF('Unos podataka'!$B$6:$B$24,\"<=\"&EOMONTH(fDate,0),'Unos podataka'!$F$6:$F$24)","v":{"v":0,"d":"0.00 Din."}},{"$f":"SUMIF(tblData[DATUM],\"<=\"&EOMONTH(fDate,0),tblData[TROŠKOVI])","v":{"v":0,"d":"0.00 Din."}},{"$f":"H8-G8","v":{"v":0,"d":"0.00 Din."}},{"$f":"IFERROR(H8/G8,\"\")","v":""}]
[null,"Marža",{"$f":"IFERROR(C8/C7,\"-\")","v":"-"},{"$f":"IFERROR(D8/D7,\"-\")","v":"-"},null,{"$f":"IFERROR(F8/F7,\"-\")","v":"-"},{"$f":"IFERROR(G8/G7,\"\")","v":""},{"$f":"IFERROR(H8/H7,\"\")","v":""},null,{"$f":"IFERROR(J8/J7,\"\")","v":""}]
[null,"Broj porudžbina",{"$f":"COUNTIF(tblData[DATUM],\">=\"&DATE(fYear,MONTH(fDate),1))-COUNTIF(tblData[DATUM],\">\"&EOMONTH(fDate,0))","v":0},{"$nulls":3},{"$f":"COUNTIF(tblData[DATUM],\">\"&EOMONTH(fDate,0))","v":19}]
[null,"Prosečna vrednost porudžbine",{"$f":"IFERROR(C7/C10,\"-\")","v":"-"},{"$nulls":3},{"$f":"IFERROR(G7/G10,\"-\")","v":{"v":0,"d":"0.00 Din."}}]
[]
[null,"PROGNOZA",null,"SLEDEĆI MESEC",null,"SLEDEĆI KVARTAL",null,null,"SLEDEĆA GODINA"]
[null,"Prodaja",null,{"$f":"TREND(tblData[KVARTAL3],tblData[MESEC:2],IF(MONTH(fDate)=12,13,MONTH(fDate)+1))","v":{"v":19802.70727580372,"d":"19,802.71 Din."}},null,{"$f":"TREND(tblData[[GODINA ]],tblData[MESEC:2],IF(MONTH(fDate)=12,13,MONTH(fDate)+1))","v":{"v":42981.66600888469,"d":"42,981.67 Din."}},null,null,{"$f":"TREND(tblData[GODINA 5],tblData[MESEC:2],IF(MONTH(fDate)=12,13,MONTH(fDate)+1))","v":{"v":143800,"d":"143,800.00 Din."}}]
[]
{"$rows_left_out":10}