{"text_format":"3","workbook":"xlsx","n_sheets":3,"sheets":["Vnos podatkov","Poročilo o prodaji","Napoved prodaje"],"not_rendered":{"charts":5,"defined_names":7,"pivot_tables":1},"read":"whole","date_system":"1900"}

{"sheet":"Vnos podatkov","index":0,"n_rows":24,"n_cols":17,"rows_kept":24}
[{"$nulls":9},{"$f":"365*2","v":730}]
[null,"MESEČNO VNOS PODATKOV"]
[{"$nulls":11},"SKUPAJ",null,null,"NAPOVED"]
[]
[null,"DATUM","PODJETJE","ZNESEK","NAČRTOVANO","STROŠEK","PRIHODKI","MESEC","ČETRTLETJE","LETO","MESEČNO ŠT. (SKRITO)"," MESEC","ČETRTLETJE ","LETNO "," MESEC2","ČETRTLETJE  ","LETO  "]
[null,{"$f":"40657+(365*2)","v":"2013-04-23"},"Družba A. Datum Corporation",{"v":6400,"d":"6,400.00 €"},{"v":6200,"d":"6,200.00 €"},{"v":4450,"d":"4,450.00 €"},{"$f":"tblPodatki[[#This Row],[ZNESEK]]-tblPodatki[[#This Row],[STROŠEK]]","v":{"v":1950,"d":"1,950.00 €"}},{"$f":"DATE(YEAR('Vnos podatkov'!$B6),MONTH('Vnos podatkov'!$B6),1)","v":"2013-04-01"},{"$f":"LOOKUP(MONTH('Vnos podatkov'!$H6),{1,1;2,1;3,1;4,2;5,2;6,2;7,3;8,3;9,3;10,4;11,4;12,4})","v":{"v":2,"d":"Četrtletje2"}},{"$f":"YEAR('Vnos podatkov'!$B6)","v":2013},{"$f":"MONTH(tblPodatki[[#This Row],[DATUM]])","v":4},{"$f":"SUMIFS(tblPodatki[ZNESEK],tblPodatki[DATUM],\">=\"&EOMONTH(tblPodatki[[#This Row],[DATUM]],-1)+1,tblPodatki[DATUM],\"<=\"&EOMONTH(tblPodatki[[#This Row],[DATUM]],0))","v":{"v":14600,"d":"14,600.00 €"}},{"$f":"SUMIFS(tblPodatki[ZNESEK],tblPodatki[DATUM],\">=\"&DATE(YEAR(tblPodatki[[#This Row],[DATUM]]),1,1),tblPodatki[DATUM],\"<=\"&DATE(YEAR(tblPodatki[[#This Row],[DATUM]]),12,31),tblPodatki[ČETRTLETJE],tblPodatki[[#This Row],[ČETRTLETJE]])","v":{"v":50800,"d":"50,800.00 €"}},{"$f":"SUMIFS(tblPodatki[ZNESEK],tblPodatki[DATUM],\">=\"&DATE(YEAR(tblPodatki[[#This Row],[DATUM]]),1,1),tblPodatki[DATUM],\"<=\"&DATE(YEAR(tblPodatki[[#This Row],[DATUM]]),12,31))","v":{"v":143800,"d":"143,800.00 €"}},{"$f":"IFERROR(TREND($L$6:INDEX($L:$L,ROW(),1),$K$6:INDEX($K:$K,ROW(),1),IF(MONTH(tblPodatki[[#This Row],[DATUM]])=12,13,MONTH(tblPodatki[[#This Row],[DATUM]])+1)),\"\")","v":{"v":14600,"d":"14,600.00 €"}},{"$f":"IFERROR(TREND($M$6:INDEX($M:$M,ROW(),1),$I$6:INDEX($I:$I,ROW(),1),IF(tblPodatki[[#This Row],[ČETRTLETJE]]=4,5,tblPodatki[[#This Row],[ČETRTLETJE]]+1)),\"\")","v":{"v":50800,"d":"50,800.00 €"}},{"$f":"IFERROR(TREND($N$6:INDEX($N:$N,ROW(),1),$J$6:INDEX($J:$J,ROW(),1),tblPodatki[[#This Row],[LETO]]+1),\"\")","v":{"v":143800,"d":"143,800.00 €"}}]
[null,{"$f":"40659+(365*2)","v":"2013-04-25"},"Zdravila Contoso",{"v":8200,"d":"8,200.00 €"},{"v":8000,"d":"8,000.00 €"},{"v":6400,"d":"6,400.00 €"},{"$f":"tblPodatki[[#This Row],[ZNESEK]]-tblPodatki[[#This Row],[STROŠEK]]","v":{"v":1800,"d":"1,800.00 €"}},{"$f":"DATE(YEAR('Vnos podatkov'!$B7),MONTH('Vnos podatkov'!$B7),1)","v":"2013-04-01"},{"$f":"LOOKUP(MONTH('Vnos podatkov'!$H7),{1,1;2,1;3,1;4,2;5,2;6,2;7,3;8,3;9,3;10,4;11,4;12,4})","v":{"v":2,"d":"Četrtletje2"}},{"$f":"YEAR('Vnos podatkov'!$B7)","v":2013},{"$f":"MONTH(tblPodatki[[#This Row],[DATUM]])","v":4},{"$f":"SUMIFS(tblPodatki[ZNESEK],tblPodatki[DATUM],\">=\"&EOMONTH(tblPodatki[[#This Row],[DATUM]],-1)+1,tblPodatki[DATUM],\"<=\"&EOMONTH(tblPodatki[[#This Row],[DATUM]],0))","v":{"v":14600,"d":"14,600.00 €"}},{"$f":"SUMIFS(tblPodatki[ZNESEK],tblPodatki[DATUM],\">=\"&DATE(YEAR(tblPodatki[[#This Row],[DATUM]]),1,1),tblPodatki[DATUM],\"<=\"&DATE(YEAR(tblPodatki[[#This Row],[DATUM]]),12,31),tblPodatki[ČETRTLETJE],tblPodatki[[#This Row],[ČETRTLETJE]])","v":{"v":50800,"d":"50,800.00 €"}},{"$f":"SUMIFS(tblPodatki[ZNESEK],tblPodatki[DATUM],\">=\"&DATE(YEAR(tblPodatki[[#This Row],[DATUM]]),1,1),tblPodatki[DATUM],\"<=\"&DATE(YEAR(tblPodatki[[#This Row],[DATUM]]),12,31))","v":{"v":143800,"d":"143,800.00 €"}},{"$f":"IFERROR(TREND($L$6:INDEX($L:$L,ROW(),1),$K$6:INDEX($K:$K,ROW(),1),IF(MONTH(tblPodatki[[#This Row],[DATUM]])=12,13,MONTH(tblPodatki[[#This Row],[DATUM]])+1)),\"\")","v":{"v":14600,"d":"14,600.00 €"}},{"$f":"IFERROR(TREND($M$6:INDEX($M:$M,ROW(),1),$I$6:INDEX($I:$I,ROW(),1),IF(tblPodatki[[#This Row],[ČETRTLETJE]]=4,5,tblPodatki[[#This Row],[ČETRTLETJE]]+1)),\"\")","v":{"v":50800,"d":"50,800.00 €"}},{"$f":"IFERROR(TREND($N$6:INDEX($N:$N,ROW(),1),$J$6:INDEX($J:$J,ROW(),1),tblPodatki[[#This Row],[LETO]]+1),\"\")","v":{"v":143800,"d":"143,800.00 €"}}]
[null,{"$f":"40671+(365*2)","v":"2013-05-07"},"Skupni glasnik",{"v":4400,"d":"4,400.00 €"},{"v":4200,"d":"4,200.00 €"},{"v":2600,"d":"2,600.00 €"},{"$f":"tblPodatki[[#This Row],[ZNESEK]]-tblPodatki[[#This Row],[STROŠEK]]","v":{"v":1800,"d":"1,800.00 €"}},{"$f":"DATE(YEAR('Vnos podatkov'!$B8),MONTH('Vnos podatkov'!$B8),1)","v":"2013-05-01"},{"$f":"LOOKUP(MONTH('Vnos podatkov'!$H8),{1,1;2,1;3,1;4,2;5,2;6,2;7,3;8,3;9,3;10,4;11,4;12,4})","v":{"v":2,"d":"Četrtletje2"}},{"$f":"YEAR('Vnos podatkov'!$B8)","v":2013},{"$f":"MONTH(tblPodatki[[#This Row],[DATUM]])","v":5},{"$f":"SUMIFS(tblPodatki[ZNESEK],tblPodatki[DATUM],\">=\"&EOMONTH(tblPodatki[[#This Row],[DATUM]],-1)+1,tblPodatki[DATUM],\"<=\"&EOMONTH(tblPodatki[[#This Row],[DATUM]],0))","v":{"v":21800,"d":"21,800.00 €"}},{"$f":"SUMIFS(tblPodatki[ZNESEK],tblPodatki[DATUM],\">=\"&DATE(YEAR(tblPodatki[[#This Row],[DATUM]]),1,1),tblPodatki[DATUM],\"<=\"&DATE(YEAR(tblPodatki[[#This Row],[DATUM]]),12,31),tblPodatki[ČETRTLETJE],tblPodatki[[#This Row],[ČETRTLETJE]])","v":{"v":50800,"d":"50,800.00 €"}},{"$f":"SUMIFS(tblPodatki[ZNESEK],tblPodatki[DATUM],\">=\"&DATE(YEAR(tblPodatki[[#This Row],[DATUM]]),1,1),tblPodatki[DATUM],\"<=\"&DATE(YEAR(tblPodatki[[#This Row],[DATUM]]),12,31))","v":{"v":143800,"d":"143,800.00 €"}},{"$f":"IFERROR(TREND($L$6:INDEX($L:$L,ROW(),1),$K$6:INDEX($K:$K,ROW(),1),IF(MONTH(tblPodatki[[#This Row],[DATUM]])=12,13,MONTH(tblPodatki[[#This Row],[DATUM]])+1)),\"\")","v":{"v":28999.999999999996,"d":"29,000.00 €"}},{"$f":"IFERROR(TREND($M$6:INDEX($M:$M,ROW(),1),$I$6:INDEX($I:$I,ROW(),1),IF(tblPodatki[[#This Row],[ČETRTLETJE]]=4,5,tblPodatki[[#This Row],[ČETRTLETJE]]+1)),\"\")","v":{"v":50800,"d":"50,800.00 €"}},{"$f":"IFERROR(TREND($N$6:INDEX($N:$N,ROW(),1),$J$6:INDEX($J:$J,ROW(),1),tblPodatki[[#This Row],[LETO]]+1),\"\")","v":{"v":143800,"d":"143,800.00 €"}}]
[null,{"$f":"40678+(365*2)","v":"2013-05-14"},"Založba Proza d.o.o.",{"v":5400,"d":"5,400.00 €"},{"v":5500,"d":"5,500.00 €"},{"v":4500,"d":"4,500.00 €"},{"$f":"tblPodatki[[#This Row],[ZNESEK]]-tblPodatki[[#This Row],[STROŠEK]]","v":{"v":900,"d":"900.00 €"}},{"$f":"DATE(YEAR('Vnos podatkov'!$B9),MONTH('Vnos podatkov'!$B9),1)","v":"2013-05-01"},{"$f":"LOOKUP(MONTH('Vnos podatkov'!$H9),{1,1;2,1;3,1;4,2;5,2;6,2;7,3;8,3;9,3;10,4;11,4;12,4})","v":{"v":2,"d":"Četrtletje2"}},{"$f":"YEAR('Vnos podatkov'!$B9)","v":2013},{"$f":"MONTH(tblPodatki[[#This Row],[DATUM]])","v":5},{"$f":"SUMIFS(tblPodatki[ZNESEK],tblPodatki[DATUM],\">=\"&EOMONTH(tblPodatki[[#This Row],[DATUM]],-1)+1,tblPodatki[DATUM],\"<=\"&EOMONTH(tblPodatki[[#This Row],[DATUM]],0))","v":{"v":21800,"d":"21,800.00 €"}},{"$f":"SUMIFS(tblPodatki[ZNESEK],tblPodatki[DATUM],\">=\"&DATE(YEAR(tblPodatki[[#This Row],[DATUM]]),1,1),tblPodatki[DATUM],\"<=\"&DATE(YEAR(tblPodatki[[#This Row],[DATUM]]),12,31),tblPodatki[ČETRTLETJE],tblPodatki[[#This Row],[ČETRTLETJE]])","v":{"v":50800,"d":"50,800.00 €"}},{"$f":"SUMIFS(tblPodatki[ZNESEK],tblPodatki[DATUM],\">=\"&DATE(YEAR(tblPodatki[[#This Row],[DATUM]]),1,1),tblPodatki[DATUM],\"<=\"&DATE(YEAR(tblPodatki[[#This Row],[DATUM]]),12,31))","v":{"v":143800,"d":"143,800.00 €"}},{"$f":"IFERROR(TREND($L$6:INDEX($L:$L,ROW(),1),$K$6:INDEX($K:$K,ROW(),1),IF(MONTH(tblPodatki[[#This Row],[DATUM]])=12,13,MONTH(tblPodatki[[#This Row],[DATUM]])+1)),\"\")","v":{"v":29000,"d":"29,000.00 €"}},{"$f":"IFERROR(TREND($M$6:INDEX($M:$M,ROW(),1),$I$6:INDEX($I:$I,ROW(),1),IF(tblPodatki[[#This Row],[ČETRTLETJE]]=4,5,tblPodatki[[#This Row],[ČETRTLETJE]]+1)),\"\")","v":{"v":50800,"d":"50,800.00 €"}},{"$f":"IFERROR(TREND($N$6:INDEX($N:$N,ROW(),1),$J$6:INDEX($J:$J,ROW(),1),tblPodatki[[#This Row],[LETO]]+1),\"\")","v":{"v":143800,"d":"143,800.00 €"}}]
[null,{"$f":"40678+(365*2)","v":"2013-05-14"},"Visoka šola za umetnost",{"v":5800,"d":"5,800.00 €"},{"v":6000,"d":"6,000.00 €"},{"v":4500,"d":"4,500.00 €"},{"$f":"tblPodatki[[#This Row],[ZNESEK]]-tblPodatki[[#This Row],[STROŠEK]]","v":{"v":1300,"d":"1,300.00 €"}},{"$f":"DATE(YEAR('Vnos podatkov'!$B10),MONTH('Vnos podatkov'!$B10),1)","v":"2013-05-01"},{"$f":"LOOKUP(MONTH('Vnos podatkov'!$H10),{1,1;2,1;3,1;4,2;5,2;6,2;7,3;8,3;9,3;10,4;11,4;12,4})","v":{"v":2,"d":"Četrtletje2"}},{"$f":"YEAR('Vnos podatkov'!$B10)","v":2013},{"$f":"MONTH(tblPodatki[[#This Row],[DATUM]])","v":5},{"$f":"SUMIFS(tblPodatki[ZNESEK],tblPodatki[DATUM],\">=\"&EOMONTH(tblPodatki[[#This Row],[DATUM]],-1)+1,tblPodatki[DATUM],\"<=\"&EOMONTH(tblPodatki[[#This Row],[DATUM]],0))","v":{"v":21800,"d":"21,800.00 €"}},{"$f":"SUMIFS(tblPodatki[ZNESEK],tblPodatki[DATUM],\">=\"&DATE(YEAR(tblPodatki[[#This Row],[DATUM]]),1,1),tblPodatki[DATUM],\"<=\"&DATE(YEAR(tblPodatki[[#This Row],[DATUM]]),12,31),tblPodatki[ČETRTLETJE],tblPodatki[[#This Row],[ČETRTLETJE]])","v":{"v":50800,"d":"50,800.00 €"}},{"$f":"SUMIFS(tblPodatki[ZNESEK],tblPodatki[DATUM],\">=\"&DATE(YEAR(tblPodatki[[#This Row],[DATUM]]),1,1),tblPodatki[DATUM],\"<=\"&DATE(YEAR(tblPodatki[[#This Row],[DATUM]]),12,31))","v":{"v":143800,"d":"143,800.00 €"}},{"$f":"IFERROR(TREND($L$6:INDEX($L:$L,ROW(),1),$K$6:INDEX($K:$K,ROW(),1),IF(MONTH(tblPodatki[[#This Row],[DATUM]])=12,13,MONTH(tblPodatki[[#This Row],[DATUM]])+1)),\"\")","v":{"v":29000,"d":"29,000.00 €"}},{"$f":"IFERROR(TREND($M$6:INDEX($M:$M,ROW(),1),$I$6:INDEX($I:$I,ROW(),1),IF(tblPodatki[[#This Row],[ČETRTLETJE]]=4,5,tblPodatki[[#This Row],[ČETRTLETJE]]+1)),\"\")","v":{"v":50800,"d":"50,800.00 €"}},{"$f":"IFERROR(TREND($N$6:INDEX($N:$N,ROW(),1),$J$6:INDEX($J:$J,ROW(),1),tblPodatki[[#This Row],[LETO]]+1),\"\")","v":{"v":143800,"d":"143,800.00 €"}}]
[null,{"$f":"40693+(365*2)","v":"2013-05-29"},"Raziskovalni inštitut",{"v":6200,"d":"6,200.00 €"},{"v":6000,"d":"6,000.00 €"},{"v":4500,"d":"4,500.00 €"},{"$f":"tblPodatki[[#This Row],[ZNESEK]]-tblPodatki[[#This Row],[STROŠEK]]","v":{"v":1700,"d":"1,700.00 €"}},{"$f":"DATE(YEAR('Vnos podatkov'!$B11),MONTH('Vnos podatkov'!$B11),1)","v":"2013-05-01"},{"$f":"LOOKUP(MONTH('Vnos podatkov'!$H11),{1,1;2,1;3,1;4,2;5,2;6,2;7,3;8,3;9,3;10,4;11,4;12,4})","v":{"v":2,"d":"Četrtletje2"}},{"$f":"YEAR('Vnos podatkov'!$B11)","v":2013},{"$f":"MONTH(tblPodatki[[#This Row],[DATUM]])","v":5},{"$f":"SUMIFS(tblPodatki[ZNESEK],tblPodatki[DATUM],\">=\"&EOMONTH(tblPodatki[[#This Row],[DATUM]],-1)+1,tblPodatki[DATUM],\"<=\"&EOMONTH(tblPodatki[[#This Row],[DATUM]],0))","v":{"v":21800,"d":"21,800.00 €"}},{"$f":"SUMIFS(tblPodatki[ZNESEK],tblPodatki[DATUM],\">=\"&DATE(YEAR(tblPodatki[[#This Row],[DATUM]]),1,1),tblPodatki[DATUM],\"<=\"&DATE(YEAR(tblPodatki[[#This Row],[DATUM]]),12,31),tblPodatki[ČETRTLETJE],tblPodatki[[#This Row],[ČETRTLETJE]])","v":{"v":50800,"d":"50,800.00 €"}},{"$f":"SUMIFS(tblPodatki[ZNESEK],tblPodatki[DATUM],\">=\"&DATE(YEAR(tblPodatki[[#This Row],[DATUM]]),1,1),tblPodatki[DATUM],\"<=\"&DATE(YEAR(tblPodatki[[#This Row],[DATUM]]),12,31))","v":{"v":143800,"d":"143,800.00 €"}},{"$f":"IFERROR(TREND($L$6:INDEX($L:$L,ROW(),1),$K$6:INDEX($K:$K,ROW(),1),IF(MONTH(tblPodatki[[#This Row],[DATUM]])=12,13,MONTH(tblPodatki[[#This Row],[DATUM]])+1)),\"\")","v":{"v":29000,"d":"29,000.00 €"}},{"$f":"IFERROR(TREND($M$6:INDEX($M:$M,ROW(),1),$I$6:INDEX($I:$I,ROW(),1),IF(tblPodatki[[#This Row],[ČETRTLETJE]]=4,5,tblPodatki[[#This Row],[ČETRTLETJE]]+1)),\"\")","v":{"v":50800,"d":"50,800.00 €"}},{"$f":"IFERROR(TREND($N$6:INDEX($N:$N,ROW(),1),$J$6:INDEX($J:$J,ROW(),1),tblPodatki[[#This Row],[LETO]]+1),\"\")","v":{"v":143800,"d":"143,800.00 €"}}]
[null,{"$f":"40705+(365*2)","v":"2013-06-10"},"Družba A. Datum Corporation",{"v":6900,"d":"6,900.00 €"},{"v":7500,"d":"7,500.00 €"},{"v":5400,"d":"5,400.00 €"},{"$f":"tblPodatki[[#This Row],[ZNESEK]]-tblPodatki[[#This Row],[STROŠEK]]","v":{"v":1500,"d":"1,500.00 €"}},{"$f":"DATE(YEAR('Vnos podatkov'!$B12),MONTH('Vnos podatkov'!$B12),1)","v":"2013-06-01"},{"$f":"LOOKUP(MONTH('Vnos podatkov'!$H12),{1,1;2,1;3,1;4,2;5,2;6,2;7,3;8,3;9,3;10,4;11,4;12,4})","v":{"v":2,"d":"Četrtletje2"}},{"$f":"YEAR('Vnos podatkov'!$B12)","v":2013},{"$f":"MONTH(tblPodatki[[#This Row],[DATUM]])","v":6},{"$f":"SUMIFS(tblPodatki[ZNESEK],tblPodatki[DATUM],\">=\"&EOMONTH(tblPodatki[[#This Row],[DATUM]],-1)+1,tblPodatki[DATUM],\"<=\"&EOMONTH(tblPodatki[[#This Row],[DATUM]],0))","v":{"v":14400,"d":"14,400.00 €"}},{"$f":"SUMIFS(tblPodatki[ZNESEK],tblPodatki[DATUM],\">=\"&DATE(YEAR(tblPodatki[[#This Row],[DATUM]]),1,1),tblPodatki[DATUM],\"<=\"&DATE(YEAR(tblPodatki[[#This Row],[DATUM]]),12,31),tblPodatki[ČETRTLETJE],tblPodatki[[#This Row],[ČETRTLETJE]])","v":{"v":50800,"d":"50,800.00 €"}},{"$f":"SUMIFS(tblPodatki[ZNESEK],tblPodatki[DATUM],\">=\"&DATE(YEAR(tblPodatki[[#This Row],[DATUM]]),1,1),tblPodatki[DATUM],\"<=\"&DATE(YEAR(tblPodatki[[#This Row],[DATUM]]),12,31))","v":{"v":143800,"d":"143,800.00 €"}},{"$f":"IFERROR(TREND($L$6:INDEX($L:$L,ROW(),1),$K$6:INDEX($K:$K,ROW(),1),IF(MONTH(tblPodatki[[#This Row],[DATUM]])=12,13,MONTH(tblPodatki[[#This Row],[DATUM]])+1)),\"\")","v":{"v":21600.000000000004,"d":"21,600.00 €"}},{"$f":"IFERROR(TREND($M$6:INDEX($M:$M,ROW(),1),$I$6:INDEX($I:$I,ROW(),1),IF(tblPodatki[[#This Row],[ČETRTLETJE]]=4,5,tblPodatki[[#This Row],[ČETRTLETJE]]+1)),\"\")","v":{"v":50800,"d":"50,800.00 €"}},{"$f":"IFERROR(TREND($N$6:INDEX($N:$N,ROW(),1),$J$6:INDEX($J:$J,ROW(),1),tblPodatki[[#This Row],[LETO]]+1),\"\")","v":{"v":143800,"d":"143,800.00 €"}}]
[null,{"$f":"40716+(365*2)","v":"2013-06-21"},"Zdravila Contoso",{"v":7500,"d":"7,500.00 €"},{"v":7200,"d":"7,200.00 €"},{"v":6500,"d":"6,500.00 €"},{"$f":"tblPodatki[[#This Row],[ZNESEK]]-tblPodatki[[#This Row],[STROŠEK]]","v":{"v":1000,"d":"1,000.00 €"}},{"$f":"DATE(YEAR('Vnos podatkov'!$B13),MONTH('Vnos podatkov'!$B13),1)","v":"2013-06-01"},{"$f":"LOOKUP(MONTH('Vnos podatkov'!$H13),{1,1;2,1;3,1;4,2;5,2;6,2;7,3;8,3;9,3;10,4;11,4;12,4})","v":{"v":2,"d":"Četrtletje2"}},{"$f":"YEAR('Vnos podatkov'!$B13)","v":2013},{"$f":"MONTH(tblPodatki[[#This Row],[DATUM]])","v":6},{"$f":"SUMIFS(tblPodatki[ZNESEK],tblPodatki[DATUM],\">=\"&EOMONTH(tblPodatki[[#This Row],[DATUM]],-1)+1,tblPodatki[DATUM],\"<=\"&EOMONTH(tblPodatki[[#This Row],[DATUM]],0))","v":{"v":14400,"d":"14,400.00 €"}},{"$f":"SUMIFS(tblPodatki[ZNESEK],tblPodatki[DATUM],\">=\"&DATE(YEAR(tblPodatki[[#This Row],[DATUM]]),1,1),tblPodatki[DATUM],\"<=\"&DATE(YEAR(tblPodatki[[#This Row],[DATUM]]),12,31),tblPodatki[ČETRTLETJE],tblPodatki[[#This Row],[ČETRTLETJE]])","v":{"v":50800,"d":"50,800.00 €"}},{"$f":"SUMIFS(tblPodatki[ZNESEK],tblPodatki[DATUM],\">=\"&DATE(YEAR(tblPodatki[[#This Row],[DATUM]]),1,1),tblPodatki[DATUM],\"<=\"&DATE(YEAR(tblPodatki[[#This Row],[DATUM]]),12,31))","v":{"v":143800,"d":"143,800.00 €"}},{"$f":"IFERROR(TREND($L$6:INDEX($L:$L,ROW(),1),$K$6:INDEX($K:$K,ROW(),1),IF(MONTH(tblPodatki[[#This Row],[DATUM]])=12,13,MONTH(tblPodatki[[#This Row],[DATUM]])+1)),\"\")","v":{"v":17950,"d":"17,950.00 €"}},{"$f":"IFERROR(TREND($M$6:INDEX($M:$M,ROW(),1),$I$6:INDEX($I:$I,ROW(),1),IF(tblPodatki[[#This Row],[ČETRTLETJE]]=4,5,tblPodatki[[#This Row],[ČETRTLETJE]]+1)),\"\")","v":{"v":50800,"d":"50,800.00 €"}},{"$f":"IFERROR(TREND($N$6:INDEX($N:$N,ROW(),1),$J$6:INDEX($J:$J,ROW(),1),tblPodatki[[#This Row],[LETO]]+1),\"\")","v":{"v":143800,"d":"143,800.00 €"}}]
[null,{"$f":"40731+(365*2)","v":"2013-07-06"},"Skupni glasnik",{"v":8700,"d":"8,700.00 €"},{"v":8500,"d":"8,500.00 €"},{"v":7250,"d":"7,250.00 €"},{"$f":"tblPodatki[[#This Row],[ZNESEK]]-tblPodatki[[#This Row],[STROŠEK]]","v":{"v":1450,"d":"1,450.00 €"}},{"$f":"DATE(YEAR('Vnos podatkov'!$B14),MONTH('Vnos podatkov'!$B14),1)","v":"2013-07-01"},{"$f":"LOOKUP(MONTH('Vnos podatkov'!$H14),{1,1;2,1;3,1;4,2;5,2;6,2;7,3;8,3;9,3;10,4;11,4;12,4})","v":{"v":3,"d":"Četrtletje3"}},{"$f":"YEAR('Vnos podatkov'!$B14)","v":2013},{"$f":"MONTH(tblPodatki[[#This Row],[DATUM]])","v":7},{"$f":"SUMIFS(tblPodatki[ZNESEK],tblPodatki[DATUM],\">=\"&EOMONTH(tblPodatki[[#This Row],[DATUM]],-1)+1,tblPodatki[DATUM],\"<=\"&EOMONTH(tblPodatki[[#This Row],[DATUM]],0))","v":{"v":8700,"d":"8,700.00 €"}},{"$f":"SUMIFS(tblPodatki[ZNESEK],tblPodatki[DATUM],\">=\"&DATE(YEAR(tblPodatki[[#This Row],[DATUM]]),1,1),tblPodatki[DATUM],\"<=\"&DATE(YEAR(tblPodatki[[#This Row],[DATUM]]),12,31),tblPodatki[ČETRTLETJE],tblPodatki[[#This Row],[ČETRTLETJE]])","v":{"v":49100,"d":"49,100.00 €"}},{"$f":"SUMIFS(tblPodatki[ZNESEK],tblPodatki[DATUM],\">=\"&DATE(YEAR(tblPodatki[[#This Row],[DATUM]]),1,1),tblPodatki[DATUM],\"<=\"&DATE(YEAR(tblPodatki[[#This Row],[DATUM]]),12,31))","v":{"v":143800,"d":"143,800.00 €"}},{"$f":"IFERROR(TREND($L$6:INDEX($L:$L,ROW(),1),$K$6:INDEX($K:$K,ROW(),1),IF(MONTH(tblPodatki[[#This Row],[DATUM]])=12,13,MONTH(tblPodatki[[#This Row],[DATUM]])+1)),\"\")","v":{"v":10776.470588235294,"d":"10,776.47 €"}},{"$f":"IFERROR(TREND($M$6:INDEX($M:$M,ROW(),1),$I$6:INDEX($I:$I,ROW(),1),IF(tblPodatki[[#This Row],[ČETRTLETJE]]=4,5,tblPodatki[[#This Row],[ČETRTLETJE]]+1)),\"\")","v":{"v":47400,"d":"47,400.00 €"}},{"$f":"IFERROR(TREND($N$6:INDEX($N:$N,ROW(),1),$J$6:INDEX($J:$J,ROW(),1),tblPodatki[[#This Row],[LETO]]+1),\"\")","v":{"v":143800,"d":"143,800.00 €"}}]
[null,{"$f":"40761+(365*2)","v":"2013-08-05"},"Založba Proza d.o.o.",{"v":8500,"d":"8,500.00 €"},{"v":8300,"d":"8,300.00 €"},{"v":7100,"d":"7,100.00 €"},{"$f":"tblPodatki[[#This Row],[ZNESEK]]-tblPodatki[[#This Row],[STROŠEK]]","v":{"v":1400,"d":"1,400.00 €"}},{"$f":"DATE(YEAR('Vnos podatkov'!$B15),MONTH('Vnos podatkov'!$B15),1)","v":"2013-08-01"},{"$f":"LOOKUP(MONTH('Vnos podatkov'!$H15),{1,1;2,1;3,1;4,2;5,2;6,2;7,3;8,3;9,3;10,4;11,4;12,4})","v":{"v":3,"d":"Četrtletje3"}},{"$f":"YEAR('Vnos podatkov'!$B15)","v":2013},{"$f":"MONTH(tblPodatki[[#This Row],[DATUM]])","v":8},{"$f":"SUMIFS(tblPodatki[ZNESEK],tblPodatki[DATUM],\">=\"&EOMONTH(tblPodatki[[#This Row],[DATUM]],-1)+1,tblPodatki[DATUM],\"<=\"&EOMONTH(tblPodatki[[#This Row],[DATUM]],0))","v":{"v":16400,"d":"16,400.00 €"}},{"$f":"SUMIFS(tblPodatki[ZNESEK],tblPodatki[DATUM],\">=\"&DATE(YEAR(tblPodatki[[#This Row],[DATUM]]),1,1),tblPodatki[DATUM],\"<=\"&DATE(YEAR(tblPodatki[[#This Row],[DATUM]]),12,31),tblPodatki[ČETRTLETJE],tblPodatki[[#This Row],[ČETRTLETJE]])","v":{"v":49100,"d":"49,100.00 €"}},{"$f":"SUMIFS(tblPodatki[ZNESEK],tblPodatki[DATUM],\">=\"&DATE(YEAR(tblPodatki[[#This Row],[DATUM]]),1,1),tblPodatki[DATUM],\"<=\"&DATE(YEAR(tblPodatki[[#This Row],[DATUM]]),12,31))","v":{"v":143800,"d":"143,800.00 €"}},{"$f":"IFERROR(TREND($L$6:INDEX($L:$L,ROW(),1),$K$6:INDEX($K:$K,ROW(),1),IF(MONTH(tblPodatki[[#This Row],[DATUM]])=12,13,MONTH(tblPodatki[[#This Row],[DATUM]])+1)),\"\")","v":{"v":12455.862068965516,"d":"12,455.86 €"}},{"$f":"IFERROR(TREND($M$6:INDEX($M:$M,ROW(),1),$I$6:INDEX($I:$I,ROW(),1),IF(tblPodatki[[#This Row],[ČETRTLETJE]]=4,5,tblPodatki[[#This Row],[ČETRTLETJE]]+1)),\"\")","v":{"v":47400,"d":"47,400.00 €"}},{"$f":"IFERROR(TREND($N$6:INDEX($N:$N,ROW(),1),$J$6:INDEX($J:$J,ROW(),1),tblPodatki[[#This Row],[LETO]]+1),\"\")","v":{"v":143800,"d":"143,800.00 €"}}]
{"$rows_left_out":10}
{"sheet":"Poročilo o prodaji","index":1,"n_rows":28,"n_cols":6,"rows_kept":28}
[]
[null,"MESEČNO POROČILO O PRODAJI"]
[]
[]
[null,"LETO","ČETRTLETJE","MESEC","PODJETJE","SKUPNA PRODAJA"]
[null,2013,{"v":2,"d":"Četrtletje2"},"2013-04-01","Družba A. Datum Corporation",{"v":6400,"d":"6,400.00 €"}]
[{"$nulls":4},"Zdravila Contoso",{"v":8200,"d":"8,200.00 €"}]
[{"$nulls":3},"2013-05-01","Raziskovalni inštitut",{"v":6200,"d":"6,200.00 €"}]
[{"$nulls":4},"Skupni glasnik",{"v":4400,"d":"4,400.00 €"}]
[{"$nulls":4},"Visoka šola za umetnost",{"v":5800,"d":"5,800.00 €"}]
[{"$nulls":4},"Založba Proza d.o.o.",{"v":5400,"d":"5,400.00 €"}]
[{"$nulls":3},"2013-06-01","Družba A. Datum Corporation",{"v":6900,"d":"6,900.00 €"}]
[{"$nulls":4},"Zdravila Contoso",{"v":7500,"d":"7,500.00 €"}]
[null,null,"Četrtletje2 Vsota",null,null,{"v":50800,"d":"50,800.00 €"}]
[null,null,{"v":3,"d":"Četrtletje3"},"2013-07-01","Skupni glasnik",{"v":8700,"d":"8,700.00 €"}]
{"$rows_left_out":14}
{"sheet":"Napoved prodaje","index":2,"n_rows":43,"n_cols":10,"rows_kept":43}
[]
[null,"MESEČNO PRODAJNA NAPOVED"]
[null,{"$f":"\"DANAŠNJI DATUM: \"&UPPER(TEXT(TODAY(),\"d.mmmm.yyyy\"))","v":"DANAŠNJI DATUM: 29.OKTOBER.2012"},null,{"$f":"--TRIM(RIGHT(B3,LEN(B3)-FIND(\":\",B3)))","v":"2012-10-29"}]
[]
[null,"TA MESEC","DEJANSKO","NAČRT","RAZLIKA","%","SKUPNO ZA LETOŠNJE LETO DOSLEJ – DEJANSKO","SKUPNO ZA LETOŠNJE LETO DOSLEJ – NAČRT","SKUPNO ZA LETOŠNJE LETO DOSLEJ – RAZLIKA","SKUPNO ZA LETOŠNJE LETO DOSLEJ – %"]
[null,"Količina",{"$f":"COUNTIF('Vnos podatkov'!$B$6:$B$24,\">=\"&DATE(fLeto,MONTH(fDatum),1))-COUNTIF('Vnos podatkov'!$B$6:$B$24,\">\"&EOMONTH(fDatum,0))","v":0},{"$nulls":3},{"$f":"COUNTIF(tblPodatki[DATUM],\"<=\"&EOMONTH(fDatum,0))","v":0}]
[null,"Prodaja",{"$f":"SUMIF(tblPodatki[DATUM],\">=\"&DATE(fLeto,MONTH(fDatum),1),tblPodatki[ZNESEK])-SUMIF(tblPodatki[DATUM],\">\"&EOMONTH(fDatum,0),tblPodatki[ZNESEK])","v":{"v":0,"d":"0.00 €"}},{"$f":"SUMIF('Vnos podatkov'!$B$6:$B$24,\">=\"&DATE(fLeto,MONTH(fDatum),1),'Vnos podatkov'!$E$6:$E$24)-SUMIF('Vnos podatkov'!$B$6:$B$24,\">\"&EOMONTH(fDatum,0),'Vnos podatkov'!$E$6:$E$24)","v":{"v":0,"d":"0.00 €"}},{"$f":"D7-C7","v":{"v":0,"d":"0.00 €"}},{"$f":"IFERROR(D7/C7,\"-\")","v":"-"},{"$f":"SUMIF(tblPodatki[DATUM],\"<=\"&EOMONTH(fDatum,0),tblPodatki[ZNESEK])","v":{"v":0,"d":"0.00 €"}},{"$f":"SUMIF(tblPodatki[DATUM],\"<=\"&EOMONTH(fDatum,0),tblPodatki[NAČRTOVANO])","v":{"v":0,"d":"0.00 €"}},{"$f":"H7-G7","v":{"v":0,"d":"0.00 €"}},{"$f":"IFERROR(H7/G7,\"\")","v":""}]
[null,"Prihodki",{"$f":"(SUMIF(tblPodatki[DATUM],\">=\"&DATE(fLeto,MONTH(fDatum),1),tblPodatki[ZNESEK])-SUMIF(tblPodatki[DATUM],\">\"&EOMONTH(fDatum,0),tblPodatki[ZNESEK]))-(SUMIF(tblPodatki[DATUM],\">=\"&DATE(fLeto,MONTH(fDatum),1),tblPodatki[STROŠEK])-SUMIF(tblPodatki[DATUM],\">\"&EOMONTH(fDatum,0),tblPodatki[STROŠEK]))","v":{"v":0,"d":"0.00 €"}},{"$f":"(SUMIF('Vnos podatkov'!$B$6:$B$24,\">=\"&DATE(fLeto,MONTH(fDatum),1),'Vnos podatkov'!$E$6:$E$24)-SUMIF('Vnos podatkov'!$B$6:$B$24,\">\"&EOMONTH(fDatum,0),'Vnos podatkov'!$E$6:$E$24))-(SUMIF('Vnos podatkov'!$B$6:$B$24,\">=\"&DATE(fLeto,MONTH(fDatum),1),'Vnos podatkov'!$F$6:$F$24)-SUMIF('Vnos podatkov'!$B$6:$B$24,\">\"&EOMONTH(fDatum,0),'Vnos podatkov'!$F$6:$F$24))","v":{"v":0,"d":"0.00 €"}},{"$f":"D8-C8","v":{"v":0,"d":"0.00 €"}},{"$f":"IFERROR(D8/C8,\"-\")","v":"-"},{"$f":"SUMIF('Vnos podatkov'!$B$6:$B$24,\"<=\"&EOMONTH(fDatum,0),'Vnos podatkov'!$F$6:$F$24)","v":{"v":0,"d":"0.00 €"}},{"$f":"SUMIF(tblPodatki[DATUM],\"<=\"&EOMONTH(fDatum,0),tblPodatki[STROŠEK])","v":{"v":0,"d":"0.00 €"}},{"$f":"H8-G8","v":{"v":0,"d":"0.00 €"}},{"$f":"IFERROR(H8/G8,\"\")","v":""}]
[null,"Marža",{"$f":"IFERROR(C8/C7,\"-\")","v":"-"},{"$f":"IFERROR(D8/D7,\"-\")","v":"-"},null,{"$f":"IFERROR(F8/F7,\"-\")","v":"-"},{"$f":"IFERROR(G8/G7,\"\")","v":""},{"$f":"IFERROR(H8/H7,\"\")","v":""},null,{"$f":"IFERROR(J8/J7,\"\")","v":""}]
[null,"Število naročil",{"$f":"COUNTIF(tblPodatki[DATUM],\">=\"&DATE(fLeto,MONTH(fDatum),1))-COUNTIF(tblPodatki[DATUM],\">\"&EOMONTH(fDatum,0))","v":0},{"$nulls":3},{"$f":"COUNTIF(tblPodatki[DATUM],\">\"&EOMONTH(fDatum,0))","v":19}]
[null,"Povprečna vrednost naročila",{"$f":"IFERROR(C7/C10,\"-\")","v":"-"},{"$nulls":3},{"$f":"IFERROR(G7/G10,\"-\")","v":{"v":0,"d":"0.00 €"}}]
[]
[null,"NAPOVED",null,"NASLEDNJI MESEC",null,"NASLEDNJE ČETRTLETJE",null,null,"NASLEDNJE LETO"]
[null,"Prodaja",null,{"$f":"TREND(tblPodatki[ [ MESEC] ],tblPodatki[MESEČNO ŠT. (SKRITO)],IF(MONTH(fDatum)=12,13,MONTH(fDatum)+1))","v":{"v":19802.70727580372,"d":"19,802.71 €"}},null,{"$f":"TREND(tblPodatki[[ČETRTLETJE ]],tblPodatki[MESEČNO ŠT. (SKRITO)],IF(MONTH(fDatum)=12,13,MONTH(fDatum)+1))","v":{"v":45107.44500846024,"d":"45,107.45 €"}},null,null,{"$f":"TREND(tblPodatki[[LETNO ]],tblPodatki[MESEČNO ŠT. (SKRITO)],IF(MONTH(fDatum)=12,13,MONTH(fDatum)+1))","v":{"v":143800,"d":"143,800.00 €"}}]
[]
{"$rows_left_out":10}