{"text_format":"3","workbook":"xlsx","n_sheets":2,"sheets":["Табель учета рабочего времени","Просмотр_дня_недели"],"not_rendered":{"defined_names":27},"read":"whole","date_system":"1900"}

{"sheet":"Табель учета рабочего времени","index":0,"n_rows":36,"n_cols":26,"rows_kept":36,"merged":[[0,1,2,4],[0,5,2,9],[0,10,2,14],[0,15,3,23],[0,24,3,24],[3,1,3,3],[3,5,3,9],[3,10,3,14],[4,1,6,3],[4,4,6,6],[5,14,7,14],[5,22,7,22],[5,23,7,23],[5,24,7,24],[21,1,21,6],[22,1,23,3],[22,4,23,6],[23,14,24,14],[23,22,24,22],[23,23,24,23],[23,24,24,24],[32,1,32,6],[32,24,33,24],[32,25,33,25],[33,1,33,6],[34,1,34,6],[35,1,35,3],[35,4,35,5],[35,6,35,7],[35,8,35,14],[35,15,35,16],[35,17,35,23]]}
[null,"ТАБЕЛЬ УЧЕТА РАБОЧЕГО ВРЕМЕНИ",{"$nulls":3},"Имя сотрудника",{"$nulls":9},"В ячейке справа выберите «Да», если необходимо \nввести данные о сверхурочных часах"]
[]
[]
[null,"Конечная дата отчетного периода",null,null,{"$f":"V7","v":"2025-06-14"},"Табельный номер"]
[null,"НОРМАТИВНЫЕ ЧАСЫ",null,null,"Дата:"]
[{"$nulls":14},"Неделя 1\nитого\nН/Ч",{"$nulls":7},"Неделя 2\nитого\nН/Ч","Итого\nнормативных\nчасов","Платежная ведомость\n(только код вида оплаты)"]
[{"$nulls":7},"2025-06-01",{"$f":"День_первый+1","v":"2025-06-02"},{"$f":"День_первый+2","v":"2025-06-03"},{"$f":"День_первый+3","v":"2025-06-04"},{"$f":"День_первый+4","v":"2025-06-05"},{"$f":"День_первый+5","v":"2025-06-06"},{"$f":"День_первый+6","v":"2025-06-07"},null,{"$f":"День_первый+7","v":"2025-06-08"},{"$f":"День_первый+8","v":"2025-06-09"},{"$f":"День_первый+9","v":"2025-06-10"},{"$f":"День_первый+10","v":"2025-06-11"},{"$f":"День_первый+11","v":"2025-06-12"},{"$f":"День_первый+12","v":"2025-06-13"},{"$f":"День_первый+13","v":"2025-06-14"}]
[null,"Задача","Отдел","№ заказа","Описание работы","Должность","Код должности",{"$f":"VLOOKUP(WEEKDAY(День_первый),Просмотр_дня_недели!$B$2:$C$8,2)","v":"Вс"},{"$f":"VLOOKUP(WEEKDAY(I7),Просмотр_дня_недели!$B$2:$C$8,2)","v":"Пн"},{"$f":"VLOOKUP(WEEKDAY(J7),Просмотр_дня_недели!$B$2:$C$8,2)","v":"Вт"},{"$f":"VLOOKUP(WEEKDAY(K7),Просмотр_дня_недели!$B$2:$C$8,2)","v":"Ср"},{"$f":"VLOOKUP(WEEKDAY(L7),Просмотр_дня_недели!$B$2:$C$8,2)","v":"Чт"},{"$f":"VLOOKUP(WEEKDAY(M7),Просмотр_дня_недели!$B$2:$C$8,2)","v":"Пт"},{"$f":"VLOOKUP(WEEKDAY(N7),Просмотр_дня_недели!$B$2:$C$8,2)","v":"Сб"},null,{"$f":"VLOOKUP(WEEKDAY(P7),Просмотр_дня_недели!$B$2:$C$8,2)","v":"Вс"},{"$f":"VLOOKUP(WEEKDAY(Q7),Просмотр_дня_недели!$B$2:$C$8,2)","v":"Пн"},{"$f":"VLOOKUP(WEEKDAY(R7),Просмотр_дня_недели!$B$2:$C$8,2)","v":"Вт"},{"$f":"VLOOKUP(WEEKDAY(S7),Просмотр_дня_недели!$B$2:$C$8,2)","v":"Ср"},{"$f":"VLOOKUP(WEEKDAY(T7),Просмотр_дня_недели!$B$2:$C$8,2)","v":"Чт"},{"$f":"VLOOKUP(WEEKDAY(U7),Просмотр_дня_недели!$B$2:$C$8,2)","v":"Пт"},{"$f":"VLOOKUP(WEEKDAY(V7),Просмотр_дня_недели!$B$2:$C$8,2)","v":"Сб"}]
[{"$nulls":14},{"$f":"SUM(H9:N9)","v":{"v":0,"d":"0.00"}},{"$nulls":7},{"$f":"SUM(P9:V9)","v":{"v":0,"d":"0.00"}},{"$f":"O9+W9","v":{"v":0,"d":"0.00"}}]
[{"$nulls":14},{"v":0,"d":"0.00"},{"$nulls":7},{"v":0,"d":"0.00"},{"v":0,"d":"0.00"}]
[{"$nulls":14},{"v":0,"d":"0.00"},{"$nulls":7},{"v":0,"d":"0.00"},{"v":0,"d":"0.00"}]
[{"$nulls":14},{"v":0,"d":"0.00"},{"$nulls":7},{"v":0,"d":"0.00"},{"v":0,"d":"0.00"}]
[{"$nulls":14},{"v":0,"d":"0.00"},{"$nulls":7},{"v":0,"d":"0.00"},{"v":0,"d":"0.00"}]
[{"$nulls":14},{"v":0,"d":"0.00"},{"$nulls":7},{"v":0,"d":"0.00"},{"v":0,"d":"0.00"}]
[{"$nulls":14},{"v":0,"d":"0.00"},{"$nulls":7},{"v":0,"d":"0.00"},{"v":0,"d":"0.00"}]
[{"$nulls":14},{"$f":"SUM(H16:N16)","v":{"v":0,"d":"0.00"}},{"$nulls":7},{"$f":"SUM(P16:V16)","v":{"v":0,"d":"0.00"}},{"$f":"O16+W16","v":{"v":0,"d":"0.00"}}]
[{"$nulls":14},{"v":0,"d":"0.00"},{"$nulls":7},{"v":0,"d":"0.00"},{"v":0,"d":"0.00"}]
[{"$nulls":14},{"v":0,"d":"0.00"},{"$nulls":7},{"v":0,"d":"0.00"},{"v":0,"d":"0.00"}]
[{"$nulls":14},{"v":0,"d":"0.00"},{"$nulls":7},{"v":0,"d":"0.00"},{"v":0,"d":"0.00"}]
[{"$nulls":14},{"v":0,"d":"0.00"},{"$nulls":7},{"v":0,"d":"0.00"},{"v":0,"d":"0.00"}]
[{"$nulls":14},{"v":0,"d":"0.00"},{"$nulls":7},{"v":0,"d":"0.00"},{"v":0,"d":"0.00"}]
[null,"Всего нормативных часов   ",{"$nulls":5},{"$f":"SUM(H9:H21)","v":{"v":0,"d":"0.00"}},{"v":0,"d":"0.00"},{"v":0,"d":"0.00"},{"v":0,"d":"0.00"},{"v":0,"d":"0.00"},{"v":0,"d":"0.00"},{"v":0,"d":"0.00"},{"v":0,"d":"0.00"},{"v":0,"d":"0.00"},{"$f":"SUM(Q9:Q21)","v":{"v":0,"d":"0.00"}},{"v":0,"d":"0.00"},{"v":0,"d":"0.00"},{"v":0,"d":"0.00"},{"v":0,"d":"0.00"},{"v":0,"d":"0.00"},{"$f":"SUM(W9:W21)","v":{"v":0,"d":"0.00"}},{"$f":"SUM(X9:X21)","v":{"v":0,"d":"0.00"}}]
[null,"СВЕРХУРОЧНЫЕ ЧАСЫ",null,null,"Дата:"]
[{"$nulls":7},{"$f":"День_первый","v":"2025-06-01"},{"$f":"День_первый+1","v":"2025-06-02"},{"$f":"День_первый+2","v":"2025-06-03"},{"$f":"День_первый+3","v":"2025-06-04"},{"$f":"День_первый+4","v":"2025-06-05"},{"$f":"День_первый+5","v":"2025-06-06"},{"$f":"День_первый+6","v":"2025-06-07"},"Неделя 1 С/У",{"$f":"День_первый+7","v":"2025-06-08"},{"$f":"День_первый+8","v":"2025-06-09"},{"$f":"День_первый+9","v":"2025-06-10"},{"$f":"День_первый+10","v":"2025-06-11"},{"$f":"День_первый+11","v":"2025-06-12"},{"$f":"День_первый+12","v":"2025-06-13"},{"$f":"День_первый+13","v":"2025-06-14"},"Неделя 2 С/У","Итого С/У","Код сверхурочных\nчасов"]
[null,"Задача","Отдел","№ заказа","Описание работы","Должность","Код должности",{"$f":"VLOOKUP(WEEKDAY(День_первый),Просмотр_дня_недели!$B$2:$C$8,2)","v":"Вс"},{"$f":"VLOOKUP(WEEKDAY(I24),Просмотр_дня_недели!$B$2:$C$8,2)","v":"Пн"},{"$f":"VLOOKUP(WEEKDAY(J24),Просмотр_дня_недели!$B$2:$C$8,2)","v":"Вт"},{"$f":"VLOOKUP(WEEKDAY(K24),Просмотр_дня_недели!$B$2:$C$8,2)","v":"Ср"},{"$f":"VLOOKUP(WEEKDAY(L24),Просмотр_дня_недели!$B$2:$C$8,2)","v":"Чт"},{"$f":"VLOOKUP(WEEKDAY(M24),Просмотр_дня_недели!$B$2:$C$8,2)","v":"Пт"},{"$f":"VLOOKUP(WEEKDAY(N24),Просмотр_дня_недели!$B$2:$C$8,2)","v":"Сб"},null,{"$f":"VLOOKUP(WEEKDAY(P24),Просмотр_дня_недели!$B$2:$C$8,2)","v":"Вс"},{"$f":"VLOOKUP(WEEKDAY(Q24),Просмотр_дня_недели!$B$2:$C$8,2)","v":"Пн"},{"$f":"VLOOKUP(WEEKDAY(R24),Просмотр_дня_недели!$B$2:$C$8,2)","v":"Вт"},{"$f":"VLOOKUP(WEEKDAY(S24),Просмотр_дня_недели!$B$2:$C$8,2)","v":"Ср"},{"$f":"VLOOKUP(WEEKDAY(T24),Просмотр_дня_недели!$B$2:$C$8,2)","v":"Чт"},{"$f":"VLOOKUP(WEEKDAY(U24),Просмотр_дня_недели!$B$2:$C$8,2)","v":"Пт"},{"$f":"VLOOKUP(WEEKDAY(V24),Просмотр_дня_недели!$B$2:$C$8,2)","v":"Сб"}]
[{"$nulls":14},{"$f":"SUM(H26:N26)","v":{"v":0,"d":"0.00"}},{"$nulls":7},{"$f":"SUM(P26:V26)","v":{"v":0,"d":"0.00"}},{"$f":"O26+W26","v":{"v":0,"d":"0.00"}}]
[{"$nulls":14},{"v":0,"d":"0.00"},{"$nulls":7},{"v":0,"d":"0.00"},{"v":0,"d":"0.00"}]
[{"$nulls":14},{"v":0,"d":"0.00"},{"$nulls":7},{"v":0,"d":"0.00"},{"v":0,"d":"0.00"}]
[{"$nulls":14},{"v":0,"d":"0.00"},{"$nulls":7},{"v":0,"d":"0.00"},{"v":0,"d":"0.00"}]
[{"$nulls":14},{"v":0,"d":"0.00"},{"$nulls":7},{"v":0,"d":"0.00"},{"v":0,"d":"0.00"}]
[{"$nulls":14},{"v":0,"d":"0.00"},{"$nulls":7},{"v":0,"d":"0.00"},{"v":0,"d":"0.00"}]
[{"$nulls":14},{"v":0,"d":"0.00"},{"$nulls":7},{"v":0,"d":"0.00"},{"v":0,"d":"0.00"}]
[null,"Итого сверхурочных часов     ",{"$nulls":5},{"$f":"SUM(H26:H32)","v":{"v":0,"d":"0.00"}},{"v":0,"d":"0.00"},{"v":0,"d":"0.00"},{"v":0,"d":"0.00"},{"v":0,"d":"0.00"},{"v":0,"d":"0.00"},{"v":0,"d":"0.00"},{"$f":"SUM(O26:O32)","v":{"v":0,"d":"0.00"}},{"v":0,"d":"0.00"},{"v":0,"d":"0.00"},{"v":0,"d":"0.00"},{"v":0,"d":"0.00"},{"v":0,"d":"0.00"},{"v":0,"d":"0.00"},{"v":0,"d":"0.00"},{"$f":"SUM(P33:V33)","v":{"v":0,"d":"0.00"}},{"$f":"SUM(X26:X32)","v":{"v":0,"d":"0.00"}},"Итого\nчасов\nотработано","Итого\nчасов\nоплачено"]
[null,"Компенсировано сверхурочных часов     ",{"$nulls":12},{"$f":"IF(SUM(H34:N34)<=O33,SUM(H34:N34),O33)","v":{"v":0,"d":"0.00"}},{"$nulls":7},{"$f":"IF(SUM(P34:V34)<=W33,SUM(P34:V34),W33)","v":{"v":0,"d":"0.00"}},{"$f":"IF(SUM(Q34:W34)<=X33,SUM(Q34:W34),X33)","v":{"v":0,"d":"0.00"}}]
[null,"Оплачено сверхурочных часов     ",{"$nulls":5},{"$f":"IF(H33>=H34,H33-H34,H33)","v":{"v":0,"d":"0.00"}},{"$f":"IF(I33>=I34,I33-I34,I33)","v":{"v":0,"d":"0.00"}},{"v":0,"d":"0.00"},{"v":0,"d":"0.00"},{"v":0,"d":"0.00"},{"v":0,"d":"0.00"},{"v":0,"d":"0.00"},{"v":0,"d":"0.00"},{"v":0,"d":"0.00"},{"v":0,"d":"0.00"},{"v":0,"d":"0.00"},{"v":0,"d":"0.00"},{"v":0,"d":"0.00"},{"v":0,"d":"0.00"},{"v":0,"d":"0.00"},{"$f":"IF(W33>=W34,W33-W34,W33)","v":{"v":0,"d":"0.00"}},{"$f":"IF(X33>=X34,X33-X34,X33)","v":{"v":0,"d":"0.00"}},{"$f":"$X$22+$X$33","v":{"v":0,"d":"0.00"}},{"$f":"X22+X35","v":{"v":0,"d":"0.00"}}]
[null,"Сотрудник ",{"$nulls":4},"Руководитель ",{"$nulls":8},"Руководитель "]

{"sheet":"Просмотр_дня_недели","index":1,"n_rows":8,"n_cols":3,"rows_kept":8}
[null,"День недели\nчисло","День недели\nназвание"]
[null,1,"Вс"]
[null,2,"Пн"]
[null,3,"Вт"]
[null,4,"Ср"]
[null,5,"Чт"]
[null,6,"Пт"]
[null,7,"Сб"]