{"text_format":"3","workbook":"xlsx","n_sheets":3,"sheets":["Patrimoniu net","Active","Datorii"],"not_rendered":{"charts":2,"images":2,"defined_names":1},"read":"whole","date_system":"1900"}

{"sheet":"Patrimoniu net","index":0,"n_rows":21,"n_cols":25,"rows_kept":21,"merged":[[3,2,4,7]]}
[{"$nulls":14}," "]
[{"$nulls":16},"Numerar și echivalent în numerar",{"$f":"SUMIF(TBL_Assets[Categorie],'Patrimoniu net'!Q2,TBL_Assets[Valoare])+ROW(Q2)/10000","v":42500.0002},{"$f":"_xlfn.RANK.EQ(R2,$R$2:$R$6,0)","v":5},null,{"$f":"INDEX($Q$2:$R$6,MATCH(5,$S$2:$S$6,0),1)","v":"Numerar și echivalent în numerar"},{"$f":"ROUND(INDEX($Q$2:$R$6,MATCH(5,$S$2:$S$6,0),2),2)","v":42500},null,"Total active",{"$f":"SUM(TBL_Assets[Valoare])","v":1923500}]
[null,null," PATRIMONIU NET",{"$nulls":13},"Proprietăți",{"$f":"SUMIF(TBL_Assets[Categorie],'Patrimoniu net'!Q3,TBL_Assets[Valoare])+ROW(Q3)/10000","v":1205000.0003},{"$f":"_xlfn.RANK.EQ(R3,$R$2:$R$6,0)","v":1},null,{"$f":"INDEX($Q$2:$R$6,MATCH(4,$S$2:$S$6,0),1)","v":"Economii de pensionare"},{"$f":"ROUND(INDEX($Q$2:$R$6,MATCH(4,$S$2:$S$6,0),2),2)","v":98000},null,"Total datorii",{"$f":"SUM(TBL_Debts[Valoare])","v":652500}]
[null,null,{"$f":"F6-F8","v":{"v":1271000,"d":"1,271,000 lei"}},{"$nulls":6},"ACTIVE vs DATORII",{"$nulls":6},"Investiții",{"$f":"SUMIF(TBL_Assets[Categorie],'Patrimoniu net'!Q4,TBL_Assets[Valoare])+ROW(Q4)/10000","v":475000.0004},{"$f":"_xlfn.RANK.EQ(R4,$R$2:$R$6,0)","v":2},null,{"$f":"INDEX($Q$2:$R$6,MATCH(3,$S$2:$S$6,0),1)","v":"Asigurare de viață"},{"$f":"ROUND(INDEX($Q$2:$R$6,MATCH(3,$S$2:$S$6,0),2),2)","v":103000}]
[{"$nulls":16},"Economii de pensionare",{"$f":"SUMIF(TBL_Assets[Categorie],'Patrimoniu net'!Q5,TBL_Assets[Valoare])+ROW(Q5)/10000","v":98000.0005},{"$f":"_xlfn.RANK.EQ(R5,$R$2:$R$6,0)","v":4},null,{"$f":"INDEX($Q$2:$R$6,MATCH(2,$S$2:$S$6,0),1)","v":"Investiții"},{"$f":"ROUND(INDEX($Q$2:$R$6,MATCH(2,$S$2:$S$6,0),2),2)","v":475000}]
[{"$nulls":4},"Total active",{"$f":"SUM(TBL_Assets[Valoare])","v":{"v":1923500,"d":"1,923,500 lei"}},{"$nulls":10},"Asigurare de viață",{"$f":"SUMIF(TBL_Assets[Categorie],'Patrimoniu net'!Q6,TBL_Assets[Valoare])+ROW(Q6)/10000","v":103000.0006},{"$f":"_xlfn.RANK.EQ(R6,$R$2:$R$6,0)","v":3},null,{"$f":"INDEX($Q$2:$R$6,MATCH(1,$S$2:$S$6,0),1)","v":"Proprietăți"},{"$f":"ROUND(INDEX($Q$2:$R$6,MATCH(1,$S$2:$S$6,0),2),2)","v":1205000}]
[]
[{"$nulls":4},"Total datorii",{"$f":"SUM(TBL_Debts[Valoare])","v":{"v":652500,"d":"652,500 lei"}}]
[]
[]
[]
[{"$nulls":3},"REZUMATUL ACTIVELOR"]
[{"$nulls":10},{"$f":"U6","v":"Proprietăți"},{"$f":"V6","v":{"v":1205000,"d":"1,205,000 lei"}}]
[]
[{"$nulls":10},{"$f":"U5","v":"Investiții"},{"$f":"V5","v":{"v":475000,"d":"475,000 lei"}}]
[]
[{"$nulls":10},{"$f":"U4","v":"Asigurare de viață"},{"$f":"V4","v":{"v":103000,"d":"103,000 lei"}}]
[]
[{"$nulls":10},{"$f":"U3","v":"Economii de pensionare"},{"$f":"V3","v":{"v":98000,"d":"98,000 lei"}}]
[]
[{"$nulls":10},{"$f":"U2","v":"Numerar și echivalent în numerar"},{"$f":"V2","v":{"v":42500,"d":"42,500 lei"}}]

{"sheet":"Active","index":1,"n_rows":25,"n_cols":5,"rows_kept":25}
[{"$nulls":4}," "]
[null,"ACTIVE"]
[]
[null,"Categorie","Articol","Valoare"]
[null,"Proprietăți","Casă",{"v":560000,"d":"560,000.00 lei"}]
[null,"Proprietăți","Altele",{"v":255000,"d":"255,000.00 lei"}]
[null,"Economii de pensionare","Conturi pensionare",{"v":98000,"d":"98,000.00 lei"}]
[null,"Investiții","Acțiuni",{"v":53000,"d":"53,000.00 lei"}]
[null,"Investiții","Obligațiuni",{"v":25000,"d":"25,000.00 lei"}]
[null,"Investiții","Fonduri mutuale",{"v":33000,"d":"33,000.00 lei"}]
[null,"Investiții","CD-uri",{"v":74000,"d":"74,000.00 lei"}]
[null,"Investiții","Lingouri",{"v":20000,"d":"20,000.00 lei"}]
[null,"Investiții","Fonduri fiduciare",{"v":250000,"d":"250,000.00 lei"}]
[null,"Asigurare de viață","Cont de economii pentru sănătate",{"v":18000,"d":"18,000.00 lei"}]
[null,"Asigurare de viață","Valoare nominală pentru politica de asigurări de viață",{"v":85000,"d":"85,000.00 lei"}]
[null,"Investiții","Altele",{"v":20000,"d":"20,000.00 lei"}]
[null,"Numerar și echivalent în numerar","Conturi curente",{"v":35500,"d":"35,500.00 lei"}]
[null,"Numerar și echivalent în numerar","Conturi de economii",{"v":5000,"d":"5,000.00 lei"}]
[null,"Numerar și echivalent în numerar","Altele",{"v":2000,"d":"2,000.00 lei"}]
[null,"Proprietăți","Mașini",{"v":55000,"d":"55,000.00 lei"}]
[null,"Proprietăți","Alte vehicule",{"v":85000,"d":"85,000.00 lei"}]
[null,"Proprietăți","Mobilier",{"v":100000,"d":"100,000.00 lei"}]
[null,"Proprietăți","Colecții",{"v":50000,"d":"50,000.00 lei"}]
[null,"Proprietăți","Bijuterii",{"v":60000,"d":"60,000.00 lei"}]
[null,"Proprietăți","Alte produse de lux",{"v":40000,"d":"40,000.00 lei"}]

{"sheet":"Datorii","index":2,"n_rows":14,"n_cols":4,"rows_kept":14}
[{"$nulls":3}," "]
[null,"DATORII"]
[]
[null,"Categorie","Valoare"]
[null,"Credite ipotecare",{"v":400000,"d":"400,000.00 lei"}]
[null,"Împrumuturi ipotecare secundare",{"v":50000,"d":"50,000.00 lei"}]
[null,"Credite auto",{"v":30000,"d":"30,000.00 lei"}]
[null,"Credite personale",{"v":12500,"d":"12,500.00 lei"}]
[null,"Carduri de credit",{"v":65000,"d":"65,000.00 lei"}]
[null,"Credite pentru studenți",{"v":10000,"d":"10,000.00 lei"}]
[null,"Împrumuturi pentru investiții",{"v":20000,"d":"20,000.00 lei"}]
[null,"Împrumuturi pentru asigurare de viață",{"v":5000,"d":"5,000.00 lei"}]
[null,"Alte credite cu rată",{"v":10000,"d":"10,000.00 lei"}]
[null,"Alte datorii",{"v":50000,"d":"50,000.00 lei"}]