{"text_format":"3","workbook":"xlsx","n_sheets":5,"sheets":["Rezumatul anului curent","T1","T2","T3","T4"],"not_rendered":{"defined_names":12},"read":"whole","date_system":"1900"}

{"sheet":"Rezumatul anului curent","index":0,"n_rows":36,"n_cols":12,"rows_kept":36,"merged":[[3,0,3,6]]}
["Numele firmei"]
["Monitorizarea prezenței, Rezumatul anului curent"]
["Dată"]
[{"$f":"Nume_Firmă","v":"Numele firmei"},{"$nulls":6},"CONFIDENȚIAL"]
["Nume de familie","Prenume","Vacanță","Personal","Concediu medical","CNP","Poziție","Supervizor","Data angajării","Comentarii","Zile de vacanță \npe an","Zile de vacanță \nRămase"]
["Nume de familie","Prenume",{"$f":"SUM('T1:T4'!C6)","v":3},{"$f":"SUM('T1:T4'!D6)","v":0},{"$f":"SUM('T1:T4'!E6)","v":1},"xxx-xx-xxxx","Manager","Nume",null,null,10,{"$f":"K6-C6","v":7}]
[null,null,{"$f":"SUM('T1:T4'!C7)","v":0},{"$f":"SUM('T1:T4'!D7)","v":0},{"$f":"SUM('T1:T4'!E7)","v":0},{"$nulls":6},{"$f":"K7-C7","v":0}]
[null,null,{"$f":"SUM('T1:T4'!C8)","v":0},{"$f":"SUM('T1:T4'!D8)","v":0},{"$f":"SUM('T1:T4'!E8)","v":0},{"$nulls":6},0]
[null,null,{"$f":"SUM('T1:T4'!C9)","v":0},{"$f":"SUM('T1:T4'!D9)","v":0},{"$f":"SUM('T1:T4'!E9)","v":0},{"$nulls":6},0]
[null,null,{"$f":"SUM('T1:T4'!C10)","v":0},{"$f":"SUM('T1:T4'!D10)","v":0},{"$f":"SUM('T1:T4'!E10)","v":0},{"$nulls":6},0]
[null,null,{"$f":"SUM('T1:T4'!C11)","v":0},{"$f":"SUM('T1:T4'!D11)","v":0},{"$f":"SUM('T1:T4'!E11)","v":0},{"$nulls":6},0]
[null,null,{"$f":"SUM('T1:T4'!C12)","v":0},{"$f":"SUM('T1:T4'!D12)","v":0},{"$f":"SUM('T1:T4'!E12)","v":0},{"$nulls":6},0]
[null,null,{"$f":"SUM('T1:T4'!C13)","v":0},{"$f":"SUM('T1:T4'!D13)","v":0},{"$f":"SUM('T1:T4'!E13)","v":0},{"$nulls":6},0]
[null,null,{"$f":"SUM('T1:T4'!C14)","v":0},{"$f":"SUM('T1:T4'!D14)","v":0},{"$f":"SUM('T1:T4'!E14)","v":0},{"$nulls":6},0]
[null,null,{"$f":"SUM('T1:T4'!C15)","v":0},{"$f":"SUM('T1:T4'!D15)","v":0},{"$f":"SUM('T1:T4'!E15)","v":0},{"$nulls":6},0]
[null,null,{"$f":"SUM('T1:T4'!C16)","v":0},{"$f":"SUM('T1:T4'!D16)","v":0},{"$f":"SUM('T1:T4'!E16)","v":0},{"$nulls":6},0]
[null,null,{"$f":"SUM('T1:T4'!C17)","v":0},{"$f":"SUM('T1:T4'!D17)","v":0},{"$f":"SUM('T1:T4'!E17)","v":0},{"$nulls":6},0]
[null,null,{"$f":"SUM('T1:T4'!C18)","v":0},{"$f":"SUM('T1:T4'!D18)","v":0},{"$f":"SUM('T1:T4'!E18)","v":0},{"$nulls":6},0]
[null,null,{"$f":"SUM('T1:T4'!C19)","v":0},{"$f":"SUM('T1:T4'!D19)","v":0},{"$f":"SUM('T1:T4'!E19)","v":0},{"$nulls":6},0]
[null,null,{"$f":"SUM('T1:T4'!C20)","v":0},{"$f":"SUM('T1:T4'!D20)","v":0},{"$f":"SUM('T1:T4'!E20)","v":0},{"$nulls":6},0]
[null,null,{"$f":"SUM('T1:T4'!C21)","v":0},{"$f":"SUM('T1:T4'!D21)","v":0},{"$f":"SUM('T1:T4'!E21)","v":0},{"$nulls":6},0]
[null,null,{"$f":"SUM('T1:T4'!C22)","v":0},{"$f":"SUM('T1:T4'!D22)","v":0},{"$f":"SUM('T1:T4'!E22)","v":0},{"$nulls":6},0]
[null,null,{"$f":"SUM('T1:T4'!C23)","v":0},{"$f":"SUM('T1:T4'!D23)","v":0},{"$f":"SUM('T1:T4'!E23)","v":0},{"$nulls":6},0]
[null,null,{"$f":"SUM('T1:T4'!C24)","v":0},{"$f":"SUM('T1:T4'!D24)","v":0},{"$f":"SUM('T1:T4'!E24)","v":0},{"$nulls":6},0]
[null,null,{"$f":"SUM('T1:T4'!C25)","v":0},{"$f":"SUM('T1:T4'!D25)","v":0},{"$f":"SUM('T1:T4'!E25)","v":0},{"$nulls":6},0]
[null,null,{"$f":"SUM('T1:T4'!C26)","v":0},{"$f":"SUM('T1:T4'!D26)","v":0},{"$f":"SUM('T1:T4'!E26)","v":0},{"$nulls":6},0]
[null,null,{"$f":"SUM('T1:T4'!C27)","v":0},{"$f":"SUM('T1:T4'!D27)","v":0},{"$f":"SUM('T1:T4'!E27)","v":0},{"$nulls":6},0]
[null,null,{"$f":"SUM('T1:T4'!C28)","v":0},{"$f":"SUM('T1:T4'!D28)","v":0},{"$f":"SUM('T1:T4'!E28)","v":0},{"$nulls":6},0]
[null,null,{"$f":"SUM('T1:T4'!C29)","v":0},{"$f":"SUM('T1:T4'!D29)","v":0},{"$f":"SUM('T1:T4'!E29)","v":0},{"$nulls":6},0]
[null,null,{"$f":"SUM('T1:T4'!C30)","v":0},{"$f":"SUM('T1:T4'!D30)","v":0},{"$f":"SUM('T1:T4'!E30)","v":0},{"$nulls":6},0]
[null,null,{"$f":"SUM('T1:T4'!C31)","v":0},{"$f":"SUM('T1:T4'!D31)","v":0},{"$f":"SUM('T1:T4'!E31)","v":0},{"$nulls":6},0]
[null,null,{"$f":"SUM('T1:T4'!C32)","v":0},{"$f":"SUM('T1:T4'!D32)","v":0},{"$f":"SUM('T1:T4'!E32)","v":0},{"$nulls":6},0]
[null,null,{"$f":"SUM('T1:T4'!C33)","v":0},{"$f":"SUM('T1:T4'!D33)","v":0},{"$f":"SUM('T1:T4'!E33)","v":0},{"$nulls":6},0]
[null,null,{"$f":"SUM('T1:T4'!C34)","v":0},{"$f":"SUM('T1:T4'!D34)","v":0},{"$f":"SUM('T1:T4'!E34)","v":0},{"$nulls":6},0]
[null,null,{"$f":"SUM('T1:T4'!C35)","v":0},{"$f":"SUM('T1:T4'!D35)","v":0},{"$f":"SUM('T1:T4'!E35)","v":0},{"$nulls":6},0]
[null,null,{"$f":"SUM('T1:T4'!C36)","v":0},{"$f":"SUM('T1:T4'!D36)","v":0},{"$f":"SUM('T1:T4'!E36)","v":0},{"$nulls":6},0]

{"sheet":"T1","index":1,"n_rows":36,"n_cols":95,"rows_kept":36,"merged":[[3,0,3,6]]}
[{"$f":"Nume_Firmă","v":"Numele firmei"}]
["Monitorizarea prezenței, trimestrul 1"]
["Dată"]
[{"$f":"Nume_Firmă","v":"Numele firmei"},{"$nulls":6},"CONFIDENȚIAL"]
["Nume de familie","Prenume","Vacanță","Personal","Concediu medical","01.01","02.01","03.01","04.01","05.01","06.01","07.01","08.01","09.01","10.01","11.01","12.01","13.01","14.01","15.01","16.01","17.01","18.01","19.01","20.01","21.01","22.01","23.01","24.01","25.01","26.01","27.01","28.01","29.01","30.01","31.01","01.02","02.02","03.02","04.02","05.02","06.02","07.02","08.02","09.02","10.02","11.02","12.02","13.02","14.02","15.02","16.02","17.02","18.02","19.02","20.02","21.02","22.02","23.02","24.02","25.02","26.02","27.02","28.02","01.03","02.03","03.03","04.03","05.03","06.03","07.03","08.03","09.03","10.03","11.03","12.03","13.03","14.03","15.03","16.03","17.03","18.03","19.03","20.03","21.03","22.03","23.03","24.03","25.03","26.03","27.03","28.03","29.03","30.03","31.03"]
[{"$f":"IF(ISBLANK('Rezumatul anului curent'!A6),\"\",'Rezumatul anului curent'!A6)","v":"Nume de familie"},{"$f":"IF(ISBLANK('Rezumatul anului curent'!B6),\"\",'Rezumatul anului curent'!B6)","v":"Prenume"},{"$f":"COUNTIF($F6:$CQ6, \"V\")","v":3},{"$f":"COUNTIF($F6:$CQ6, \"P\")","v":0},{"$f":"COUNTIF($F6:$CQ6, \"C\")","v":1},"v","v","v",{"$nulls":4},"c"]
[{"$f":"IF(ISBLANK('Rezumatul anului curent'!A7),\"\",'Rezumatul anului curent'!A7)","v":""},{"$f":"IF(ISBLANK('Rezumatul anului curent'!B7),\"\",'Rezumatul anului curent'!B7)","v":""},0,0,0]
[{"$f":"IF(ISBLANK('Rezumatul anului curent'!A8),\"\",'Rezumatul anului curent'!A8)","v":""},{"$f":"IF(ISBLANK('Rezumatul anului curent'!B8),\"\",'Rezumatul anului curent'!B8)","v":""},0,0,0]
[{"$f":"IF(ISBLANK('Rezumatul anului curent'!A9),\"\",'Rezumatul anului curent'!A9)","v":""},{"$f":"IF(ISBLANK('Rezumatul anului curent'!B9),\"\",'Rezumatul anului curent'!B9)","v":""},0,0,0]
[{"$f":"IF(ISBLANK('Rezumatul anului curent'!A10),\"\",'Rezumatul anului curent'!A10)","v":""},{"$f":"IF(ISBLANK('Rezumatul anului curent'!B10),\"\",'Rezumatul anului curent'!B10)","v":""},0,0,0]
[{"$f":"IF(ISBLANK('Rezumatul anului curent'!A11),\"\",'Rezumatul anului curent'!A11)","v":""},{"$f":"IF(ISBLANK('Rezumatul anului curent'!B11),\"\",'Rezumatul anului curent'!B11)","v":""},0,0,0]
[{"$f":"IF(ISBLANK('Rezumatul anului curent'!A12),\"\",'Rezumatul anului curent'!A12)","v":""},{"$f":"IF(ISBLANK('Rezumatul anului curent'!B12),\"\",'Rezumatul anului curent'!B12)","v":""},0,0,0]
[{"$f":"IF(ISBLANK('Rezumatul anului curent'!A13),\"\",'Rezumatul anului curent'!A13)","v":""},{"$f":"IF(ISBLANK('Rezumatul anului curent'!B13),\"\",'Rezumatul anului curent'!B13)","v":""},0,0,0]
[{"$f":"IF(ISBLANK('Rezumatul anului curent'!A14),\"\",'Rezumatul anului curent'!A14)","v":""},{"$f":"IF(ISBLANK('Rezumatul anului curent'!B14),\"\",'Rezumatul anului curent'!B14)","v":""},0,0,0]
[{"$f":"IF(ISBLANK('Rezumatul anului curent'!A15),\"\",'Rezumatul anului curent'!A15)","v":""},{"$f":"IF(ISBLANK('Rezumatul anului curent'!B15),\"\",'Rezumatul anului curent'!B15)","v":""},0,0,0]
[{"$f":"IF(ISBLANK('Rezumatul anului curent'!A16),\"\",'Rezumatul anului curent'!A16)","v":""},{"$f":"IF(ISBLANK('Rezumatul anului curent'!B16),\"\",'Rezumatul anului curent'!B16)","v":""},0,0,0]
[{"$f":"IF(ISBLANK('Rezumatul anului curent'!A17),\"\",'Rezumatul anului curent'!A17)","v":""},{"$f":"IF(ISBLANK('Rezumatul anului curent'!B17),\"\",'Rezumatul anului curent'!B17)","v":""},0,0,0]
[{"$f":"IF(ISBLANK('Rezumatul anului curent'!A18),\"\",'Rezumatul anului curent'!A18)","v":""},{"$f":"IF(ISBLANK('Rezumatul anului curent'!B18),\"\",'Rezumatul anului curent'!B18)","v":""},0,0,0]
[{"$f":"IF(ISBLANK('Rezumatul anului curent'!A19),\"\",'Rezumatul anului curent'!A19)","v":""},{"$f":"IF(ISBLANK('Rezumatul anului curent'!B19),\"\",'Rezumatul anului curent'!B19)","v":""},0,0,0]
[{"$f":"IF(ISBLANK('Rezumatul anului curent'!A20),\"\",'Rezumatul anului curent'!A20)","v":""},{"$f":"IF(ISBLANK('Rezumatul anului curent'!B20),\"\",'Rezumatul anului curent'!B20)","v":""},0,0,0]
[{"$f":"IF(ISBLANK('Rezumatul anului curent'!A21),\"\",'Rezumatul anului curent'!A21)","v":""},{"$f":"IF(ISBLANK('Rezumatul anului curent'!B21),\"\",'Rezumatul anului curent'!B21)","v":""},0,0,0]
[{"$f":"IF(ISBLANK('Rezumatul anului curent'!A22),\"\",'Rezumatul anului curent'!A22)","v":""},{"$f":"IF(ISBLANK('Rezumatul anului curent'!B22),\"\",'Rezumatul anului curent'!B22)","v":""},0,0,0]
[{"$f":"IF(ISBLANK('Rezumatul anului curent'!A23),\"\",'Rezumatul anului curent'!A23)","v":""},{"$f":"IF(ISBLANK('Rezumatul anului curent'!B23),\"\",'Rezumatul anului curent'!B23)","v":""},0,0,0]
[{"$f":"IF(ISBLANK('Rezumatul anului curent'!A24),\"\",'Rezumatul anului curent'!A24)","v":""},{"$f":"IF(ISBLANK('Rezumatul anului curent'!B24),\"\",'Rezumatul anului curent'!B24)","v":""},0,0,0]
[{"$f":"IF(ISBLANK('Rezumatul anului curent'!A25),\"\",'Rezumatul anului curent'!A25)","v":""},{"$f":"IF(ISBLANK('Rezumatul anului curent'!B25),\"\",'Rezumatul anului curent'!B25)","v":""},0,0,0]
[{"$f":"IF(ISBLANK('Rezumatul anului curent'!A26),\"\",'Rezumatul anului curent'!A26)","v":""},{"$f":"IF(ISBLANK('Rezumatul anului curent'!B26),\"\",'Rezumatul anului curent'!B26)","v":""},0,0,0]
[{"$f":"IF(ISBLANK('Rezumatul anului curent'!A27),\"\",'Rezumatul anului curent'!A27)","v":""},{"$f":"IF(ISBLANK('Rezumatul anului curent'!B27),\"\",'Rezumatul anului curent'!B27)","v":""},0,0,0]
[{"$f":"IF(ISBLANK('Rezumatul anului curent'!A28),\"\",'Rezumatul anului curent'!A28)","v":""},{"$f":"IF(ISBLANK('Rezumatul anului curent'!B28),\"\",'Rezumatul anului curent'!B28)","v":""},0,0,0]
[{"$f":"IF(ISBLANK('Rezumatul anului curent'!A29),\"\",'Rezumatul anului curent'!A29)","v":""},{"$f":"IF(ISBLANK('Rezumatul anului curent'!B29),\"\",'Rezumatul anului curent'!B29)","v":""},0,0,0]
[{"$f":"IF(ISBLANK('Rezumatul anului curent'!A30),\"\",'Rezumatul anului curent'!A30)","v":""},{"$f":"IF(ISBLANK('Rezumatul anului curent'!B30),\"\",'Rezumatul anului curent'!B30)","v":""},0,0,0]
[{"$f":"IF(ISBLANK('Rezumatul anului curent'!A31),\"\",'Rezumatul anului curent'!A31)","v":""},{"$f":"IF(ISBLANK('Rezumatul anului curent'!B31),\"\",'Rezumatul anului curent'!B31)","v":""},0,0,0]
[{"$f":"IF(ISBLANK('Rezumatul anului curent'!A32),\"\",'Rezumatul anului curent'!A32)","v":""},{"$f":"IF(ISBLANK('Rezumatul anului curent'!B32),\"\",'Rezumatul anului curent'!B32)","v":""},0,0,0]
[{"$f":"IF(ISBLANK('Rezumatul anului curent'!A33),\"\",'Rezumatul anului curent'!A33)","v":""},{"$f":"IF(ISBLANK('Rezumatul anului curent'!B33),\"\",'Rezumatul anului curent'!B33)","v":""},0,0,0]
[{"$f":"IF(ISBLANK('Rezumatul anului curent'!A34),\"\",'Rezumatul anului curent'!A34)","v":""},{"$f":"IF(ISBLANK('Rezumatul anului curent'!B34),\"\",'Rezumatul anului curent'!B34)","v":""},0,0,0]
[{"$f":"IF(ISBLANK('Rezumatul anului curent'!A35),\"\",'Rezumatul anului curent'!A35)","v":""},{"$f":"IF(ISBLANK('Rezumatul anului curent'!B35),\"\",'Rezumatul anului curent'!B35)","v":""},0,0,0]
[{"$f":"IF(ISBLANK('Rezumatul anului curent'!A36),\"\",'Rezumatul anului curent'!A36)","v":""},{"$f":"IF(ISBLANK('Rezumatul anului curent'!B36),\"\",'Rezumatul anului curent'!B36)","v":""},0,0,0]

{"sheet":"T2","index":2,"n_rows":36,"n_cols":96,"rows_kept":36,"merged":[[3,0,3,6]]}
[{"$f":"Nume_Firmă","v":"Numele firmei"}]
["Monitorizarea prezenței, trimestrul 2"]
["Dată"]
[{"$f":"Nume_Firmă","v":"Numele firmei"},{"$nulls":6},"CONFIDENȚIAL"]
["Nume de familie","Prenume","Vacanță","Personal","Concediu medical","01.04","02.04","03.04","04.04.","05.04","06.04","07.04","08.04","09.04","10.04","11.04","12.04","13.04","14.04","15.04","16.04","17.04","18.04","19.04","20.04","21.04","22.04","23.04","24.04","25.04","26.04","27.04","28.04","29.04","30.04","01.05","02.05","03.05","04.05","05.05","06.05","07.05","08.05","09.05","10.05","11.05","12.05","13.05","14.05","15.05","16.05","17.05","18.05","19.05","20.05","21.05","22.05","23.05","24.05","25.05","26.05","27.05","28.05","29.05","30.05","31.05","01.06","02.06","03.06","04.06","05.06","06.06","07.06","08.06","09.06","10.06","11.06","12.06","13.06","14.06","15.06","16.06","17.06","18.06","19.06","20.06","21.06","22.06","23.06","24.06","25.06","26.06","27.06","28.06","29.06","30.06"]
[{"$f":"IF(ISBLANK('Rezumatul anului curent'!A6),\"\",'Rezumatul anului curent'!A6)","v":"Nume de familie"},{"$f":"IF(ISBLANK('Rezumatul anului curent'!B6),\"\",'Rezumatul anului curent'!B6)","v":"Prenume"},{"$f":"COUNTIF($F6:$CR6, \"V\")","v":0},{"$f":"COUNTIF($F6:$CR6, \"P\")","v":0},{"$f":"COUNTIF($F6:$CR6, \"C\")","v":0}]
[{"$f":"IF(ISBLANK('Rezumatul anului curent'!A7),\"\",'Rezumatul anului curent'!A7)","v":""},{"$f":"IF(ISBLANK('Rezumatul anului curent'!B7),\"\",'Rezumatul anului curent'!B7)","v":""},{"$f":"COUNTIF($F7:$CR7, \"V\")","v":0},{"$f":"COUNTIF($F7:$CR7, \"P\")","v":0},0]
[{"$f":"IF(ISBLANK('Rezumatul anului curent'!A8),\"\",'Rezumatul anului curent'!A8)","v":""},{"$f":"IF(ISBLANK('Rezumatul anului curent'!B8),\"\",'Rezumatul anului curent'!B8)","v":""},0,0,0]
[{"$f":"IF(ISBLANK('Rezumatul anului curent'!A9),\"\",'Rezumatul anului curent'!A9)","v":""},{"$f":"IF(ISBLANK('Rezumatul anului curent'!B9),\"\",'Rezumatul anului curent'!B9)","v":""},0,0,0]
[{"$f":"IF(ISBLANK('Rezumatul anului curent'!A10),\"\",'Rezumatul anului curent'!A10)","v":""},{"$f":"IF(ISBLANK('Rezumatul anului curent'!B10),\"\",'Rezumatul anului curent'!B10)","v":""},0,0,0]
[{"$f":"IF(ISBLANK('Rezumatul anului curent'!A11),\"\",'Rezumatul anului curent'!A11)","v":""},{"$f":"IF(ISBLANK('Rezumatul anului curent'!B11),\"\",'Rezumatul anului curent'!B11)","v":""},0,0,0]
[{"$f":"IF(ISBLANK('Rezumatul anului curent'!A12),\"\",'Rezumatul anului curent'!A12)","v":""},{"$f":"IF(ISBLANK('Rezumatul anului curent'!B12),\"\",'Rezumatul anului curent'!B12)","v":""},0,0,0]
[{"$f":"IF(ISBLANK('Rezumatul anului curent'!A13),\"\",'Rezumatul anului curent'!A13)","v":""},{"$f":"IF(ISBLANK('Rezumatul anului curent'!B13),\"\",'Rezumatul anului curent'!B13)","v":""},0,0,0]
[{"$f":"IF(ISBLANK('Rezumatul anului curent'!A14),\"\",'Rezumatul anului curent'!A14)","v":""},{"$f":"IF(ISBLANK('Rezumatul anului curent'!B14),\"\",'Rezumatul anului curent'!B14)","v":""},0,0,0]
[{"$f":"IF(ISBLANK('Rezumatul anului curent'!A15),\"\",'Rezumatul anului curent'!A15)","v":""},{"$f":"IF(ISBLANK('Rezumatul anului curent'!B15),\"\",'Rezumatul anului curent'!B15)","v":""},0,0,0]
[{"$f":"IF(ISBLANK('Rezumatul anului curent'!A16),\"\",'Rezumatul anului curent'!A16)","v":""},{"$f":"IF(ISBLANK('Rezumatul anului curent'!B16),\"\",'Rezumatul anului curent'!B16)","v":""},0,0,0]
[{"$f":"IF(ISBLANK('Rezumatul anului curent'!A17),\"\",'Rezumatul anului curent'!A17)","v":""},{"$f":"IF(ISBLANK('Rezumatul anului curent'!B17),\"\",'Rezumatul anului curent'!B17)","v":""},0,0,0]
[{"$f":"IF(ISBLANK('Rezumatul anului curent'!A18),\"\",'Rezumatul anului curent'!A18)","v":""},{"$f":"IF(ISBLANK('Rezumatul anului curent'!B18),\"\",'Rezumatul anului curent'!B18)","v":""},0,0,0]
[{"$f":"IF(ISBLANK('Rezumatul anului curent'!A19),\"\",'Rezumatul anului curent'!A19)","v":""},{"$f":"IF(ISBLANK('Rezumatul anului curent'!B19),\"\",'Rezumatul anului curent'!B19)","v":""},0,0,0]
[{"$f":"IF(ISBLANK('Rezumatul anului curent'!A20),\"\",'Rezumatul anului curent'!A20)","v":""},{"$f":"IF(ISBLANK('Rezumatul anului curent'!B20),\"\",'Rezumatul anului curent'!B20)","v":""},0,0,0]
[{"$f":"IF(ISBLANK('Rezumatul anului curent'!A21),\"\",'Rezumatul anului curent'!A21)","v":""},{"$f":"IF(ISBLANK('Rezumatul anului curent'!B21),\"\",'Rezumatul anului curent'!B21)","v":""},0,0,0]
[{"$f":"IF(ISBLANK('Rezumatul anului curent'!A22),\"\",'Rezumatul anului curent'!A22)","v":""},{"$f":"IF(ISBLANK('Rezumatul anului curent'!B22),\"\",'Rezumatul anului curent'!B22)","v":""},0,0,0]
[{"$f":"IF(ISBLANK('Rezumatul anului curent'!A23),\"\",'Rezumatul anului curent'!A23)","v":""},{"$f":"IF(ISBLANK('Rezumatul anului curent'!B23),\"\",'Rezumatul anului curent'!B23)","v":""},0,0,0]
[{"$f":"IF(ISBLANK('Rezumatul anului curent'!A24),\"\",'Rezumatul anului curent'!A24)","v":""},{"$f":"IF(ISBLANK('Rezumatul anului curent'!B24),\"\",'Rezumatul anului curent'!B24)","v":""},0,0,0]
[{"$f":"IF(ISBLANK('Rezumatul anului curent'!A25),\"\",'Rezumatul anului curent'!A25)","v":""},{"$f":"IF(ISBLANK('Rezumatul anului curent'!B25),\"\",'Rezumatul anului curent'!B25)","v":""},0,0,0]
[{"$f":"IF(ISBLANK('Rezumatul anului curent'!A26),\"\",'Rezumatul anului curent'!A26)","v":""},{"$f":"IF(ISBLANK('Rezumatul anului curent'!B26),\"\",'Rezumatul anului curent'!B26)","v":""},0,0,0]
[{"$f":"IF(ISBLANK('Rezumatul anului curent'!A27),\"\",'Rezumatul anului curent'!A27)","v":""},{"$f":"IF(ISBLANK('Rezumatul anului curent'!B27),\"\",'Rezumatul anului curent'!B27)","v":""},0,0,0]
[{"$f":"IF(ISBLANK('Rezumatul anului curent'!A28),\"\",'Rezumatul anului curent'!A28)","v":""},{"$f":"IF(ISBLANK('Rezumatul anului curent'!B28),\"\",'Rezumatul anului curent'!B28)","v":""},0,0,0]
[{"$f":"IF(ISBLANK('Rezumatul anului curent'!A29),\"\",'Rezumatul anului curent'!A29)","v":""},{"$f":"IF(ISBLANK('Rezumatul anului curent'!B29),\"\",'Rezumatul anului curent'!B29)","v":""},0,0,0]
[{"$f":"IF(ISBLANK('Rezumatul anului curent'!A30),\"\",'Rezumatul anului curent'!A30)","v":""},{"$f":"IF(ISBLANK('Rezumatul anului curent'!B30),\"\",'Rezumatul anului curent'!B30)","v":""},0,0,0]
[{"$f":"IF(ISBLANK('Rezumatul anului curent'!A31),\"\",'Rezumatul anului curent'!A31)","v":""},{"$f":"IF(ISBLANK('Rezumatul anului curent'!B31),\"\",'Rezumatul anului curent'!B31)","v":""},0,0,0]
[{"$f":"IF(ISBLANK('Rezumatul anului curent'!A32),\"\",'Rezumatul anului curent'!A32)","v":""},{"$f":"IF(ISBLANK('Rezumatul anului curent'!B32),\"\",'Rezumatul anului curent'!B32)","v":""},0,0,0]
[{"$f":"IF(ISBLANK('Rezumatul anului curent'!A33),\"\",'Rezumatul anului curent'!A33)","v":""},{"$f":"IF(ISBLANK('Rezumatul anului curent'!B33),\"\",'Rezumatul anului curent'!B33)","v":""},0,0,0]
[{"$f":"IF(ISBLANK('Rezumatul anului curent'!A34),\"\",'Rezumatul anului curent'!A34)","v":""},{"$f":"IF(ISBLANK('Rezumatul anului curent'!B34),\"\",'Rezumatul anului curent'!B34)","v":""},0,0,0]
[{"$f":"IF(ISBLANK('Rezumatul anului curent'!A35),\"\",'Rezumatul anului curent'!A35)","v":""},{"$f":"IF(ISBLANK('Rezumatul anului curent'!B35),\"\",'Rezumatul anului curent'!B35)","v":""},0,0,0]
[{"$f":"IF(ISBLANK('Rezumatul anului curent'!A36),\"\",'Rezumatul anului curent'!A36)","v":""},{"$f":"IF(ISBLANK('Rezumatul anului curent'!B36),\"\",'Rezumatul anului curent'!B36)","v":""},0,0,0]

{"sheet":"T3","index":3,"n_rows":36,"n_cols":97,"rows_kept":36,"merged":[[3,0,3,6]]}
[{"$f":"Nume_Firmă","v":"Numele firmei"}]
["Monitorizarea prezenței, trimestrul 3"]
["Dată"]
[{"$f":"Nume_Firmă","v":"Numele firmei"},{"$nulls":6},"CONFIDENȚIAL"]
["Nume de familie","Prenume","Vacanță","Personal","Concediu medical","01.07","02.07","03.07","04.07","05.07","06.07","07.07","08.07","09.07","10.07","11.07","12.07","13.07","14.07","15.07","16.07","17.07","18.07","19.07","20.07","21.07","22.07","23.07","24.07","25.07","26.07","27.07","28.07","29.07","30.07","31.07","01.08","02.08","03.08","04.08","05.08","06.08","07.08","08.08","09.08","10.08","11.08","12.08","13.08","14.08","15.08","16.08","17.08","18.08","19.08","20.08","21.08","22.08","23.08","24.08","25.08","26.08","27.08","28.08","29.08","30.08","31.08","01.09","02.09","03.09","04.09","05.09","06.09","07.09","08.09","09.09","10.09","11.09","12.09","13.09","14.09","15.09","16.09","17.09","18.09","19.09","20.09","21.09","22.09","23.09","24.09","25.09","26.09","27.09","28.09","29.09","30.09"]
[{"$f":"IF(ISBLANK('Rezumatul anului curent'!A6),\"\",'Rezumatul anului curent'!A6)","v":"Nume de familie"},{"$f":"IF(ISBLANK('Rezumatul anului curent'!B6),\"\",'Rezumatul anului curent'!B6)","v":"Prenume"},{"$f":"COUNTIF($F6:$CS6, \"V\")","v":0},{"$f":"COUNTIF($F6:$CS6, \"P\")","v":0},{"$f":"COUNTIF($F6:$CS6, \"C\")","v":0}]
[{"$f":"IF(ISBLANK('Rezumatul anului curent'!A7),\"\",'Rezumatul anului curent'!A7)","v":""},{"$f":"IF(ISBLANK('Rezumatul anului curent'!B7),\"\",'Rezumatul anului curent'!B7)","v":""},{"$f":"COUNTIF($F7:$CS7, \"V\")","v":0},{"$f":"COUNTIF($F7:$CS7, \"P\")","v":0},0]
[{"$f":"IF(ISBLANK('Rezumatul anului curent'!A8),\"\",'Rezumatul anului curent'!A8)","v":""},{"$f":"IF(ISBLANK('Rezumatul anului curent'!B8),\"\",'Rezumatul anului curent'!B8)","v":""},0,0,0]
[{"$f":"IF(ISBLANK('Rezumatul anului curent'!A9),\"\",'Rezumatul anului curent'!A9)","v":""},{"$f":"IF(ISBLANK('Rezumatul anului curent'!B9),\"\",'Rezumatul anului curent'!B9)","v":""},0,0,0]
[{"$f":"IF(ISBLANK('Rezumatul anului curent'!A10),\"\",'Rezumatul anului curent'!A10)","v":""},{"$f":"IF(ISBLANK('Rezumatul anului curent'!B10),\"\",'Rezumatul anului curent'!B10)","v":""},0,0,0]
[{"$f":"IF(ISBLANK('Rezumatul anului curent'!A11),\"\",'Rezumatul anului curent'!A11)","v":""},{"$f":"IF(ISBLANK('Rezumatul anului curent'!B11),\"\",'Rezumatul anului curent'!B11)","v":""},0,0,0]
[{"$f":"IF(ISBLANK('Rezumatul anului curent'!A12),\"\",'Rezumatul anului curent'!A12)","v":""},{"$f":"IF(ISBLANK('Rezumatul anului curent'!B12),\"\",'Rezumatul anului curent'!B12)","v":""},0,0,0]
[{"$f":"IF(ISBLANK('Rezumatul anului curent'!A13),\"\",'Rezumatul anului curent'!A13)","v":""},{"$f":"IF(ISBLANK('Rezumatul anului curent'!B13),\"\",'Rezumatul anului curent'!B13)","v":""},0,0,0]
[{"$f":"IF(ISBLANK('Rezumatul anului curent'!A14),\"\",'Rezumatul anului curent'!A14)","v":""},{"$f":"IF(ISBLANK('Rezumatul anului curent'!B14),\"\",'Rezumatul anului curent'!B14)","v":""},0,0,0]
[{"$f":"IF(ISBLANK('Rezumatul anului curent'!A15),\"\",'Rezumatul anului curent'!A15)","v":""},{"$f":"IF(ISBLANK('Rezumatul anului curent'!B15),\"\",'Rezumatul anului curent'!B15)","v":""},0,0,0]
[{"$f":"IF(ISBLANK('Rezumatul anului curent'!A16),\"\",'Rezumatul anului curent'!A16)","v":""},{"$f":"IF(ISBLANK('Rezumatul anului curent'!B16),\"\",'Rezumatul anului curent'!B16)","v":""},0,0,0]
[{"$f":"IF(ISBLANK('Rezumatul anului curent'!A17),\"\",'Rezumatul anului curent'!A17)","v":""},{"$f":"IF(ISBLANK('Rezumatul anului curent'!B17),\"\",'Rezumatul anului curent'!B17)","v":""},0,0,0]
[{"$f":"IF(ISBLANK('Rezumatul anului curent'!A18),\"\",'Rezumatul anului curent'!A18)","v":""},{"$f":"IF(ISBLANK('Rezumatul anului curent'!B18),\"\",'Rezumatul anului curent'!B18)","v":""},0,0,0]
[{"$f":"IF(ISBLANK('Rezumatul anului curent'!A19),\"\",'Rezumatul anului curent'!A19)","v":""},{"$f":"IF(ISBLANK('Rezumatul anului curent'!B19),\"\",'Rezumatul anului curent'!B19)","v":""},0,0,0]
[{"$f":"IF(ISBLANK('Rezumatul anului curent'!A20),\"\",'Rezumatul anului curent'!A20)","v":""},{"$f":"IF(ISBLANK('Rezumatul anului curent'!B20),\"\",'Rezumatul anului curent'!B20)","v":""},0,0,0]
[{"$f":"IF(ISBLANK('Rezumatul anului curent'!A21),\"\",'Rezumatul anului curent'!A21)","v":""},{"$f":"IF(ISBLANK('Rezumatul anului curent'!B21),\"\",'Rezumatul anului curent'!B21)","v":""},0,0,0]
[{"$f":"IF(ISBLANK('Rezumatul anului curent'!A22),\"\",'Rezumatul anului curent'!A22)","v":""},{"$f":"IF(ISBLANK('Rezumatul anului curent'!B22),\"\",'Rezumatul anului curent'!B22)","v":""},0,0,0]
[{"$f":"IF(ISBLANK('Rezumatul anului curent'!A23),\"\",'Rezumatul anului curent'!A23)","v":""},{"$f":"IF(ISBLANK('Rezumatul anului curent'!B23),\"\",'Rezumatul anului curent'!B23)","v":""},0,0,0]
[{"$f":"IF(ISBLANK('Rezumatul anului curent'!A24),\"\",'Rezumatul anului curent'!A24)","v":""},{"$f":"IF(ISBLANK('Rezumatul anului curent'!B24),\"\",'Rezumatul anului curent'!B24)","v":""},0,0,0]
[{"$f":"IF(ISBLANK('Rezumatul anului curent'!A25),\"\",'Rezumatul anului curent'!A25)","v":""},{"$f":"IF(ISBLANK('Rezumatul anului curent'!B25),\"\",'Rezumatul anului curent'!B25)","v":""},0,0,0]
[{"$f":"IF(ISBLANK('Rezumatul anului curent'!A26),\"\",'Rezumatul anului curent'!A26)","v":""},{"$f":"IF(ISBLANK('Rezumatul anului curent'!B26),\"\",'Rezumatul anului curent'!B26)","v":""},0,0,0]
[{"$f":"IF(ISBLANK('Rezumatul anului curent'!A27),\"\",'Rezumatul anului curent'!A27)","v":""},{"$f":"IF(ISBLANK('Rezumatul anului curent'!B27),\"\",'Rezumatul anului curent'!B27)","v":""},0,0,0]
[{"$f":"IF(ISBLANK('Rezumatul anului curent'!A28),\"\",'Rezumatul anului curent'!A28)","v":""},{"$f":"IF(ISBLANK('Rezumatul anului curent'!B28),\"\",'Rezumatul anului curent'!B28)","v":""},0,0,0]
[{"$f":"IF(ISBLANK('Rezumatul anului curent'!A29),\"\",'Rezumatul anului curent'!A29)","v":""},{"$f":"IF(ISBLANK('Rezumatul anului curent'!B29),\"\",'Rezumatul anului curent'!B29)","v":""},0,0,0]
[{"$f":"IF(ISBLANK('Rezumatul anului curent'!A30),\"\",'Rezumatul anului curent'!A30)","v":""},{"$f":"IF(ISBLANK('Rezumatul anului curent'!B30),\"\",'Rezumatul anului curent'!B30)","v":""},0,0,0]
[{"$f":"IF(ISBLANK('Rezumatul anului curent'!A31),\"\",'Rezumatul anului curent'!A31)","v":""},{"$f":"IF(ISBLANK('Rezumatul anului curent'!B31),\"\",'Rezumatul anului curent'!B31)","v":""},0,0,0]
[{"$f":"IF(ISBLANK('Rezumatul anului curent'!A32),\"\",'Rezumatul anului curent'!A32)","v":""},{"$f":"IF(ISBLANK('Rezumatul anului curent'!B32),\"\",'Rezumatul anului curent'!B32)","v":""},0,0,0]
[{"$f":"IF(ISBLANK('Rezumatul anului curent'!A33),\"\",'Rezumatul anului curent'!A33)","v":""},{"$f":"IF(ISBLANK('Rezumatul anului curent'!B33),\"\",'Rezumatul anului curent'!B33)","v":""},0,0,0]
[{"$f":"IF(ISBLANK('Rezumatul anului curent'!A34),\"\",'Rezumatul anului curent'!A34)","v":""},{"$f":"IF(ISBLANK('Rezumatul anului curent'!B34),\"\",'Rezumatul anului curent'!B34)","v":""},0,0,0]
[{"$f":"IF(ISBLANK('Rezumatul anului curent'!A35),\"\",'Rezumatul anului curent'!A35)","v":""},{"$f":"IF(ISBLANK('Rezumatul anului curent'!B35),\"\",'Rezumatul anului curent'!B35)","v":""},0,0,0]
[{"$f":"IF(ISBLANK('Rezumatul anului curent'!A36),\"\",'Rezumatul anului curent'!A36)","v":""},{"$f":"IF(ISBLANK('Rezumatul anului curent'!B36),\"\",'Rezumatul anului curent'!B36)","v":""},0,0,0]

{"sheet":"T4","index":4,"n_rows":36,"n_cols":97,"rows_kept":36,"merged":[[3,0,3,6]]}
[{"$f":"Nume_Firmă","v":"Numele firmei"}]
["Monitorizarea prezenței, trimestrul 4"]
["Dată"]
[{"$f":"Nume_Firmă","v":"Numele firmei"},{"$nulls":6},"CONFIDENȚIAL"]
["Nume de familie","Prenume","Vacanță","Personal","Concediu medical","01.10","02.10","03.10","04.10","05.10","06.10","07.10","08.10","09.10","10.10","11.10","12.10","13.10","14.10","15.10","16.10","17.10","18.10","19.10","20.10","21.10","22.10","23.10","24.10","25.10","26.10","27.10","28.10","29.10","30.10","31.10","01.11","02.11","03.11","04.11","05.11","06.11","07.11","08.11","09.11","10.11","11.11","12.11","13.11","14.11","15.11","16.11","17.11","18.11","19.11","20.11","21.11","22.11","23.11","24.11","25.11","26.11","27.11","28.11","29.11","30.11","01.12","02.12","03.12","04.12","05.12","06.12","07.12","08.12","09.12","10.12","11.12","12.12","13.12","14.12","15.12","16.12","17.12","18.12","19.12","20.12","21.12","22.12","23.12","24.12","25.12","26.12","27.12","28.12","29.12","30.12","31.12"]
[{"$f":"IF(ISBLANK('Rezumatul anului curent'!A6),\"\",'Rezumatul anului curent'!A6)","v":"Nume de familie"},{"$f":"IF(ISBLANK('Rezumatul anului curent'!B6),\"\",'Rezumatul anului curent'!B6)","v":"Prenume"},{"$f":"COUNTIF($F6:$CS6, \"V\")","v":0},{"$f":"COUNTIF($F6:CS6, \"P\")","v":0},{"$f":"COUNTIF($F6:CS6, \"C\")","v":0}]
[{"$f":"IF(ISBLANK('Rezumatul anului curent'!A7),\"\",'Rezumatul anului curent'!A7)","v":""},{"$f":"IF(ISBLANK('Rezumatul anului curent'!B7),\"\",'Rezumatul anului curent'!B7)","v":""},0,{"$f":"COUNTIF($F7:CS7, \"P\")","v":0},{"$f":"COUNTIF($F7:CS7, \"C\")","v":0}]
[{"$f":"IF(ISBLANK('Rezumatul anului curent'!A8),\"\",'Rezumatul anului curent'!A8)","v":""},{"$f":"IF(ISBLANK('Rezumatul anului curent'!B8),\"\",'Rezumatul anului curent'!B8)","v":""},0,{"$f":"COUNTIF($F8:CS8, \"P\")","v":0},{"$f":"COUNTIF($F8:CS8, \"C\")","v":0}]
[{"$f":"IF(ISBLANK('Rezumatul anului curent'!A9),\"\",'Rezumatul anului curent'!A9)","v":""},{"$f":"IF(ISBLANK('Rezumatul anului curent'!B9),\"\",'Rezumatul anului curent'!B9)","v":""},0,{"$f":"COUNTIF($F9:CS9, \"P\")","v":0},{"$f":"COUNTIF($F9:CS9, \"C\")","v":0}]
[{"$f":"IF(ISBLANK('Rezumatul anului curent'!A10),\"\",'Rezumatul anului curent'!A10)","v":""},{"$f":"IF(ISBLANK('Rezumatul anului curent'!B10),\"\",'Rezumatul anului curent'!B10)","v":""},0,{"$f":"COUNTIF($F10:CS10, \"P\")","v":0},{"$f":"COUNTIF($F10:CS10, \"C\")","v":0}]
[{"$f":"IF(ISBLANK('Rezumatul anului curent'!A11),\"\",'Rezumatul anului curent'!A11)","v":""},{"$f":"IF(ISBLANK('Rezumatul anului curent'!B11),\"\",'Rezumatul anului curent'!B11)","v":""},0,{"$f":"COUNTIF($F11:CS11, \"P\")","v":0},{"$f":"COUNTIF($F11:CS11, \"C\")","v":0}]
[{"$f":"IF(ISBLANK('Rezumatul anului curent'!A12),\"\",'Rezumatul anului curent'!A12)","v":""},{"$f":"IF(ISBLANK('Rezumatul anului curent'!B12),\"\",'Rezumatul anului curent'!B12)","v":""},0,{"$f":"COUNTIF($F12:CS12, \"P\")","v":0},{"$f":"COUNTIF($F12:CS12, \"C\")","v":0}]
[{"$f":"IF(ISBLANK('Rezumatul anului curent'!A13),\"\",'Rezumatul anului curent'!A13)","v":""},{"$f":"IF(ISBLANK('Rezumatul anului curent'!B13),\"\",'Rezumatul anului curent'!B13)","v":""},0,{"$f":"COUNTIF($F13:CS13, \"P\")","v":0},{"$f":"COUNTIF($F13:CS13, \"C\")","v":0}]
[{"$f":"IF(ISBLANK('Rezumatul anului curent'!A14),\"\",'Rezumatul anului curent'!A14)","v":""},{"$f":"IF(ISBLANK('Rezumatul anului curent'!B14),\"\",'Rezumatul anului curent'!B14)","v":""},0,{"$f":"COUNTIF($F14:CS14, \"P\")","v":0},{"$f":"COUNTIF($F14:CS14, \"C\")","v":0}]
[{"$f":"IF(ISBLANK('Rezumatul anului curent'!A15),\"\",'Rezumatul anului curent'!A15)","v":""},{"$f":"IF(ISBLANK('Rezumatul anului curent'!B15),\"\",'Rezumatul anului curent'!B15)","v":""},0,{"$f":"COUNTIF($F15:CS15, \"P\")","v":0},{"$f":"COUNTIF($F15:CS15, \"C\")","v":0}]
[{"$f":"IF(ISBLANK('Rezumatul anului curent'!A16),\"\",'Rezumatul anului curent'!A16)","v":""},{"$f":"IF(ISBLANK('Rezumatul anului curent'!B16),\"\",'Rezumatul anului curent'!B16)","v":""},0,{"$f":"COUNTIF($F16:CS16, \"P\")","v":0},{"$f":"COUNTIF($F16:CS16, \"C\")","v":0}]
[{"$f":"IF(ISBLANK('Rezumatul anului curent'!A17),\"\",'Rezumatul anului curent'!A17)","v":""},{"$f":"IF(ISBLANK('Rezumatul anului curent'!B17),\"\",'Rezumatul anului curent'!B17)","v":""},0,{"$f":"COUNTIF($F17:CS17, \"P\")","v":0},{"$f":"COUNTIF($F17:CS17, \"C\")","v":0}]
[{"$f":"IF(ISBLANK('Rezumatul anului curent'!A18),\"\",'Rezumatul anului curent'!A18)","v":""},{"$f":"IF(ISBLANK('Rezumatul anului curent'!B18),\"\",'Rezumatul anului curent'!B18)","v":""},0,{"$f":"COUNTIF($F18:CS18, \"P\")","v":0},{"$f":"COUNTIF($F18:CS18, \"C\")","v":0}]
[{"$f":"IF(ISBLANK('Rezumatul anului curent'!A19),\"\",'Rezumatul anului curent'!A19)","v":""},{"$f":"IF(ISBLANK('Rezumatul anului curent'!B19),\"\",'Rezumatul anului curent'!B19)","v":""},0,{"$f":"COUNTIF($F19:CS19, \"P\")","v":0},{"$f":"COUNTIF($F19:CS19, \"C\")","v":0}]
[{"$f":"IF(ISBLANK('Rezumatul anului curent'!A20),\"\",'Rezumatul anului curent'!A20)","v":""},{"$f":"IF(ISBLANK('Rezumatul anului curent'!B20),\"\",'Rezumatul anului curent'!B20)","v":""},0,{"$f":"COUNTIF($F20:CS20, \"P\")","v":0},{"$f":"COUNTIF($F20:CS20, \"C\")","v":0}]
[{"$f":"IF(ISBLANK('Rezumatul anului curent'!A21),\"\",'Rezumatul anului curent'!A21)","v":""},{"$f":"IF(ISBLANK('Rezumatul anului curent'!B21),\"\",'Rezumatul anului curent'!B21)","v":""},0,{"$f":"COUNTIF($F21:CS21, \"P\")","v":0},{"$f":"COUNTIF($F21:CS21, \"C\")","v":0}]
[{"$f":"IF(ISBLANK('Rezumatul anului curent'!A22),\"\",'Rezumatul anului curent'!A22)","v":""},{"$f":"IF(ISBLANK('Rezumatul anului curent'!B22),\"\",'Rezumatul anului curent'!B22)","v":""},0,{"$f":"COUNTIF($F22:CS22, \"P\")","v":0},{"$f":"COUNTIF($F22:CS22, \"C\")","v":0}]
[{"$f":"IF(ISBLANK('Rezumatul anului curent'!A23),\"\",'Rezumatul anului curent'!A23)","v":""},{"$f":"IF(ISBLANK('Rezumatul anului curent'!B23),\"\",'Rezumatul anului curent'!B23)","v":""},0,{"$f":"COUNTIF($F23:CS23, \"P\")","v":0},{"$f":"COUNTIF($F23:CS23, \"C\")","v":0}]
[{"$f":"IF(ISBLANK('Rezumatul anului curent'!A24),\"\",'Rezumatul anului curent'!A24)","v":""},{"$f":"IF(ISBLANK('Rezumatul anului curent'!B24),\"\",'Rezumatul anului curent'!B24)","v":""},0,{"$f":"COUNTIF($F24:CS24, \"P\")","v":0},{"$f":"COUNTIF($F24:CS24, \"C\")","v":0}]
[{"$f":"IF(ISBLANK('Rezumatul anului curent'!A25),\"\",'Rezumatul anului curent'!A25)","v":""},{"$f":"IF(ISBLANK('Rezumatul anului curent'!B25),\"\",'Rezumatul anului curent'!B25)","v":""},0,{"$f":"COUNTIF($F25:CS25, \"P\")","v":0},{"$f":"COUNTIF($F25:CS25, \"C\")","v":0}]
[{"$f":"IF(ISBLANK('Rezumatul anului curent'!A26),\"\",'Rezumatul anului curent'!A26)","v":""},{"$f":"IF(ISBLANK('Rezumatul anului curent'!B26),\"\",'Rezumatul anului curent'!B26)","v":""},0,{"$f":"COUNTIF($F26:CS26, \"P\")","v":0},{"$f":"COUNTIF($F26:CS26, \"C\")","v":0}]
[{"$f":"IF(ISBLANK('Rezumatul anului curent'!A27),\"\",'Rezumatul anului curent'!A27)","v":""},{"$f":"IF(ISBLANK('Rezumatul anului curent'!B27),\"\",'Rezumatul anului curent'!B27)","v":""},0,{"$f":"COUNTIF($F27:CS27, \"P\")","v":0},{"$f":"COUNTIF($F27:CS27, \"C\")","v":0}]
[{"$f":"IF(ISBLANK('Rezumatul anului curent'!A28),\"\",'Rezumatul anului curent'!A28)","v":""},{"$f":"IF(ISBLANK('Rezumatul anului curent'!B28),\"\",'Rezumatul anului curent'!B28)","v":""},0,{"$f":"COUNTIF($F28:CS28, \"P\")","v":0},{"$f":"COUNTIF($F28:CS28, \"C\")","v":0}]
[{"$f":"IF(ISBLANK('Rezumatul anului curent'!A29),\"\",'Rezumatul anului curent'!A29)","v":""},{"$f":"IF(ISBLANK('Rezumatul anului curent'!B29),\"\",'Rezumatul anului curent'!B29)","v":""},0,{"$f":"COUNTIF($F29:CS29, \"P\")","v":0},{"$f":"COUNTIF($F29:CS29, \"C\")","v":0}]
[{"$f":"IF(ISBLANK('Rezumatul anului curent'!A30),\"\",'Rezumatul anului curent'!A30)","v":""},{"$f":"IF(ISBLANK('Rezumatul anului curent'!B30),\"\",'Rezumatul anului curent'!B30)","v":""},0,{"$f":"COUNTIF($F30:CS30, \"P\")","v":0},{"$f":"COUNTIF($F30:CS30, \"C\")","v":0}]
[{"$f":"IF(ISBLANK('Rezumatul anului curent'!A31),\"\",'Rezumatul anului curent'!A31)","v":""},{"$f":"IF(ISBLANK('Rezumatul anului curent'!B31),\"\",'Rezumatul anului curent'!B31)","v":""},0,{"$f":"COUNTIF($F31:CS31, \"P\")","v":0},{"$f":"COUNTIF($F31:CS31, \"C\")","v":0}]
[{"$f":"IF(ISBLANK('Rezumatul anului curent'!A32),\"\",'Rezumatul anului curent'!A32)","v":""},{"$f":"IF(ISBLANK('Rezumatul anului curent'!B32),\"\",'Rezumatul anului curent'!B32)","v":""},0,{"$f":"COUNTIF($F32:CS32, \"P\")","v":0},{"$f":"COUNTIF($F32:CS32, \"C\")","v":0}]
[{"$f":"IF(ISBLANK('Rezumatul anului curent'!A33),\"\",'Rezumatul anului curent'!A33)","v":""},{"$f":"IF(ISBLANK('Rezumatul anului curent'!B33),\"\",'Rezumatul anului curent'!B33)","v":""},0,{"$f":"COUNTIF($F33:CS33, \"P\")","v":0},{"$f":"COUNTIF($F33:CS33, \"C\")","v":0}]
[{"$f":"IF(ISBLANK('Rezumatul anului curent'!A34),\"\",'Rezumatul anului curent'!A34)","v":""},{"$f":"IF(ISBLANK('Rezumatul anului curent'!B34),\"\",'Rezumatul anului curent'!B34)","v":""},0,{"$f":"COUNTIF($F34:CS34, \"P\")","v":0},{"$f":"COUNTIF($F34:CS34, \"C\")","v":0}]
[{"$f":"IF(ISBLANK('Rezumatul anului curent'!A35),\"\",'Rezumatul anului curent'!A35)","v":""},{"$f":"IF(ISBLANK('Rezumatul anului curent'!B35),\"\",'Rezumatul anului curent'!B35)","v":""},0,{"$f":"COUNTIF($F35:CS35, \"P\")","v":0},{"$f":"COUNTIF($F35:CS35, \"C\")","v":0}]
[{"$f":"IF(ISBLANK('Rezumatul anului curent'!A36),\"\",'Rezumatul anului curent'!A36)","v":""},{"$f":"IF(ISBLANK('Rezumatul anului curent'!B36),\"\",'Rezumatul anului curent'!B36)","v":""},0,{"$f":"COUNTIF($F36:CS36, \"P\")","v":0},{"$f":"COUNTIF($F36:CS36, \"C\")","v":0}]