{"text_format":"3","workbook":"xlsx","n_sheets":4,"sheets":["INÍCIO","PARÂMETROS DO PROJETO","DETALHES DO PROJETO","TOTAIS DO PROJETO"],"not_rendered":{"charts":2,"defined_names":3,"pivot_tables":1},"read":"whole","date_system":"1900"}

{"sheet":"INÍCIO","index":0,"n_rows":7,"n_cols":2,"rows_kept":7}
[null,"ACERCA DESTE MODELO"]
[null,"Controle os Parâmetros do Projeto, os Detalhes do Projeto e os Totais do Projeto neste livro de Controlador de Planeamento de Eventos."]
[null,"Introduza informações na folha de cálculo Parâmetros do Projeto para atualizar gráficos de colunas e a folha de cálculo Detalhes do Projeto. A tabela dinâmica na folha de cálculo Totais do Projeto é atualizada automaticamente."]
[null,"Introduza o Nome da Empresa na folha de cálculo Parâmetros e essa informação será atualizada automaticamente nas outras folhas de cálculo."]
[null,"Nota:  "]
[null,"Existem instruções adicionais na coluna A de cada folha de cálculo no livro CONTROLADOR DE PLANEAMENTO DE EVENTOS. O texto encontra-se intencionalmente oculto. Para remover o texto, selecione a coluna A e, em seguida, selecione Eliminar. Para mostrar o texto, selecione a coluna A e, em seguida, mude a cor do tipo de letra."]
{"$rows_left_out":2}
{"sheet":"PARÂMETROS DO PROJETO","index":1,"n_rows":19,"n_cols":9,"rows_kept":19,"merged":[[23,1,42,3]]}
[null,"Nome da Empresa"]
[null,"Controlador de Projetos de Gestão de Eventos"]
[null,{"$f":"B1&\" Confidencial\"","v":"Nome da Empresa Confidencial"}]
[null,"As células sombreadas são calculadas automaticamente. Não precisa de introduzir dados nas mesmas."]
[null,"TIPO DE PROJETO","GESTOR DE CONTAS","GESTOR DE PROJETOS","GESTOR DE ESTRATÉGIAS","ESPECIALISTA EM DESIGN","EQUIPA DO EVENTO","SERVIÇOS ADMINISTRATIVOS","Total"]
[null,"Desenvolvimento da estratégia para eventos",{"v":0.2,"d":"20%"},{"v":0.1,"d":"10%"},{"v":0.6,"d":"60%"},{"v":0,"d":"0%"},{"v":0,"d":"0%"},{"v":0.1,"d":"10%"},{"$f":"SUM(Parâmetros[[#This Row],[GESTOR DE CONTAS]:[SERVIÇOS ADMINISTRATIVOS]])","v":{"v":1,"d":"100%"}}]
{"$rows_left_out":14}
{"sheet":"DETALHES DO PROJETO","index":2,"n_rows":10,"n_cols":23,"rows_kept":10}
[null,{"$f":"'PARÂMETROS DO PROJETO'!B1","v":"Nome da Empresa"}]
[null,"Controlador de Projetos de Gestão de Eventos"]
[null,{"$f":"'PARÂMETROS DO PROJETO'!B3","v":"Nome da Empresa Confidencial"}]
["Introduza as informações na tabela Detalhes do Projeto que começa na célula à direita.\nINFORMAÇÕES\nPara adicionar uma linha na tabela à direita, selecione a última célula no canto inferior direito do corpo da tabela (não a linha de totais) e prima a Tecla de Tabulação ou Shift+F10 onde pretende inserir a linha e selecione Inserir | Linhas da Tabela Acima/Abaixo.\nCertifique-se de que todas as linhas não utilizadas são eliminadas, dado que a tabela dinâmica TOTAIS DO PROJETO irá utilizar todas as células da tabela. Se não forem eliminadas, serão obtidos resultados incorretos.","NOME DO PROJETO","TIPO DE PROJETO","INÍCIO ESTIMADO","FIM ESTIMADO","INÍCIO REAL","FIM REAL","TRABALHO ESTIMADO","TRABALHO REAL","DURAÇÃO ESTIMADA","DURAÇÃO REAL","GESTOR DE CONTAS","GESTOR DE PROJETOS","GESTOR DE ESTRATÉGIAS","ESPECIALISTA EM DESIGN","EQUIPA DO EVENTO","SERVIÇOS ADMINISTRATIVOS","GESTOR DE CONTAS ","GESTOR DE PROJETOS ","GESTOR DE ESTRATÉGIAS ","ESPECIALISTA EM DESIGN ","EQUIPA DO EVENTO ","EQUIPA ADMINISTRATIVA "]
[null,"Projeto 1","Desenvolvimento da estratégia para eventos",{"$f":"DATE(YEAR(TODAY()),6,9)","v":"2022-06-09"},{"$f":" DATE(YEAR(TODAY()),8,7)","v":"2022-08-07"},{"$f":"DATE(YEAR(TODAY()),6,29)","v":"2022-06-29"},{"$f":"DATE(YEAR(TODAY()),9,3)","v":"2022-09-03"},200,220,{"$f":"DAYS360(DetalhesDoProjeto[[#This Row],[INÍCIO ESTIMADO]],DetalhesDoProjeto[[#This Row],[FIM ESTIMADO]],FALSE)","v":58},{"$f":"DAYS360(DetalhesDoProjeto[[#This Row],[INÍCIO REAL]],DetalhesDoProjeto[[#This Row],[FIM REAL]],FALSE)","v":64},{"$f":"INDEX(Parâmetros[],MATCH(DetalhesDoProjeto[[#This Row],[TIPO DE PROJETO]],Parâmetros[TIPO DE PROJETO],0),MATCH(DetalhesDoProjeto[[#Headers],[GESTOR DE CONTAS]],Parâmetros[#Headers],0))*INDEX('PARÂMETROS DO PROJETO'!$B$12:$H$12,1,MATCH(DetalhesDoProjeto[[#Headers],[GESTOR DE CONTAS]],Parâmetros[#Headers],0))*DetalhesDoProjeto[[#This Row],[TRABALHO ESTIMADO]]","v":{"v":7200,"d":"7,200 €"}},{"$f":"INDEX(Parâmetros[],MATCH(DetalhesDoProjeto[[#This Row],[TIPO DE PROJETO]],Parâmetros[TIPO DE PROJETO],0),MATCH(DetalhesDoProjeto[[#Headers],[GESTOR DE PROJETOS]],Parâmetros[#Headers],0))*INDEX('PARÂMETROS DO PROJETO'!$B$12:$H$12,1,MATCH(DetalhesDoProjeto[[#Headers],[GESTOR DE PROJETOS]],Parâmetros[#Headers],0))*DetalhesDoProjeto[[#This Row],[TRABALHO ESTIMADO]]","v":{"v":2400,"d":"2,400 €"}},{"$f":"INDEX(Parâmetros[],MATCH(DetalhesDoProjeto[[#This Row],[TIPO DE PROJETO]],Parâmetros[TIPO DE PROJETO],0),MATCH(DetalhesDoProjeto[[#Headers],[GESTOR DE ESTRATÉGIAS]],Parâmetros[#Headers],0))*INDEX('PARÂMETROS DO PROJETO'!$B$12:$H$12,1,MATCH(DetalhesDoProjeto[[#Headers],[GESTOR DE ESTRATÉGIAS]],Parâmetros[#Headers],0))*DetalhesDoProjeto[[#This Row],[TRABALHO ESTIMADO]]","v":{"v":18000,"d":"18,000 €"}},{"$f":"INDEX(Parâmetros[],MATCH(DetalhesDoProjeto[[#This Row],[TIPO DE PROJETO]],Parâmetros[TIPO DE PROJETO],0),MATCH(DetalhesDoProjeto[[#Headers],[ESPECIALISTA EM DESIGN]],Parâmetros[#Headers],0))*INDEX('PARÂMETROS DO PROJETO'!$B$12:$H$12,1,MATCH(DetalhesDoProjeto[[#Headers],[ESPECIALISTA EM DESIGN]],Parâmetros[#Headers],0))*DetalhesDoProjeto[[#This Row],[TRABALHO ESTIMADO]]","v":{"v":0,"d":"0 €"}},{"$f":"INDEX(Parâmetros[],MATCH(DetalhesDoProjeto[[#This Row],[TIPO DE PROJETO]],Parâmetros[TIPO DE PROJETO],0),MATCH(DetalhesDoProjeto[[#Headers],[EQUIPA DO EVENTO]],Parâmetros[#Headers],0))*INDEX('PARÂMETROS DO PROJETO'!$B$12:$H$12,1,MATCH(DetalhesDoProjeto[[#Headers],[EQUIPA DO EVENTO]],Parâmetros[#Headers],0))*DetalhesDoProjeto[[#This Row],[TRABALHO ESTIMADO]]","v":{"v":0,"d":"0 €"}},{"$f":"INDEX(Parâmetros[],MATCH(DetalhesDoProjeto[[#This Row],[TIPO DE PROJETO]],Parâmetros[TIPO DE PROJETO],0),MATCH(DetalhesDoProjeto[[#Headers],[SERVIÇOS ADMINISTRATIVOS]],Parâmetros[#Headers],0))*INDEX('PARÂMETROS DO PROJETO'!$B$12:$H$12,1,MATCH(DetalhesDoProjeto[[#Headers],[SERVIÇOS ADMINISTRATIVOS]],Parâmetros[#Headers],0))*DetalhesDoProjeto[[#This Row],[TRABALHO ESTIMADO]]","v":{"v":1200,"d":"1,200 €"}},{"$f":"INDEX(Parâmetros[],MATCH(DetalhesDoProjeto[[#This Row],[TIPO DE PROJETO]],Parâmetros[TIPO DE PROJETO],0),MATCH(DetalhesDoProjeto[[#Headers],[GESTOR DE CONTAS]],Parâmetros[#Headers],0))*INDEX('PARÂMETROS DO PROJETO'!$B$12:$H$12,1,MATCH(DetalhesDoProjeto[[#Headers],[GESTOR DE CONTAS]],Parâmetros[#Headers],0))*DetalhesDoProjeto[[#This Row],[TRABALHO REAL]]","v":{"v":7920,"d":"7,920 €"}},{"$f":"INDEX(Parâmetros[],MATCH(DetalhesDoProjeto[[#This Row],[TIPO DE PROJETO]],Parâmetros[TIPO DE PROJETO],0),MATCH(DetalhesDoProjeto[[#Headers],[GESTOR DE PROJETOS]],Parâmetros[#Headers],0))*INDEX('PARÂMETROS DO PROJETO'!$B$12:$H$12,1,MATCH(DetalhesDoProjeto[[#Headers],[GESTOR DE PROJETOS]],Parâmetros[#Headers],0))*DetalhesDoProjeto[[#This Row],[TRABALHO REAL]]","v":{"v":2640,"d":"2,640 €"}},{"$f":"INDEX(Parâmetros[],MATCH(DetalhesDoProjeto[[#This Row],[TIPO DE PROJETO]],Parâmetros[TIPO DE PROJETO],0),MATCH(DetalhesDoProjeto[[#Headers],[GESTOR DE ESTRATÉGIAS]],Parâmetros[#Headers],0))*INDEX('PARÂMETROS DO PROJETO'!$B$12:$H$12,1,MATCH(DetalhesDoProjeto[[#Headers],[GESTOR DE ESTRATÉGIAS]],Parâmetros[#Headers],0))*DetalhesDoProjeto[[#This Row],[TRABALHO REAL]]","v":{"v":19800,"d":"19,800 €"}},{"$f":"INDEX(Parâmetros[],MATCH(DetalhesDoProjeto[[#This Row],[TIPO DE PROJETO]],Parâmetros[TIPO DE PROJETO],0),MATCH(DetalhesDoProjeto[[#Headers],[ESPECIALISTA EM DESIGN]],Parâmetros[#Headers],0))*INDEX('PARÂMETROS DO PROJETO'!$B$12:$H$12,1,MATCH(DetalhesDoProjeto[[#Headers],[ESPECIALISTA EM DESIGN]],Parâmetros[#Headers],0))*DetalhesDoProjeto[[#This Row],[TRABALHO REAL]]","v":{"v":0,"d":"0 €"}},{"$f":"INDEX(Parâmetros[],MATCH(DetalhesDoProjeto[[#This Row],[TIPO DE PROJETO]],Parâmetros[TIPO DE PROJETO],0),MATCH(DetalhesDoProjeto[[#Headers],[EQUIPA DO EVENTO]],Parâmetros[#Headers],0))*INDEX('PARÂMETROS DO PROJETO'!$B$12:$H$12,1,MATCH(DetalhesDoProjeto[[#Headers],[EQUIPA DO EVENTO]],Parâmetros[#Headers],0))*DetalhesDoProjeto[[#This Row],[TRABALHO REAL]]","v":{"v":0,"d":"0 €"}},{"$f":"INDEX(Parâmetros[],MATCH(DetalhesDoProjeto[[#This Row],[TIPO DE PROJETO]],Parâmetros[TIPO DE PROJETO],0),MATCH(DetalhesDoProjeto[[#Headers],[SERVIÇOS ADMINISTRATIVOS]],Parâmetros[#Headers],0))*INDEX('PARÂMETROS DO PROJETO'!$B$12:$H$12,1,MATCH(DetalhesDoProjeto[[#Headers],[SERVIÇOS ADMINISTRATIVOS]],Parâmetros[#Headers],0))*DetalhesDoProjeto[[#This Row],[TRABALHO REAL]]","v":{"v":1320,"d":"1,320 €"}}]
[null,"Projeto 2","Planeamento de eventos",{"$f":"DATE(YEAR(TODAY())+1,6,25)","v":"2023-06-25"},{"$f":"DATE(YEAR(TODAY())+1,7,27)","v":"2023-07-27"},{"$f":"DATE(YEAR(TODAY()),7,15)","v":"2022-07-15"},{"$f":"DATE(YEAR(TODAY())+1,8,25)","v":"2023-08-25"},400,390,{"$f":"DAYS360(DetalhesDoProjeto[[#This Row],[INÍCIO ESTIMADO]],DetalhesDoProjeto[[#This Row],[FIM ESTIMADO]],FALSE)","v":32},{"$f":"DAYS360(DetalhesDoProjeto[[#This Row],[INÍCIO REAL]],DetalhesDoProjeto[[#This Row],[FIM REAL]],FALSE)","v":400},{"$f":"INDEX(Parâmetros[],MATCH(DetalhesDoProjeto[[#This Row],[TIPO DE PROJETO]],Parâmetros[TIPO DE PROJETO],0),MATCH(DetalhesDoProjeto[[#Headers],[GESTOR DE CONTAS]],Parâmetros[#Headers],0))*INDEX('PARÂMETROS DO PROJETO'!$B$12:$H$12,1,MATCH(DetalhesDoProjeto[[#Headers],[GESTOR DE CONTAS]],Parâmetros[#Headers],0))*DetalhesDoProjeto[[#This Row],[TRABALHO ESTIMADO]]","v":{"v":14400,"d":"14,400 €"}},{"$f":"INDEX(Parâmetros[],MATCH(DetalhesDoProjeto[[#This Row],[TIPO DE PROJETO]],Parâmetros[TIPO DE PROJETO],0),MATCH(DetalhesDoProjeto[[#Headers],[GESTOR DE PROJETOS]],Parâmetros[#Headers],0))*INDEX('PARÂMETROS DO PROJETO'!$B$12:$H$12,1,MATCH(DetalhesDoProjeto[[#Headers],[GESTOR DE PROJETOS]],Parâmetros[#Headers],0))*DetalhesDoProjeto[[#This Row],[TRABALHO ESTIMADO]]","v":{"v":24000,"d":"24,000 €"}},{"$f":"INDEX(Parâmetros[],MATCH(DetalhesDoProjeto[[#This Row],[TIPO DE PROJETO]],Parâmetros[TIPO DE PROJETO],0),MATCH(DetalhesDoProjeto[[#Headers],[GESTOR DE ESTRATÉGIAS]],Parâmetros[#Headers],0))*INDEX('PARÂMETROS DO PROJETO'!$B$12:$H$12,1,MATCH(DetalhesDoProjeto[[#Headers],[GESTOR DE ESTRATÉGIAS]],Parâmetros[#Headers],0))*DetalhesDoProjeto[[#This Row],[TRABALHO ESTIMADO]]","v":{"v":6000,"d":"6,000 €"}},{"$f":"INDEX(Parâmetros[],MATCH(DetalhesDoProjeto[[#This Row],[TIPO DE PROJETO]],Parâmetros[TIPO DE PROJETO],0),MATCH(DetalhesDoProjeto[[#Headers],[ESPECIALISTA EM DESIGN]],Parâmetros[#Headers],0))*INDEX('PARÂMETROS DO PROJETO'!$B$12:$H$12,1,MATCH(DetalhesDoProjeto[[#Headers],[ESPECIALISTA EM DESIGN]],Parâmetros[#Headers],0))*DetalhesDoProjeto[[#This Row],[TRABALHO ESTIMADO]]","v":{"v":4000,"d":"4,000 €"}},{"$f":"INDEX(Parâmetros[],MATCH(DetalhesDoProjeto[[#This Row],[TIPO DE PROJETO]],Parâmetros[TIPO DE PROJETO],0),MATCH(DetalhesDoProjeto[[#Headers],[EQUIPA DO EVENTO]],Parâmetros[#Headers],0))*INDEX('PARÂMETROS DO PROJETO'!$B$12:$H$12,1,MATCH(DetalhesDoProjeto[[#Headers],[EQUIPA DO EVENTO]],Parâmetros[#Headers],0))*DetalhesDoProjeto[[#This Row],[TRABALHO ESTIMADO]]","v":{"v":0,"d":"0 €"}},{"$f":"INDEX(Parâmetros[],MATCH(DetalhesDoProjeto[[#This Row],[TIPO DE PROJETO]],Parâmetros[TIPO DE PROJETO],0),MATCH(DetalhesDoProjeto[[#Headers],[SERVIÇOS ADMINISTRATIVOS]],Parâmetros[#Headers],0))*INDEX('PARÂMETROS DO PROJETO'!$B$12:$H$12,1,MATCH(DetalhesDoProjeto[[#Headers],[SERVIÇOS ADMINISTRATIVOS]],Parâmetros[#Headers],0))*DetalhesDoProjeto[[#This Row],[TRABALHO ESTIMADO]]","v":{"v":2400,"d":"2,400 €"}},{"$f":"INDEX(Parâmetros[],MATCH(DetalhesDoProjeto[[#This Row],[TIPO DE PROJETO]],Parâmetros[TIPO DE PROJETO],0),MATCH(DetalhesDoProjeto[[#Headers],[GESTOR DE CONTAS]],Parâmetros[#Headers],0))*INDEX('PARÂMETROS DO PROJETO'!$B$12:$H$12,1,MATCH(DetalhesDoProjeto[[#Headers],[GESTOR DE CONTAS]],Parâmetros[#Headers],0))*DetalhesDoProjeto[[#This Row],[TRABALHO REAL]]","v":{"v":14040,"d":"14,040 €"}},{"$f":"INDEX(Parâmetros[],MATCH(DetalhesDoProjeto[[#This Row],[TIPO DE PROJETO]],Parâmetros[TIPO DE PROJETO],0),MATCH(DetalhesDoProjeto[[#Headers],[GESTOR DE PROJETOS]],Parâmetros[#Headers],0))*INDEX('PARÂMETROS DO PROJETO'!$B$12:$H$12,1,MATCH(DetalhesDoProjeto[[#Headers],[GESTOR DE PROJETOS]],Parâmetros[#Headers],0))*DetalhesDoProjeto[[#This Row],[TRABALHO REAL]]","v":{"v":23400,"d":"23,400 €"}},{"$f":"INDEX(Parâmetros[],MATCH(DetalhesDoProjeto[[#This Row],[TIPO DE PROJETO]],Parâmetros[TIPO DE PROJETO],0),MATCH(DetalhesDoProjeto[[#Headers],[GESTOR DE ESTRATÉGIAS]],Parâmetros[#Headers],0))*INDEX('PARÂMETROS DO PROJETO'!$B$12:$H$12,1,MATCH(DetalhesDoProjeto[[#Headers],[GESTOR DE ESTRATÉGIAS]],Parâmetros[#Headers],0))*DetalhesDoProjeto[[#This Row],[TRABALHO REAL]]","v":{"v":5850,"d":"5,850 €"}},{"$f":"INDEX(Parâmetros[],MATCH(DetalhesDoProjeto[[#This Row],[TIPO DE PROJETO]],Parâmetros[TIPO DE PROJETO],0),MATCH(DetalhesDoProjeto[[#Headers],[ESPECIALISTA EM DESIGN]],Parâmetros[#Headers],0))*INDEX('PARÂMETROS DO PROJETO'!$B$12:$H$12,1,MATCH(DetalhesDoProjeto[[#Headers],[ESPECIALISTA EM DESIGN]],Parâmetros[#Headers],0))*DetalhesDoProjeto[[#This Row],[TRABALHO REAL]]","v":{"v":3900,"d":"3,900 €"}},{"$f":"INDEX(Parâmetros[],MATCH(DetalhesDoProjeto[[#This Row],[TIPO DE PROJETO]],Parâmetros[TIPO DE PROJETO],0),MATCH(DetalhesDoProjeto[[#Headers],[EQUIPA DO EVENTO]],Parâmetros[#Headers],0))*INDEX('PARÂMETROS DO PROJETO'!$B$12:$H$12,1,MATCH(DetalhesDoProjeto[[#Headers],[EQUIPA DO EVENTO]],Parâmetros[#Headers],0))*DetalhesDoProjeto[[#This Row],[TRABALHO REAL]]","v":{"v":0,"d":"0 €"}},{"$f":"INDEX(Parâmetros[],MATCH(DetalhesDoProjeto[[#This Row],[TIPO DE PROJETO]],Parâmetros[TIPO DE PROJETO],0),MATCH(DetalhesDoProjeto[[#Headers],[SERVIÇOS ADMINISTRATIVOS]],Parâmetros[#Headers],0))*INDEX('PARÂMETROS DO PROJETO'!$B$12:$H$12,1,MATCH(DetalhesDoProjeto[[#Headers],[SERVIÇOS ADMINISTRATIVOS]],Parâmetros[#Headers],0))*DetalhesDoProjeto[[#This Row],[TRABALHO REAL]]","v":{"v":2340,"d":"2,340 €"}}]
{"$rows_left_out":5}
{"sheet":"TOTAIS DO PROJETO","index":3,"n_rows":10,"n_cols":14,"rows_kept":10}
[null,{"$f":"'PARÂMETROS DO PROJETO'!B1","v":"Nome da Empresa"}]
[null,"Controlador de Projetos de Gestão de Eventos"]
[null,{"$f":"'PARÂMETROS DO PROJETO'!B3","v":"Nome da Empresa Confidencial"}]
["A tabela dinâmica que começa na célula à direita é atualizada automaticamente.\nINFORMAÇÕES\nPara atualizar a tabela dinâmica à direita, selecione-a (qualquer célula da tabela dinâmica) e no separador Analisar das Ferramentas de Tabela Dinâmica do friso, selecione Atualizar. Em alternativa, prima Shift+F10 em qualquer célula da tabela dinâmica e, em seguida, selecione Atualizar.","NOME DO PROJETO","GESTOR DE CONTAS (ESTIMATIVA)","GESTOR DE PROJETOS (ESTIMATIVA)","GESTOR DE ESTRATÉGIAS (ESTIMATIVA)","ESPECIALISTA EM DESIGN (ESTIMATIVA)","EQUIPA DO EVENTO (ESTIMATIVA)","SERVIÇOS ADMINISTRATIVOS (ESTIMATIVA)","GESTOR DE CONTAS (REAL)","GESTOR DE PROJETOS (REAL)","GESTOR DE ESTRATÉGIAS (REAL)","ESPECIALISTA EM DESIGN (REAL)","EQUIPA DO EVENTO (REAL)","SERVIÇOS ADMINISTRATIVOS (REAL)"]
[null,"Projeto 1",{"v":7200,"d":"7,200.00 €"},{"v":2400,"d":"2,400.00 €"},{"v":18000,"d":"18,000.00 €"},{"v":0,"d":"0.00 €"},{"v":0,"d":"0.00 €"},{"v":1200,"d":"1,200.00 €"},{"v":7920,"d":"7,920.00 €"},{"v":2640,"d":"2,640.00 €"},{"v":19800,"d":"19,800.00 €"},{"v":0,"d":"0.00 €"},{"v":0,"d":"0.00 €"},{"v":1320,"d":"1,320.00 €"}]
[null,"Projeto 2",{"v":14400,"d":"14,400.00 €"},{"v":24000,"d":"24,000.00 €"},{"v":6000,"d":"6,000.00 €"},{"v":4000,"d":"4,000.00 €"},{"v":0,"d":"0.00 €"},{"v":2400,"d":"2,400.00 €"},{"v":14040,"d":"14,040.00 €"},{"v":23400,"d":"23,400.00 €"},{"v":5850,"d":"5,850.00 €"},{"v":3900,"d":"3,900.00 €"},{"v":0,"d":"0.00 €"},{"v":2340,"d":"2,340.00 €"}]
{"$rows_left_out":4}