{"text_format":"3","workbook":"xlsx","n_sheets":3,"sheets":["Dados de Vendas","Relatório de Vendas","Inventário"],"not_rendered":{"defined_names":10,"pivot_tables":1},"read":"whole","date_system":"1900"}

{"sheet":"Dados de Vendas","index":0,"n_rows":13,"n_cols":11,"rows_kept":13}
[]
[null,"REGISTO DIÁRIO DE VENDAS A DINHEIRO"]
[]
[]
[]
[{"$nulls":10}," "]
[{"$nulls":10}," "]
[null,"DATA","HORA","NÚMERO DA TRANSAÇÃO","REFERÊNCIA/NÚMERO DO PRODUTO","DESCRIÇÃO","VOLUME DE VENDAS","% DE IMPOSTO","IMPOSTO DE VENDAS","Total"]
[null,"2012-02-01","10:30:00",1001,90001,{"$f":"IFERROR(IF(ISNA(VLOOKUP(tabDadosDeVendas[[#This Row],[REFERÊNCIA/NÚMERO DO PRODUTO]],tblInventário[],2,0)),\"\",VLOOKUP(tabDadosDeVendas[[#This Row],[REFERÊNCIA/NÚMERO DO PRODUTO]],tblInventário[],2,0)),\"Nenhuma descrição encontrada\")","v":"Cobertor"},{"v":74.95,"d":"74.95 €"},{"v":0.05,"d":"5.00%"},{"$f":"tabDadosDeVendas[[#This Row],[VOLUME DE VENDAS]]*tabDadosDeVendas[[#This Row],[% DE IMPOSTO]]","v":{"v":3.7475000000000005,"d":"3.75 €"}},{"$f":"tabDadosDeVendas[[#This Row],[VOLUME DE VENDAS]]+tabDadosDeVendas[[#This Row],[IMPOSTO DE VENDAS]]","v":{"v":78.6975,"d":"78.70 €"}}]
[null,"2012-02-01","10:33:00",1002,90023,{"$f":"IFERROR(IF(ISNA(VLOOKUP(tabDadosDeVendas[[#This Row],[REFERÊNCIA/NÚMERO DO PRODUTO]],tblInventário[],2,0)),\"\",VLOOKUP(tabDadosDeVendas[[#This Row],[REFERÊNCIA/NÚMERO DO PRODUTO]],tblInventário[],2,0)),\"Nenhuma descrição encontrada\")","v":"Toalha de mesa, 15 cm de diâmetro"},{"v":34.99,"d":"34.99 €"},{"v":0.05,"d":"5.00%"},{"$f":"tabDadosDeVendas[[#This Row],[VOLUME DE VENDAS]]*tabDadosDeVendas[[#This Row],[% DE IMPOSTO]]","v":{"v":1.7495000000000003,"d":"1.75 €"}},{"$f":"tabDadosDeVendas[[#This Row],[VOLUME DE VENDAS]]+tabDadosDeVendas[[#This Row],[IMPOSTO DE VENDAS]]","v":{"v":36.7395,"d":"36.74 €"}}]
[null,"2012-02-01","10:45:00",1003,90005,{"$f":"IFERROR(IF(ISNA(VLOOKUP(tabDadosDeVendas[[#This Row],[REFERÊNCIA/NÚMERO DO PRODUTO]],tblInventário[],2,0)),\"\",VLOOKUP(tabDadosDeVendas[[#This Row],[REFERÊNCIA/NÚMERO DO PRODUTO]],tblInventário[],2,0)),\"Nenhuma descrição encontrada\")","v":"Prato redondo"},{"v":55.95,"d":"55.95 €"},{"v":0.05,"d":"5.00%"},{"$f":"tabDadosDeVendas[[#This Row],[VOLUME DE VENDAS]]*tabDadosDeVendas[[#This Row],[% DE IMPOSTO]]","v":{"v":2.7975000000000003,"d":"2.80 €"}},{"$f":"tabDadosDeVendas[[#This Row],[VOLUME DE VENDAS]]+tabDadosDeVendas[[#This Row],[IMPOSTO DE VENDAS]]","v":{"v":58.7475,"d":"58.75 €"}}]
[null,"2012-02-01","10:55:00",1004,90004,{"$f":"IFERROR(IF(ISNA(VLOOKUP(tabDadosDeVendas[[#This Row],[REFERÊNCIA/NÚMERO DO PRODUTO]],tblInventário[],2,0)),\"\",VLOOKUP(tabDadosDeVendas[[#This Row],[REFERÊNCIA/NÚMERO DO PRODUTO]],tblInventário[],2,0)),\"Nenhuma descrição encontrada\")","v":"Prato quadrado"},{"v":2.95,"d":"2.95 €"},{"v":0.05,"d":"5.00%"},{"$f":"tabDadosDeVendas[[#This Row],[VOLUME DE VENDAS]]*tabDadosDeVendas[[#This Row],[% DE IMPOSTO]]","v":{"v":0.14750000000000002,"d":"0.15 €"}},{"$f":"tabDadosDeVendas[[#This Row],[VOLUME DE VENDAS]]+tabDadosDeVendas[[#This Row],[IMPOSTO DE VENDAS]]","v":{"v":3.0975,"d":"3.10 €"}}]
[null,"2012-02-01","11:45:00",1005,90002,{"$f":"IFERROR(IF(ISNA(VLOOKUP(tabDadosDeVendas[[#This Row],[REFERÊNCIA/NÚMERO DO PRODUTO]],tblInventário[],2,0)),\"\",VLOOKUP(tabDadosDeVendas[[#This Row],[REFERÊNCIA/NÚMERO DO PRODUTO]],tblInventário[],2,0)),\"Nenhuma descrição encontrada\")","v":"Almofada"},{"v":14.98,"d":"14.98 €"},{"v":0.05,"d":"5.00%"},{"$f":"tabDadosDeVendas[[#This Row],[VOLUME DE VENDAS]]*tabDadosDeVendas[[#This Row],[% DE IMPOSTO]]","v":{"v":0.7490000000000001,"d":"0.75 €"}},{"$f":"tabDadosDeVendas[[#This Row],[VOLUME DE VENDAS]]+tabDadosDeVendas[[#This Row],[IMPOSTO DE VENDAS]]","v":{"v":15.729000000000001,"d":"15.73 €"}}]

{"sheet":"Relatório de Vendas","index":1,"n_rows":14,"n_cols":7,"rows_kept":14}
[]
[null,"REGISTO DIÁRIO DE VENDAS A DINHEIRO"]
[]
[]
[]
[]
[]
[null,"REFERÊNCIA/NÚMERO DO PRODUTO","DESCRIÇÃO","DATA","VOLUME DE VENDAS ","IMPOSTO DE VENDAS ","TOTAL "]
[null,90001,"Cobertor","2012-02-01",{"v":74.95,"d":"74.95 €"},{"v":3.7475000000000005,"d":"3.75 €"},{"v":78.6975,"d":"78.70 €"}]
[null,90002,"Almofada","2012-02-01",{"v":14.98,"d":"14.98 €"},{"v":0.7490000000000001,"d":"0.75 €"},{"v":15.729000000000001,"d":"15.73 €"}]
[null,90004,"Prato quadrado","2012-02-01",{"v":2.95,"d":"2.95 €"},{"v":0.14750000000000002,"d":"0.15 €"},{"v":3.0975,"d":"3.10 €"}]
[null,90005,"Prato redondo","2012-02-01",{"v":55.95,"d":"55.95 €"},{"v":2.7975000000000003,"d":"2.80 €"},{"v":58.7475,"d":"58.75 €"}]
[null,90023,"Toalha de mesa, 15 cm de diâmetro","2012-02-01",{"v":34.99,"d":"34.99 €"},{"v":1.7495000000000003,"d":"1.75 €"},{"v":36.7395,"d":"36.74 €"}]
[null,"Total Geral",null,null,{"v":183.82000000000002,"d":"183.82 €"},{"v":9.191000000000003,"d":"9.19 €"},{"v":193.011,"d":"193.01 €"}]

{"sheet":"Inventário","index":2,"n_rows":31,"n_cols":3,"rows_kept":31}
[]
[null,"REGISTO DIÁRIO DE VENDAS A DINHEIRO"]
[]
[]
[]
[]
[]
[null,"REFERÊNCIA/NÚMERO DO PRODUTO","DESCRIÇÃO"]
[null,90001,"Cobertor"]
[null,90002,"Almofada"]
[null,90003,"Lençóis"]
[null,90004,"Prato quadrado"]
[null,90005,"Prato redondo"]
[null,90006,"Tigela, grande"]
[null,90007,"Tigela, pequena"]
[null,90008,"Prato redondo, pequeno"]
[null,90009,"Garfo, pequeno"]
[null,90010,"Garfo, grande"]
[null,90011,"Colher, pequena"]
[null,90012,"Colher, grande"]
[null,90013,"Faca de manteiga, pequena"]
[null,90014,"Faca de manteiga, grande"]
[null,90015,"Toalha de mesa, 25 x 15"]
[null,90016,"Toalha de mesa, 20 x 15"]
[null,90017,"Toalha de mesa, 20 x 20"]
[null,90018,"Toalha de mesa, 15 x 15"]
[null,90019,"Toalha de mesa, 15 x 10"]
[null,90020,"Toalha de mesa, 10 x 10"]
[null,90021,"Toalha de mesa, 25 cm de diâmetro"]
[null,90022,"Toalha de mesa, 20 cm de diâmetro"]
[null,90023,"Toalha de mesa, 15 cm de diâmetro"]