{"text_format":"3","workbook":"xlsx","n_sheets":5,"sheets":["Resumo do Ano","1.º T","2.º T","3.º T","4.º T"],"not_rendered":{"defined_names":12},"read":"whole","date_system":"1900"}

{"sheet":"Resumo do Ano","index":0,"n_rows":36,"n_cols":12,"rows_kept":36,"merged":[[3,0,3,6]]}
["Nome da Empresa"]
["Registo de Assiduidade, Resumo do Ano"]
["Data"]
[{"$f":"Nome_da_Empresa","v":"Nome da Empresa"},{"$nulls":6},"CONFIDENCIAL"]
["Apelido","Nome Próprio","Férias","Folga","Licença por Doença","NISS","Cargo","Supervisor","Data da Contratação","Comentários","Dias de Férias \npor Ano","Dias de Férias \nRestantes"]
["Apelido","Nome Próprio",{"$f":"SUM('1.º T:4.º T'!C6)","v":3},{"$f":"SUM('1.º T:4.º T'!D6)","v":0},{"$f":"SUM('1.º T:4.º T'!E6)","v":1},"xxxxxxxxxxx","Gestor","Nome",null,null,10,{"$f":"K6-C6","v":7}]
[null,null,{"$f":"SUM('1.º T:4.º T'!C7)","v":0},{"$f":"SUM('1.º T:4.º T'!D7)","v":0},{"$f":"SUM('1.º T:4.º T'!E7)","v":0},{"$nulls":6},{"$f":"K7-C7","v":0}]
[null,null,{"$f":"SUM('1.º T:4.º T'!C8)","v":0},{"$f":"SUM('1.º T:4.º T'!D8)","v":0},{"$f":"SUM('1.º T:4.º T'!E8)","v":0},{"$nulls":6},0]
[null,null,{"$f":"SUM('1.º T:4.º T'!C9)","v":0},{"$f":"SUM('1.º T:4.º T'!D9)","v":0},{"$f":"SUM('1.º T:4.º T'!E9)","v":0},{"$nulls":6},0]
[null,null,{"$f":"SUM('1.º T:4.º T'!C10)","v":0},{"$f":"SUM('1.º T:4.º T'!D10)","v":0},{"$f":"SUM('1.º T:4.º T'!E10)","v":0},{"$nulls":6},0]
[null,null,{"$f":"SUM('1.º T:4.º T'!C11)","v":0},{"$f":"SUM('1.º T:4.º T'!D11)","v":0},{"$f":"SUM('1.º T:4.º T'!E11)","v":0},{"$nulls":6},0]
[null,null,{"$f":"SUM('1.º T:4.º T'!C12)","v":0},{"$f":"SUM('1.º T:4.º T'!D12)","v":0},{"$f":"SUM('1.º T:4.º T'!E12)","v":0},{"$nulls":6},0]
[null,null,{"$f":"SUM('1.º T:4.º T'!C13)","v":0},{"$f":"SUM('1.º T:4.º T'!D13)","v":0},{"$f":"SUM('1.º T:4.º T'!E13)","v":0},{"$nulls":6},0]
[null,null,{"$f":"SUM('1.º T:4.º T'!C14)","v":0},{"$f":"SUM('1.º T:4.º T'!D14)","v":0},{"$f":"SUM('1.º T:4.º T'!E14)","v":0},{"$nulls":6},0]
[null,null,{"$f":"SUM('1.º T:4.º T'!C15)","v":0},{"$f":"SUM('1.º T:4.º T'!D15)","v":0},{"$f":"SUM('1.º T:4.º T'!E15)","v":0},{"$nulls":6},0]
[null,null,{"$f":"SUM('1.º T:4.º T'!C16)","v":0},{"$f":"SUM('1.º T:4.º T'!D16)","v":0},{"$f":"SUM('1.º T:4.º T'!E16)","v":0},{"$nulls":6},0]
[null,null,{"$f":"SUM('1.º T:4.º T'!C17)","v":0},{"$f":"SUM('1.º T:4.º T'!D17)","v":0},{"$f":"SUM('1.º T:4.º T'!E17)","v":0},{"$nulls":6},0]
[null,null,{"$f":"SUM('1.º T:4.º T'!C18)","v":0},{"$f":"SUM('1.º T:4.º T'!D18)","v":0},{"$f":"SUM('1.º T:4.º T'!E18)","v":0},{"$nulls":6},0]
[null,null,{"$f":"SUM('1.º T:4.º T'!C19)","v":0},{"$f":"SUM('1.º T:4.º T'!D19)","v":0},{"$f":"SUM('1.º T:4.º T'!E19)","v":0},{"$nulls":6},0]
[null,null,{"$f":"SUM('1.º T:4.º T'!C20)","v":0},{"$f":"SUM('1.º T:4.º T'!D20)","v":0},{"$f":"SUM('1.º T:4.º T'!E20)","v":0},{"$nulls":6},0]
[null,null,{"$f":"SUM('1.º T:4.º T'!C21)","v":0},{"$f":"SUM('1.º T:4.º T'!D21)","v":0},{"$f":"SUM('1.º T:4.º T'!E21)","v":0},{"$nulls":6},0]
[null,null,{"$f":"SUM('1.º T:4.º T'!C22)","v":0},{"$f":"SUM('1.º T:4.º T'!D22)","v":0},{"$f":"SUM('1.º T:4.º T'!E22)","v":0},{"$nulls":6},0]
[null,null,{"$f":"SUM('1.º T:4.º T'!C23)","v":0},{"$f":"SUM('1.º T:4.º T'!D23)","v":0},{"$f":"SUM('1.º T:4.º T'!E23)","v":0},{"$nulls":6},0]
[null,null,{"$f":"SUM('1.º T:4.º T'!C24)","v":0},{"$f":"SUM('1.º T:4.º T'!D24)","v":0},{"$f":"SUM('1.º T:4.º T'!E24)","v":0},{"$nulls":6},0]
[null,null,{"$f":"SUM('1.º T:4.º T'!C25)","v":0},{"$f":"SUM('1.º T:4.º T'!D25)","v":0},{"$f":"SUM('1.º T:4.º T'!E25)","v":0},{"$nulls":6},0]
[null,null,{"$f":"SUM('1.º T:4.º T'!C26)","v":0},{"$f":"SUM('1.º T:4.º T'!D26)","v":0},{"$f":"SUM('1.º T:4.º T'!E26)","v":0},{"$nulls":6},0]
[null,null,{"$f":"SUM('1.º T:4.º T'!C27)","v":0},{"$f":"SUM('1.º T:4.º T'!D27)","v":0},{"$f":"SUM('1.º T:4.º T'!E27)","v":0},{"$nulls":6},0]
[null,null,{"$f":"SUM('1.º T:4.º T'!C28)","v":0},{"$f":"SUM('1.º T:4.º T'!D28)","v":0},{"$f":"SUM('1.º T:4.º T'!E28)","v":0},{"$nulls":6},0]
[null,null,{"$f":"SUM('1.º T:4.º T'!C29)","v":0},{"$f":"SUM('1.º T:4.º T'!D29)","v":0},{"$f":"SUM('1.º T:4.º T'!E29)","v":0},{"$nulls":6},0]
[null,null,{"$f":"SUM('1.º T:4.º T'!C30)","v":0},{"$f":"SUM('1.º T:4.º T'!D30)","v":0},{"$f":"SUM('1.º T:4.º T'!E30)","v":0},{"$nulls":6},0]
[null,null,{"$f":"SUM('1.º T:4.º T'!C31)","v":0},{"$f":"SUM('1.º T:4.º T'!D31)","v":0},{"$f":"SUM('1.º T:4.º T'!E31)","v":0},{"$nulls":6},0]
[null,null,{"$f":"SUM('1.º T:4.º T'!C32)","v":0},{"$f":"SUM('1.º T:4.º T'!D32)","v":0},{"$f":"SUM('1.º T:4.º T'!E32)","v":0},{"$nulls":6},0]
[null,null,{"$f":"SUM('1.º T:4.º T'!C33)","v":0},{"$f":"SUM('1.º T:4.º T'!D33)","v":0},{"$f":"SUM('1.º T:4.º T'!E33)","v":0},{"$nulls":6},0]
[null,null,{"$f":"SUM('1.º T:4.º T'!C34)","v":0},{"$f":"SUM('1.º T:4.º T'!D34)","v":0},{"$f":"SUM('1.º T:4.º T'!E34)","v":0},{"$nulls":6},0]
[null,null,{"$f":"SUM('1.º T:4.º T'!C35)","v":0},{"$f":"SUM('1.º T:4.º T'!D35)","v":0},{"$f":"SUM('1.º T:4.º T'!E35)","v":0},{"$nulls":6},0]
[null,null,{"$f":"SUM('1.º T:4.º T'!C36)","v":0},{"$f":"SUM('1.º T:4.º T'!D36)","v":0},{"$f":"SUM('1.º T:4.º T'!E36)","v":0},{"$nulls":6},0]

{"sheet":"1.º T","index":1,"n_rows":36,"n_cols":95,"rows_kept":36,"merged":[[3,0,3,6]]}
[{"$f":"Nome_da_Empresa","v":"Nome da Empresa"}]
["Registo de Assiduidade, 1.º Trimestre"]
["Data"]
[{"$f":"Nome_da_Empresa","v":"Nome da Empresa"},{"$nulls":6},"CONFIDENCIAL"]
["Apelido","Nome Próprio","Férias","Folga","Licença por Doença","01/01","02/01","03/01","04/01","05/01","06/01","07/01","08/01","09/01","10/01","11/01","12/01","13/01","14/01","15/01","16/01","17/01","18/01","19/01","20/01","21/01","22/01","23/01","24/01","25/01","26/01","27/01","28/01","29/01","30/01","31/01","01/02","02/02","03/02","04/02","05/02","06/02","07/02","08/02","09/02","10/02","11/02","12/02","13/02","14/02","15/02","16/02","17/02","18/02","19/02","20/02","21/02","22/02","23/02","24/02","25/02","26/02","27/02","28/02","01/03","02/03","03/03","04/03","05/03","06/03","07/03","08/03","09/03","10/03","11/03","12/03","13/03","14/03","15/03","16/03","17/03","18/03","19/03","20/03","21/03","22/03","23/03","24/03","25/03","26/03","27/03","28/03","29/03","30/03","31/03"]
[{"$f":"IF(ISBLANK('Resumo do Ano'!A6),\"\",'Resumo do Ano'!A6)","v":"Apelido"},{"$f":"IF(ISBLANK('Resumo do Ano'!B6),\"\",'Resumo do Ano'!B6)","v":"Nome Próprio"},{"$f":"COUNTIF($F6:$CQ6, \"F\")","v":3},{"$f":"COUNTIF($F6:$CQ6, \"Fg\")","v":0},{"$f":"COUNTIF($F6:$CQ6, \"LD\")","v":1},"F","F","F",{"$nulls":4},"LD"]
[{"$f":"IF(ISBLANK('Resumo do Ano'!A7),\"\",'Resumo do Ano'!A7)","v":""},{"$f":"IF(ISBLANK('Resumo do Ano'!B7),\"\",'Resumo do Ano'!B7)","v":""},0,0,0]
[{"$f":"IF(ISBLANK('Resumo do Ano'!A8),\"\",'Resumo do Ano'!A8)","v":""},{"$f":"IF(ISBLANK('Resumo do Ano'!B8),\"\",'Resumo do Ano'!B8)","v":""},0,0,0]
[{"$f":"IF(ISBLANK('Resumo do Ano'!A9),\"\",'Resumo do Ano'!A9)","v":""},{"$f":"IF(ISBLANK('Resumo do Ano'!B9),\"\",'Resumo do Ano'!B9)","v":""},0,0,0]
[{"$f":"IF(ISBLANK('Resumo do Ano'!A10),\"\",'Resumo do Ano'!A10)","v":""},{"$f":"IF(ISBLANK('Resumo do Ano'!B10),\"\",'Resumo do Ano'!B10)","v":""},0,0,0]
[{"$f":"IF(ISBLANK('Resumo do Ano'!A11),\"\",'Resumo do Ano'!A11)","v":""},{"$f":"IF(ISBLANK('Resumo do Ano'!B11),\"\",'Resumo do Ano'!B11)","v":""},0,0,0]
[{"$f":"IF(ISBLANK('Resumo do Ano'!A12),\"\",'Resumo do Ano'!A12)","v":""},{"$f":"IF(ISBLANK('Resumo do Ano'!B12),\"\",'Resumo do Ano'!B12)","v":""},0,0,0]
[{"$f":"IF(ISBLANK('Resumo do Ano'!A13),\"\",'Resumo do Ano'!A13)","v":""},{"$f":"IF(ISBLANK('Resumo do Ano'!B13),\"\",'Resumo do Ano'!B13)","v":""},0,0,0]
[{"$f":"IF(ISBLANK('Resumo do Ano'!A14),\"\",'Resumo do Ano'!A14)","v":""},{"$f":"IF(ISBLANK('Resumo do Ano'!B14),\"\",'Resumo do Ano'!B14)","v":""},0,0,0]
[{"$f":"IF(ISBLANK('Resumo do Ano'!A15),\"\",'Resumo do Ano'!A15)","v":""},{"$f":"IF(ISBLANK('Resumo do Ano'!B15),\"\",'Resumo do Ano'!B15)","v":""},0,0,0]
[{"$f":"IF(ISBLANK('Resumo do Ano'!A16),\"\",'Resumo do Ano'!A16)","v":""},{"$f":"IF(ISBLANK('Resumo do Ano'!B16),\"\",'Resumo do Ano'!B16)","v":""},0,0,0]
[{"$f":"IF(ISBLANK('Resumo do Ano'!A17),\"\",'Resumo do Ano'!A17)","v":""},{"$f":"IF(ISBLANK('Resumo do Ano'!B17),\"\",'Resumo do Ano'!B17)","v":""},0,0,0]
[{"$f":"IF(ISBLANK('Resumo do Ano'!A18),\"\",'Resumo do Ano'!A18)","v":""},{"$f":"IF(ISBLANK('Resumo do Ano'!B18),\"\",'Resumo do Ano'!B18)","v":""},0,0,0]
[{"$f":"IF(ISBLANK('Resumo do Ano'!A19),\"\",'Resumo do Ano'!A19)","v":""},{"$f":"IF(ISBLANK('Resumo do Ano'!B19),\"\",'Resumo do Ano'!B19)","v":""},0,0,0]
[{"$f":"IF(ISBLANK('Resumo do Ano'!A20),\"\",'Resumo do Ano'!A20)","v":""},{"$f":"IF(ISBLANK('Resumo do Ano'!B20),\"\",'Resumo do Ano'!B20)","v":""},0,0,0]
[{"$f":"IF(ISBLANK('Resumo do Ano'!A21),\"\",'Resumo do Ano'!A21)","v":""},{"$f":"IF(ISBLANK('Resumo do Ano'!B21),\"\",'Resumo do Ano'!B21)","v":""},0,0,0]
[{"$f":"IF(ISBLANK('Resumo do Ano'!A22),\"\",'Resumo do Ano'!A22)","v":""},{"$f":"IF(ISBLANK('Resumo do Ano'!B22),\"\",'Resumo do Ano'!B22)","v":""},0,0,0]
[{"$f":"IF(ISBLANK('Resumo do Ano'!A23),\"\",'Resumo do Ano'!A23)","v":""},{"$f":"IF(ISBLANK('Resumo do Ano'!B23),\"\",'Resumo do Ano'!B23)","v":""},0,0,0]
[{"$f":"IF(ISBLANK('Resumo do Ano'!A24),\"\",'Resumo do Ano'!A24)","v":""},{"$f":"IF(ISBLANK('Resumo do Ano'!B24),\"\",'Resumo do Ano'!B24)","v":""},0,0,0]
[{"$f":"IF(ISBLANK('Resumo do Ano'!A25),\"\",'Resumo do Ano'!A25)","v":""},{"$f":"IF(ISBLANK('Resumo do Ano'!B25),\"\",'Resumo do Ano'!B25)","v":""},0,0,0]
[{"$f":"IF(ISBLANK('Resumo do Ano'!A26),\"\",'Resumo do Ano'!A26)","v":""},{"$f":"IF(ISBLANK('Resumo do Ano'!B26),\"\",'Resumo do Ano'!B26)","v":""},0,0,0]
[{"$f":"IF(ISBLANK('Resumo do Ano'!A27),\"\",'Resumo do Ano'!A27)","v":""},{"$f":"IF(ISBLANK('Resumo do Ano'!B27),\"\",'Resumo do Ano'!B27)","v":""},0,0,0]
[{"$f":"IF(ISBLANK('Resumo do Ano'!A28),\"\",'Resumo do Ano'!A28)","v":""},{"$f":"IF(ISBLANK('Resumo do Ano'!B28),\"\",'Resumo do Ano'!B28)","v":""},0,0,0]
[{"$f":"IF(ISBLANK('Resumo do Ano'!A29),\"\",'Resumo do Ano'!A29)","v":""},{"$f":"IF(ISBLANK('Resumo do Ano'!B29),\"\",'Resumo do Ano'!B29)","v":""},0,0,0]
[{"$f":"IF(ISBLANK('Resumo do Ano'!A30),\"\",'Resumo do Ano'!A30)","v":""},{"$f":"IF(ISBLANK('Resumo do Ano'!B30),\"\",'Resumo do Ano'!B30)","v":""},0,0,0]
[{"$f":"IF(ISBLANK('Resumo do Ano'!A31),\"\",'Resumo do Ano'!A31)","v":""},{"$f":"IF(ISBLANK('Resumo do Ano'!B31),\"\",'Resumo do Ano'!B31)","v":""},0,0,0]
[{"$f":"IF(ISBLANK('Resumo do Ano'!A32),\"\",'Resumo do Ano'!A32)","v":""},{"$f":"IF(ISBLANK('Resumo do Ano'!B32),\"\",'Resumo do Ano'!B32)","v":""},0,0,0]
[{"$f":"IF(ISBLANK('Resumo do Ano'!A33),\"\",'Resumo do Ano'!A33)","v":""},{"$f":"IF(ISBLANK('Resumo do Ano'!B33),\"\",'Resumo do Ano'!B33)","v":""},0,0,0]
[{"$f":"IF(ISBLANK('Resumo do Ano'!A34),\"\",'Resumo do Ano'!A34)","v":""},{"$f":"IF(ISBLANK('Resumo do Ano'!B34),\"\",'Resumo do Ano'!B34)","v":""},0,0,0]
[{"$f":"IF(ISBLANK('Resumo do Ano'!A35),\"\",'Resumo do Ano'!A35)","v":""},{"$f":"IF(ISBLANK('Resumo do Ano'!B35),\"\",'Resumo do Ano'!B35)","v":""},0,0,0]
[{"$f":"IF(ISBLANK('Resumo do Ano'!A36),\"\",'Resumo do Ano'!A36)","v":""},{"$f":"IF(ISBLANK('Resumo do Ano'!B36),\"\",'Resumo do Ano'!B36)","v":""},0,0,0]

{"sheet":"2.º T","index":2,"n_rows":36,"n_cols":96,"rows_kept":36,"merged":[[3,0,3,6]]}
[{"$f":"Nome_da_Empresa","v":"Nome da Empresa"}]
["Registo de Assiduidade, 2.º Trimestre"]
["Data"]
[{"$f":"Nome_da_Empresa","v":"Nome da Empresa"},{"$nulls":6},"CONFIDENCIAL"]
["Apelido","Nome Próprio","Férias","Folga","Licença por Doença","01/04","02/04","03/04","04/04","05/04","06/04","07/04","08/04","09/04","10/04","11/04","12/04","13/04","14/04","15/04","16/04","17/04","18/04","19/04","20/04","21/04","22/04","23/04","24/04","25/04","26/04","27/04","28/04","29/04","30/04","01/05","02/05","03/05","04/05","05/05","06/05","07/05","08/05","09/05","10/05","11/05","12/05","13/05","14/05","15/05","16/05","17/05","18/05","19/05","20/05","21/05","22/05","23/05","24/05","25/05","26/05","27/05","28/05","29/05","30/05","31/05","01/06","02/06","03/06","04/06","05/06","06/06","07/06","08/06","09/06","10/06","11/06","12/06","13/06","14/06","15/06","16/06","17/06","18/06","19/06","20/06","21/06","22/06","23/06","24/06","25/06","26/06","27/06","28/06","29/06","30/06"]
[{"$f":"IF(ISBLANK('Resumo do Ano'!A6),\"\",'Resumo do Ano'!A6)","v":"Apelido"},{"$f":"IF(ISBLANK('Resumo do Ano'!B6),\"\",'Resumo do Ano'!B6)","v":"Nome Próprio"},{"$f":"COUNTIF($F6:$CR6, \"F\")","v":0},{"$f":"COUNTIF($F6:$CR6, \"Fg\")","v":0},{"$f":"COUNTIF($F6:$CR6, \"LD\")","v":0}]
[{"$f":"IF(ISBLANK('Resumo do Ano'!A7),\"\",'Resumo do Ano'!A7)","v":""},{"$f":"IF(ISBLANK('Resumo do Ano'!B7),\"\",'Resumo do Ano'!B7)","v":""},0,0,0]
[{"$f":"IF(ISBLANK('Resumo do Ano'!A8),\"\",'Resumo do Ano'!A8)","v":""},{"$f":"IF(ISBLANK('Resumo do Ano'!B8),\"\",'Resumo do Ano'!B8)","v":""},0,0,0]
[{"$f":"IF(ISBLANK('Resumo do Ano'!A9),\"\",'Resumo do Ano'!A9)","v":""},{"$f":"IF(ISBLANK('Resumo do Ano'!B9),\"\",'Resumo do Ano'!B9)","v":""},0,0,0]
[{"$f":"IF(ISBLANK('Resumo do Ano'!A10),\"\",'Resumo do Ano'!A10)","v":""},{"$f":"IF(ISBLANK('Resumo do Ano'!B10),\"\",'Resumo do Ano'!B10)","v":""},0,0,0]
[{"$f":"IF(ISBLANK('Resumo do Ano'!A11),\"\",'Resumo do Ano'!A11)","v":""},{"$f":"IF(ISBLANK('Resumo do Ano'!B11),\"\",'Resumo do Ano'!B11)","v":""},0,0,0]
[{"$f":"IF(ISBLANK('Resumo do Ano'!A12),\"\",'Resumo do Ano'!A12)","v":""},{"$f":"IF(ISBLANK('Resumo do Ano'!B12),\"\",'Resumo do Ano'!B12)","v":""},0,0,0]
[{"$f":"IF(ISBLANK('Resumo do Ano'!A13),\"\",'Resumo do Ano'!A13)","v":""},{"$f":"IF(ISBLANK('Resumo do Ano'!B13),\"\",'Resumo do Ano'!B13)","v":""},0,0,0]
[{"$f":"IF(ISBLANK('Resumo do Ano'!A14),\"\",'Resumo do Ano'!A14)","v":""},{"$f":"IF(ISBLANK('Resumo do Ano'!B14),\"\",'Resumo do Ano'!B14)","v":""},0,0,0]
[{"$f":"IF(ISBLANK('Resumo do Ano'!A15),\"\",'Resumo do Ano'!A15)","v":""},{"$f":"IF(ISBLANK('Resumo do Ano'!B15),\"\",'Resumo do Ano'!B15)","v":""},0,0,0]
[{"$f":"IF(ISBLANK('Resumo do Ano'!A16),\"\",'Resumo do Ano'!A16)","v":""},{"$f":"IF(ISBLANK('Resumo do Ano'!B16),\"\",'Resumo do Ano'!B16)","v":""},0,0,0]
[{"$f":"IF(ISBLANK('Resumo do Ano'!A17),\"\",'Resumo do Ano'!A17)","v":""},{"$f":"IF(ISBLANK('Resumo do Ano'!B17),\"\",'Resumo do Ano'!B17)","v":""},0,0,0]
[{"$f":"IF(ISBLANK('Resumo do Ano'!A18),\"\",'Resumo do Ano'!A18)","v":""},{"$f":"IF(ISBLANK('Resumo do Ano'!B18),\"\",'Resumo do Ano'!B18)","v":""},0,0,0]
[{"$f":"IF(ISBLANK('Resumo do Ano'!A19),\"\",'Resumo do Ano'!A19)","v":""},{"$f":"IF(ISBLANK('Resumo do Ano'!B19),\"\",'Resumo do Ano'!B19)","v":""},0,0,0]
[{"$f":"IF(ISBLANK('Resumo do Ano'!A20),\"\",'Resumo do Ano'!A20)","v":""},{"$f":"IF(ISBLANK('Resumo do Ano'!B20),\"\",'Resumo do Ano'!B20)","v":""},0,0,0]
[{"$f":"IF(ISBLANK('Resumo do Ano'!A21),\"\",'Resumo do Ano'!A21)","v":""},{"$f":"IF(ISBLANK('Resumo do Ano'!B21),\"\",'Resumo do Ano'!B21)","v":""},0,0,0]
[{"$f":"IF(ISBLANK('Resumo do Ano'!A22),\"\",'Resumo do Ano'!A22)","v":""},{"$f":"IF(ISBLANK('Resumo do Ano'!B22),\"\",'Resumo do Ano'!B22)","v":""},0,0,0]
[{"$f":"IF(ISBLANK('Resumo do Ano'!A23),\"\",'Resumo do Ano'!A23)","v":""},{"$f":"IF(ISBLANK('Resumo do Ano'!B23),\"\",'Resumo do Ano'!B23)","v":""},0,0,0]
[{"$f":"IF(ISBLANK('Resumo do Ano'!A24),\"\",'Resumo do Ano'!A24)","v":""},{"$f":"IF(ISBLANK('Resumo do Ano'!B24),\"\",'Resumo do Ano'!B24)","v":""},0,0,0]
[{"$f":"IF(ISBLANK('Resumo do Ano'!A25),\"\",'Resumo do Ano'!A25)","v":""},{"$f":"IF(ISBLANK('Resumo do Ano'!B25),\"\",'Resumo do Ano'!B25)","v":""},0,0,0]
[{"$f":"IF(ISBLANK('Resumo do Ano'!A26),\"\",'Resumo do Ano'!A26)","v":""},{"$f":"IF(ISBLANK('Resumo do Ano'!B26),\"\",'Resumo do Ano'!B26)","v":""},0,0,0]
[{"$f":"IF(ISBLANK('Resumo do Ano'!A27),\"\",'Resumo do Ano'!A27)","v":""},{"$f":"IF(ISBLANK('Resumo do Ano'!B27),\"\",'Resumo do Ano'!B27)","v":""},0,0,0]
[{"$f":"IF(ISBLANK('Resumo do Ano'!A28),\"\",'Resumo do Ano'!A28)","v":""},{"$f":"IF(ISBLANK('Resumo do Ano'!B28),\"\",'Resumo do Ano'!B28)","v":""},0,0,0]
[{"$f":"IF(ISBLANK('Resumo do Ano'!A29),\"\",'Resumo do Ano'!A29)","v":""},{"$f":"IF(ISBLANK('Resumo do Ano'!B29),\"\",'Resumo do Ano'!B29)","v":""},0,0,0]
[{"$f":"IF(ISBLANK('Resumo do Ano'!A30),\"\",'Resumo do Ano'!A30)","v":""},{"$f":"IF(ISBLANK('Resumo do Ano'!B30),\"\",'Resumo do Ano'!B30)","v":""},0,0,0]
[{"$f":"IF(ISBLANK('Resumo do Ano'!A31),\"\",'Resumo do Ano'!A31)","v":""},{"$f":"IF(ISBLANK('Resumo do Ano'!B31),\"\",'Resumo do Ano'!B31)","v":""},0,0,0]
[{"$f":"IF(ISBLANK('Resumo do Ano'!A32),\"\",'Resumo do Ano'!A32)","v":""},{"$f":"IF(ISBLANK('Resumo do Ano'!B32),\"\",'Resumo do Ano'!B32)","v":""},0,0,0]
[{"$f":"IF(ISBLANK('Resumo do Ano'!A33),\"\",'Resumo do Ano'!A33)","v":""},{"$f":"IF(ISBLANK('Resumo do Ano'!B33),\"\",'Resumo do Ano'!B33)","v":""},0,0,0]
[{"$f":"IF(ISBLANK('Resumo do Ano'!A34),\"\",'Resumo do Ano'!A34)","v":""},{"$f":"IF(ISBLANK('Resumo do Ano'!B34),\"\",'Resumo do Ano'!B34)","v":""},0,0,0]
[{"$f":"IF(ISBLANK('Resumo do Ano'!A35),\"\",'Resumo do Ano'!A35)","v":""},{"$f":"IF(ISBLANK('Resumo do Ano'!B35),\"\",'Resumo do Ano'!B35)","v":""},0,0,0]
[{"$f":"IF(ISBLANK('Resumo do Ano'!A36),\"\",'Resumo do Ano'!A36)","v":""},{"$f":"IF(ISBLANK('Resumo do Ano'!B36),\"\",'Resumo do Ano'!B36)","v":""},0,0,0]

{"sheet":"3.º T","index":3,"n_rows":36,"n_cols":97,"rows_kept":36,"merged":[[3,0,3,6]]}
[{"$f":"Nome_da_Empresa","v":"Nome da Empresa"}]
["Registo de Assiduidade, 3.º Trimestre"]
["Data"]
[{"$f":"Nome_da_Empresa","v":"Nome da Empresa"},{"$nulls":6},"CONFIDENCIAL"]
["Apelido","Nome Próprio","Férias","Folga","Licença por Doença","01/07","02/07","03/07","04/07","05/07","06/07","07/07","08/07","09/07","10/07","11/07","12/07","13/07","14/07","15/07","16/07","17/07","18/07","19/07","20/07","21/07","22/07","23/07","24/07","25/07","26/07","27/07","28/07","29/07","30/07","31/07","01/08","02/08","03/08","04/08","05/08","06/08","07/08","08/08","09/08","10/08","11/08","12/08","13/08","14/08","15/08","16/08","17/08","18/08","19/08","20/08","21/08","22/08","23/08","24/08","25/08","26/08","27/08","28/08","29/08","30/08","31/08","01/09","02/09","03/09","04/09","05/09","06/09","07/09","08/09","09/09","10/09","11/09","12/09","13/09","14/09","15/09","16/09","17/09","18/09","19/09","20/09","21/09","22/09","23/09","24/09","25/09","26/09","27/09","28/09","29/09","30/09"]
[{"$f":"IF(ISBLANK('Resumo do Ano'!A6),\"\",'Resumo do Ano'!A6)","v":"Apelido"},{"$f":"IF(ISBLANK('Resumo do Ano'!B6),\"\",'Resumo do Ano'!B6)","v":"Nome Próprio"},{"$f":"COUNTIF($F6:$CS6, \"F\")","v":0},{"$f":"COUNTIF($F6:$CS6, \"Fg\")","v":0},{"$f":"COUNTIF($F6:$CS6, \"LD\")","v":0}]
[{"$f":"IF(ISBLANK('Resumo do Ano'!A7),\"\",'Resumo do Ano'!A7)","v":""},{"$f":"IF(ISBLANK('Resumo do Ano'!B7),\"\",'Resumo do Ano'!B7)","v":""},0,0,0]
[{"$f":"IF(ISBLANK('Resumo do Ano'!A8),\"\",'Resumo do Ano'!A8)","v":""},{"$f":"IF(ISBLANK('Resumo do Ano'!B8),\"\",'Resumo do Ano'!B8)","v":""},0,0,0]
[{"$f":"IF(ISBLANK('Resumo do Ano'!A9),\"\",'Resumo do Ano'!A9)","v":""},{"$f":"IF(ISBLANK('Resumo do Ano'!B9),\"\",'Resumo do Ano'!B9)","v":""},0,0,0]
[{"$f":"IF(ISBLANK('Resumo do Ano'!A10),\"\",'Resumo do Ano'!A10)","v":""},{"$f":"IF(ISBLANK('Resumo do Ano'!B10),\"\",'Resumo do Ano'!B10)","v":""},0,0,0]
[{"$f":"IF(ISBLANK('Resumo do Ano'!A11),\"\",'Resumo do Ano'!A11)","v":""},{"$f":"IF(ISBLANK('Resumo do Ano'!B11),\"\",'Resumo do Ano'!B11)","v":""},0,0,0]
[{"$f":"IF(ISBLANK('Resumo do Ano'!A12),\"\",'Resumo do Ano'!A12)","v":""},{"$f":"IF(ISBLANK('Resumo do Ano'!B12),\"\",'Resumo do Ano'!B12)","v":""},0,0,0]
[{"$f":"IF(ISBLANK('Resumo do Ano'!A13),\"\",'Resumo do Ano'!A13)","v":""},{"$f":"IF(ISBLANK('Resumo do Ano'!B13),\"\",'Resumo do Ano'!B13)","v":""},0,0,0]
[{"$f":"IF(ISBLANK('Resumo do Ano'!A14),\"\",'Resumo do Ano'!A14)","v":""},{"$f":"IF(ISBLANK('Resumo do Ano'!B14),\"\",'Resumo do Ano'!B14)","v":""},0,0,0]
[{"$f":"IF(ISBLANK('Resumo do Ano'!A15),\"\",'Resumo do Ano'!A15)","v":""},{"$f":"IF(ISBLANK('Resumo do Ano'!B15),\"\",'Resumo do Ano'!B15)","v":""},0,0,0]
[{"$f":"IF(ISBLANK('Resumo do Ano'!A16),\"\",'Resumo do Ano'!A16)","v":""},{"$f":"IF(ISBLANK('Resumo do Ano'!B16),\"\",'Resumo do Ano'!B16)","v":""},0,0,0]
[{"$f":"IF(ISBLANK('Resumo do Ano'!A17),\"\",'Resumo do Ano'!A17)","v":""},{"$f":"IF(ISBLANK('Resumo do Ano'!B17),\"\",'Resumo do Ano'!B17)","v":""},0,0,0]
[{"$f":"IF(ISBLANK('Resumo do Ano'!A18),\"\",'Resumo do Ano'!A18)","v":""},{"$f":"IF(ISBLANK('Resumo do Ano'!B18),\"\",'Resumo do Ano'!B18)","v":""},0,0,0]
[{"$f":"IF(ISBLANK('Resumo do Ano'!A19),\"\",'Resumo do Ano'!A19)","v":""},{"$f":"IF(ISBLANK('Resumo do Ano'!B19),\"\",'Resumo do Ano'!B19)","v":""},0,0,0]
[{"$f":"IF(ISBLANK('Resumo do Ano'!A20),\"\",'Resumo do Ano'!A20)","v":""},{"$f":"IF(ISBLANK('Resumo do Ano'!B20),\"\",'Resumo do Ano'!B20)","v":""},0,0,0]
[{"$f":"IF(ISBLANK('Resumo do Ano'!A21),\"\",'Resumo do Ano'!A21)","v":""},{"$f":"IF(ISBLANK('Resumo do Ano'!B21),\"\",'Resumo do Ano'!B21)","v":""},0,0,0]
[{"$f":"IF(ISBLANK('Resumo do Ano'!A22),\"\",'Resumo do Ano'!A22)","v":""},{"$f":"IF(ISBLANK('Resumo do Ano'!B22),\"\",'Resumo do Ano'!B22)","v":""},0,0,0]
[{"$f":"IF(ISBLANK('Resumo do Ano'!A23),\"\",'Resumo do Ano'!A23)","v":""},{"$f":"IF(ISBLANK('Resumo do Ano'!B23),\"\",'Resumo do Ano'!B23)","v":""},0,0,0]
[{"$f":"IF(ISBLANK('Resumo do Ano'!A24),\"\",'Resumo do Ano'!A24)","v":""},{"$f":"IF(ISBLANK('Resumo do Ano'!B24),\"\",'Resumo do Ano'!B24)","v":""},0,0,0]
[{"$f":"IF(ISBLANK('Resumo do Ano'!A25),\"\",'Resumo do Ano'!A25)","v":""},{"$f":"IF(ISBLANK('Resumo do Ano'!B25),\"\",'Resumo do Ano'!B25)","v":""},0,0,0]
[{"$f":"IF(ISBLANK('Resumo do Ano'!A26),\"\",'Resumo do Ano'!A26)","v":""},{"$f":"IF(ISBLANK('Resumo do Ano'!B26),\"\",'Resumo do Ano'!B26)","v":""},0,0,0]
[{"$f":"IF(ISBLANK('Resumo do Ano'!A27),\"\",'Resumo do Ano'!A27)","v":""},{"$f":"IF(ISBLANK('Resumo do Ano'!B27),\"\",'Resumo do Ano'!B27)","v":""},0,0,0]
[{"$f":"IF(ISBLANK('Resumo do Ano'!A28),\"\",'Resumo do Ano'!A28)","v":""},{"$f":"IF(ISBLANK('Resumo do Ano'!B28),\"\",'Resumo do Ano'!B28)","v":""},0,0,0]
[{"$f":"IF(ISBLANK('Resumo do Ano'!A29),\"\",'Resumo do Ano'!A29)","v":""},{"$f":"IF(ISBLANK('Resumo do Ano'!B29),\"\",'Resumo do Ano'!B29)","v":""},0,0,0]
[{"$f":"IF(ISBLANK('Resumo do Ano'!A30),\"\",'Resumo do Ano'!A30)","v":""},{"$f":"IF(ISBLANK('Resumo do Ano'!B30),\"\",'Resumo do Ano'!B30)","v":""},0,0,0]
[{"$f":"IF(ISBLANK('Resumo do Ano'!A31),\"\",'Resumo do Ano'!A31)","v":""},{"$f":"IF(ISBLANK('Resumo do Ano'!B31),\"\",'Resumo do Ano'!B31)","v":""},0,0,0]
[{"$f":"IF(ISBLANK('Resumo do Ano'!A32),\"\",'Resumo do Ano'!A32)","v":""},{"$f":"IF(ISBLANK('Resumo do Ano'!B32),\"\",'Resumo do Ano'!B32)","v":""},0,0,0]
[{"$f":"IF(ISBLANK('Resumo do Ano'!A33),\"\",'Resumo do Ano'!A33)","v":""},{"$f":"IF(ISBLANK('Resumo do Ano'!B33),\"\",'Resumo do Ano'!B33)","v":""},0,0,0]
[{"$f":"IF(ISBLANK('Resumo do Ano'!A34),\"\",'Resumo do Ano'!A34)","v":""},{"$f":"IF(ISBLANK('Resumo do Ano'!B34),\"\",'Resumo do Ano'!B34)","v":""},0,0,0]
[{"$f":"IF(ISBLANK('Resumo do Ano'!A35),\"\",'Resumo do Ano'!A35)","v":""},{"$f":"IF(ISBLANK('Resumo do Ano'!B35),\"\",'Resumo do Ano'!B35)","v":""},0,0,0]
[{"$f":"IF(ISBLANK('Resumo do Ano'!A36),\"\",'Resumo do Ano'!A36)","v":""},{"$f":"IF(ISBLANK('Resumo do Ano'!B36),\"\",'Resumo do Ano'!B36)","v":""},0,0,0]

{"sheet":"4.º T","index":4,"n_rows":36,"n_cols":97,"rows_kept":36,"merged":[[3,0,3,6]]}
[{"$f":"Nome_da_Empresa","v":"Nome da Empresa"}]
["Registo de Assiduidade, 4.º Trimestre"]
["Data"]
[{"$f":"Nome_da_Empresa","v":"Nome da Empresa"},{"$nulls":6},"CONFIDENCIAL"]
["Apelido","Nome Próprio","Férias","Folga","Licença por Doença","01/10","02/10","03/10","04/10","05/10","06/10","07/10","08/10","09/10","10/10","11/10","12/10","13/10","14/10","15/10","16/10","17/10","18/10","19/10","20/10","21/10","22/10","23/10","24/10","25/10","26/10","27/10","28/10","29/10","30/10","31/10","01/11","02/11","03/11","04/11","05/11","06/11","07/11","08/11","09/11","10/11","11/11","12/11","13/11","14/11","15/11","16/11","17/11","18/11","19/11","20/11","21/11","22/11","23/11","24/11","25/11","26/11","27/11","28/11","29/11","30/11","01/12","02/12","03/12","04/12","05/12","06/12","07/12","08/12","09/12","10/12","11/12","12/12","13/12","14/12","15/12","16/12","17/12","18/12","19/12","20/12","21/12","22/12","23/12","24/12","25/12","26/12","27/12","28/12","29/12","30/12","31/12"]
[{"$f":"IF(ISBLANK('Resumo do Ano'!A6),\"\",'Resumo do Ano'!A6)","v":"Apelido"},{"$f":"IF(ISBLANK('Resumo do Ano'!B6),\"\",'Resumo do Ano'!B6)","v":"Nome Próprio"},{"$f":"COUNTIF($F6:$CS6, \"F\")","v":0},{"$f":"COUNTIF($F6:CS6, \"Fg\")","v":0},{"$f":"COUNTIF($F6:CS6, \"LD\")","v":0}]
[{"$f":"IF(ISBLANK('Resumo do Ano'!A7),\"\",'Resumo do Ano'!A7)","v":""},{"$f":"IF(ISBLANK('Resumo do Ano'!B7),\"\",'Resumo do Ano'!B7)","v":""},0,{"$f":"COUNTIF($F7:CS7, \"Fg\")","v":0},{"$f":"COUNTIF($F7:CS7, \"LD\")","v":0}]
[{"$f":"IF(ISBLANK('Resumo do Ano'!A8),\"\",'Resumo do Ano'!A8)","v":""},{"$f":"IF(ISBLANK('Resumo do Ano'!B8),\"\",'Resumo do Ano'!B8)","v":""},0,{"$f":"COUNTIF($F8:CS8, \"Fg\")","v":0},{"$f":"COUNTIF($F8:CS8, \"LD\")","v":0}]
[{"$f":"IF(ISBLANK('Resumo do Ano'!A9),\"\",'Resumo do Ano'!A9)","v":""},{"$f":"IF(ISBLANK('Resumo do Ano'!B9),\"\",'Resumo do Ano'!B9)","v":""},0,{"$f":"COUNTIF($F9:CS9, \"Fg\")","v":0},{"$f":"COUNTIF($F9:CS9, \"LD\")","v":0}]
[{"$f":"IF(ISBLANK('Resumo do Ano'!A10),\"\",'Resumo do Ano'!A10)","v":""},{"$f":"IF(ISBLANK('Resumo do Ano'!B10),\"\",'Resumo do Ano'!B10)","v":""},0,{"$f":"COUNTIF($F10:CS10, \"Fg\")","v":0},{"$f":"COUNTIF($F10:CS10, \"LD\")","v":0}]
[{"$f":"IF(ISBLANK('Resumo do Ano'!A11),\"\",'Resumo do Ano'!A11)","v":""},{"$f":"IF(ISBLANK('Resumo do Ano'!B11),\"\",'Resumo do Ano'!B11)","v":""},0,{"$f":"COUNTIF($F11:CS11, \"Fg\")","v":0},{"$f":"COUNTIF($F11:CS11, \"LD\")","v":0}]
[{"$f":"IF(ISBLANK('Resumo do Ano'!A12),\"\",'Resumo do Ano'!A12)","v":""},{"$f":"IF(ISBLANK('Resumo do Ano'!B12),\"\",'Resumo do Ano'!B12)","v":""},0,{"$f":"COUNTIF($F12:CS12, \"Fg\")","v":0},{"$f":"COUNTIF($F12:CS12, \"LD\")","v":0}]
[{"$f":"IF(ISBLANK('Resumo do Ano'!A13),\"\",'Resumo do Ano'!A13)","v":""},{"$f":"IF(ISBLANK('Resumo do Ano'!B13),\"\",'Resumo do Ano'!B13)","v":""},0,{"$f":"COUNTIF($F13:CS13, \"Fg\")","v":0},{"$f":"COUNTIF($F13:CS13, \"LD\")","v":0}]
[{"$f":"IF(ISBLANK('Resumo do Ano'!A14),\"\",'Resumo do Ano'!A14)","v":""},{"$f":"IF(ISBLANK('Resumo do Ano'!B14),\"\",'Resumo do Ano'!B14)","v":""},0,{"$f":"COUNTIF($F14:CS14, \"Fg\")","v":0},{"$f":"COUNTIF($F14:CS14, \"LD\")","v":0}]
[{"$f":"IF(ISBLANK('Resumo do Ano'!A15),\"\",'Resumo do Ano'!A15)","v":""},{"$f":"IF(ISBLANK('Resumo do Ano'!B15),\"\",'Resumo do Ano'!B15)","v":""},0,{"$f":"COUNTIF($F15:CS15, \"Fg\")","v":0},{"$f":"COUNTIF($F15:CS15, \"LD\")","v":0}]
[{"$f":"IF(ISBLANK('Resumo do Ano'!A16),\"\",'Resumo do Ano'!A16)","v":""},{"$f":"IF(ISBLANK('Resumo do Ano'!B16),\"\",'Resumo do Ano'!B16)","v":""},0,{"$f":"COUNTIF($F16:CS16, \"Fg\")","v":0},{"$f":"COUNTIF($F16:CS16, \"LD\")","v":0}]
[{"$f":"IF(ISBLANK('Resumo do Ano'!A17),\"\",'Resumo do Ano'!A17)","v":""},{"$f":"IF(ISBLANK('Resumo do Ano'!B17),\"\",'Resumo do Ano'!B17)","v":""},0,{"$f":"COUNTIF($F17:CS17, \"Fg\")","v":0},{"$f":"COUNTIF($F17:CS17, \"LD\")","v":0}]
[{"$f":"IF(ISBLANK('Resumo do Ano'!A18),\"\",'Resumo do Ano'!A18)","v":""},{"$f":"IF(ISBLANK('Resumo do Ano'!B18),\"\",'Resumo do Ano'!B18)","v":""},0,{"$f":"COUNTIF($F18:CS18, \"Fg\")","v":0},{"$f":"COUNTIF($F18:CS18, \"LD\")","v":0}]
[{"$f":"IF(ISBLANK('Resumo do Ano'!A19),\"\",'Resumo do Ano'!A19)","v":""},{"$f":"IF(ISBLANK('Resumo do Ano'!B19),\"\",'Resumo do Ano'!B19)","v":""},0,{"$f":"COUNTIF($F19:CS19, \"Fg\")","v":0},{"$f":"COUNTIF($F19:CS19, \"LD\")","v":0}]
[{"$f":"IF(ISBLANK('Resumo do Ano'!A20),\"\",'Resumo do Ano'!A20)","v":""},{"$f":"IF(ISBLANK('Resumo do Ano'!B20),\"\",'Resumo do Ano'!B20)","v":""},0,{"$f":"COUNTIF($F20:CS20, \"Fg\")","v":0},{"$f":"COUNTIF($F20:CS20, \"LD\")","v":0}]
[{"$f":"IF(ISBLANK('Resumo do Ano'!A21),\"\",'Resumo do Ano'!A21)","v":""},{"$f":"IF(ISBLANK('Resumo do Ano'!B21),\"\",'Resumo do Ano'!B21)","v":""},0,{"$f":"COUNTIF($F21:CS21, \"Fg\")","v":0},{"$f":"COUNTIF($F21:CS21, \"LD\")","v":0}]
[{"$f":"IF(ISBLANK('Resumo do Ano'!A22),\"\",'Resumo do Ano'!A22)","v":""},{"$f":"IF(ISBLANK('Resumo do Ano'!B22),\"\",'Resumo do Ano'!B22)","v":""},0,{"$f":"COUNTIF($F22:CS22, \"Fg\")","v":0},{"$f":"COUNTIF($F22:CS22, \"LD\")","v":0}]
[{"$f":"IF(ISBLANK('Resumo do Ano'!A23),\"\",'Resumo do Ano'!A23)","v":""},{"$f":"IF(ISBLANK('Resumo do Ano'!B23),\"\",'Resumo do Ano'!B23)","v":""},0,{"$f":"COUNTIF($F23:CS23, \"Fg\")","v":0},{"$f":"COUNTIF($F23:CS23, \"LD\")","v":0}]
[{"$f":"IF(ISBLANK('Resumo do Ano'!A24),\"\",'Resumo do Ano'!A24)","v":""},{"$f":"IF(ISBLANK('Resumo do Ano'!B24),\"\",'Resumo do Ano'!B24)","v":""},0,{"$f":"COUNTIF($F24:CS24, \"Fg\")","v":0},{"$f":"COUNTIF($F24:CS24, \"LD\")","v":0}]
[{"$f":"IF(ISBLANK('Resumo do Ano'!A25),\"\",'Resumo do Ano'!A25)","v":""},{"$f":"IF(ISBLANK('Resumo do Ano'!B25),\"\",'Resumo do Ano'!B25)","v":""},0,{"$f":"COUNTIF($F25:CS25, \"Fg\")","v":0},{"$f":"COUNTIF($F25:CS25, \"LD\")","v":0}]
[{"$f":"IF(ISBLANK('Resumo do Ano'!A26),\"\",'Resumo do Ano'!A26)","v":""},{"$f":"IF(ISBLANK('Resumo do Ano'!B26),\"\",'Resumo do Ano'!B26)","v":""},0,{"$f":"COUNTIF($F26:CS26, \"Fg\")","v":0},{"$f":"COUNTIF($F26:CS26, \"LD\")","v":0}]
[{"$f":"IF(ISBLANK('Resumo do Ano'!A27),\"\",'Resumo do Ano'!A27)","v":""},{"$f":"IF(ISBLANK('Resumo do Ano'!B27),\"\",'Resumo do Ano'!B27)","v":""},0,{"$f":"COUNTIF($F27:CS27, \"Fg\")","v":0},{"$f":"COUNTIF($F27:CS27, \"LD\")","v":0}]
[{"$f":"IF(ISBLANK('Resumo do Ano'!A28),\"\",'Resumo do Ano'!A28)","v":""},{"$f":"IF(ISBLANK('Resumo do Ano'!B28),\"\",'Resumo do Ano'!B28)","v":""},0,{"$f":"COUNTIF($F28:CS28, \"Fg\")","v":0},{"$f":"COUNTIF($F28:CS28, \"LD\")","v":0}]
[{"$f":"IF(ISBLANK('Resumo do Ano'!A29),\"\",'Resumo do Ano'!A29)","v":""},{"$f":"IF(ISBLANK('Resumo do Ano'!B29),\"\",'Resumo do Ano'!B29)","v":""},0,{"$f":"COUNTIF($F29:CS29, \"Fg\")","v":0},{"$f":"COUNTIF($F29:CS29, \"LD\")","v":0}]
[{"$f":"IF(ISBLANK('Resumo do Ano'!A30),\"\",'Resumo do Ano'!A30)","v":""},{"$f":"IF(ISBLANK('Resumo do Ano'!B30),\"\",'Resumo do Ano'!B30)","v":""},0,{"$f":"COUNTIF($F30:CS30, \"Fg\")","v":0},{"$f":"COUNTIF($F30:CS30, \"LD\")","v":0}]
[{"$f":"IF(ISBLANK('Resumo do Ano'!A31),\"\",'Resumo do Ano'!A31)","v":""},{"$f":"IF(ISBLANK('Resumo do Ano'!B31),\"\",'Resumo do Ano'!B31)","v":""},0,{"$f":"COUNTIF($F31:CS31, \"Fg\")","v":0},{"$f":"COUNTIF($F31:CS31, \"LD\")","v":0}]
[{"$f":"IF(ISBLANK('Resumo do Ano'!A32),\"\",'Resumo do Ano'!A32)","v":""},{"$f":"IF(ISBLANK('Resumo do Ano'!B32),\"\",'Resumo do Ano'!B32)","v":""},0,{"$f":"COUNTIF($F32:CS32, \"Fg\")","v":0},{"$f":"COUNTIF($F32:CS32, \"LD\")","v":0}]
[{"$f":"IF(ISBLANK('Resumo do Ano'!A33),\"\",'Resumo do Ano'!A33)","v":""},{"$f":"IF(ISBLANK('Resumo do Ano'!B33),\"\",'Resumo do Ano'!B33)","v":""},0,{"$f":"COUNTIF($F33:CS33, \"Fg\")","v":0},{"$f":"COUNTIF($F33:CS33, \"LD\")","v":0}]
[{"$f":"IF(ISBLANK('Resumo do Ano'!A34),\"\",'Resumo do Ano'!A34)","v":""},{"$f":"IF(ISBLANK('Resumo do Ano'!B34),\"\",'Resumo do Ano'!B34)","v":""},0,{"$f":"COUNTIF($F34:CS34, \"Fg\")","v":0},{"$f":"COUNTIF($F34:CS34, \"LD\")","v":0}]
[{"$f":"IF(ISBLANK('Resumo do Ano'!A35),\"\",'Resumo do Ano'!A35)","v":""},{"$f":"IF(ISBLANK('Resumo do Ano'!B35),\"\",'Resumo do Ano'!B35)","v":""},0,{"$f":"COUNTIF($F35:CS35, \"Fg\")","v":0},{"$f":"COUNTIF($F35:CS35, \"LD\")","v":0}]
[{"$f":"IF(ISBLANK('Resumo do Ano'!A36),\"\",'Resumo do Ano'!A36)","v":""},{"$f":"IF(ISBLANK('Resumo do Ano'!B36),\"\",'Resumo do Ano'!B36)","v":""},0,{"$f":"COUNTIF($F36:CS36, \"Fg\")","v":0},{"$f":"COUNTIF($F36:CS36, \"LD\")","v":0}]