{"text_format":"3","workbook":"xlsx","n_sheets":4,"sheets":["Dados do gráfico","Gráfico de Gantt","Dados do gráf. dinâmico oculta","Sobre"],"not_rendered":{"charts":1,"defined_names":4},"read":"whole","date_system":"1900"}

{"sheet":"Dados do gráfico","index":0,"n_rows":26,"n_cols":11,"rows_kept":26,"merged":[[1,1,1,2]]}
["Crie um Gráfico de Gantt de acompanhamento de datas nesta planilha.\nO título desta planilha está na célula B1. \nAs informações sobre como usar esta planilha, incluindo instruções para leitores de tela, estão na planilha Sobre.\nContinue navegando pela coluna A para saber mais.","Gráfico de Gantt de acompanhamento de datas"]
["Selecione a opção Sim na célula D2 para realçar a data de hoje na planilha Gráfico de Gantt. \nSelecione a opção Não na célula D2 caso não queira realçar a data de hoje na planilha Gráfico de Gantt.\nNa célula D2, selecione Alt+Seta para baixo para ver as opções.","Acompanhar a data de hoje?",null,"Sim"]
["O cabeçalho Marcos da tabela correspondente está na célula B3.\nO cabeçalho Tarefas da tabela correspondente está na célula G3.","Marcos",{"$nulls":4},"Tarefas"]
["As informações sobre as colunas na tabela de marcos estão nesta linha, das células B4 a E4.\nAs informações sobre as colunas na tabela de tarefas estão nesta linha, das células G4 a J4.","Essa coluna deve ser ordenada sequencialmente.","A coluna de posição registra os marcos no gráfico de tarefas.","Insira a data para um marco nesta coluna.","Insira a descrição do marco nesta coluna. Essas descrições aparecerão no gráfico.",null,"Essa coluna deve ser ordenada sequencialmente.","Insira a data de início de cada tarefa abaixo. Para obter melhores resultados, classifique essa coluna em ordem ascendente.","Insira a data de término para cada tarefa ou atividade abaixo, nessa coluna.","Insira as tarefas e/ou atividades nessa coluna.","Coluna calculada automaticamente usada para criar o gráfico da duração de cada tarefa. Não exclua ou modifique."]
["Os títulos da tabela Marcos estão nas células B5 a E5. Os títulos da tabela Tarefas estão nas células G5 a K5.\nOs dados de amostra de marcos estão nas células B6 a E17. \nOs dados de amostra de tarefas estão nas células G6 a J17.\nA próxima instrução está na célula A21.","Nº","Posição","data","Marco",null,"Nº","Data de início","Data de término","Tarefa","Duração em dias"]
[null,1,1,{"$f":"Data_Inicial+10","v":"2018-08-25"},"Marco 1",null,1,{"$f":"TODAY()-1","v":"2018-08-15"},{"$f":"Tarefas[[#This Row],[Data de início]]+1","v":"2018-08-16"},"Atividade 1",{"$f":"IFERROR(IF(LEN(Tarefas[[#This Row],[Data de início]])=0,\"\",(INT(Tarefas[[#This Row],[Data de término]])-INT(Tarefas[[#This Row],[Data de início]]))-(INT(Tarefas[[#This Row],[Data de início]])-INT(Tarefas[[#This Row],[Data de início]]))+1),\"\")","v":2}]
[null,2,1,{"$f":"TODAY()+25","v":"2018-09-10"},"Marco 2",null,2,{"$f":"TODAY()","v":"2018-08-16"},{"$f":"Tarefas[[#This Row],[Data de início]]+1","v":"2018-08-17"},"Atividade 2",{"$f":"IFERROR(IF(LEN(Tarefas[[#This Row],[Data de início]])=0,\"\",(INT(Tarefas[[#This Row],[Data de término]])-INT(Tarefas[[#This Row],[Data de início]]))-(INT(Tarefas[[#This Row],[Data de início]])-INT(Tarefas[[#This Row],[Data de início]]))+1),\"\")","v":2}]
[null,3,1,{"$f":"TODAY()+35","v":"2018-09-20"},"Marco 3",null,3,{"$f":"TODAY()","v":"2018-08-16"},{"$f":"Tarefas[[#This Row],[Data de início]]+5","v":"2018-08-21"},"Atividade 3",{"$f":"IFERROR(IF(LEN(Tarefas[[#This Row],[Data de início]])=0,\"\",(INT(Tarefas[[#This Row],[Data de término]])-INT(Tarefas[[#This Row],[Data de início]]))-(INT(Tarefas[[#This Row],[Data de início]])-INT(Tarefas[[#This Row],[Data de início]]))+1),\"\")","v":6}]
[null,4,1,{"$f":"TODAY()+45","v":"2018-09-30"},"Marco 4",null,4,{"$f":"TODAY()+1","v":"2018-08-17"},{"$f":"Tarefas[[#This Row],[Data de início]]+7","v":"2018-08-24"},"Atividade 4",{"$f":"IFERROR(IF(LEN(Tarefas[[#This Row],[Data de início]])=0,\"\",(INT(Tarefas[[#This Row],[Data de término]])-INT(Tarefas[[#This Row],[Data de início]]))-(INT(Tarefas[[#This Row],[Data de início]])-INT(Tarefas[[#This Row],[Data de início]]))+1),\"\")","v":8}]
[null,5,1,{"$f":"TODAY()+60","v":"2018-10-15"},"Marco 5",null,5,{"$f":"TODAY()+8","v":"2018-08-24"},{"$f":"Tarefas[[#This Row],[Data de início]]+10","v":"2018-09-03"},"Atividade 5",{"$f":"IFERROR(IF(LEN(Tarefas[[#This Row],[Data de início]])=0,\"\",(INT(Tarefas[[#This Row],[Data de término]])-INT(Tarefas[[#This Row],[Data de início]]))-(INT(Tarefas[[#This Row],[Data de início]])-INT(Tarefas[[#This Row],[Data de início]]))+1),\"\")","v":11}]
[null,6,1,{"$f":"TODAY()+70","v":"2018-10-25"},"Marco 6",null,6,{"$f":"TODAY()+12","v":"2018-08-28"},{"$f":"Tarefas[[#This Row],[Data de início]]+30","v":"2018-09-27"},"Atividade 6",{"$f":"IFERROR(IF(LEN(Tarefas[[#This Row],[Data de início]])=0,\"\",(INT(Tarefas[[#This Row],[Data de término]])-INT(Tarefas[[#This Row],[Data de início]]))-(INT(Tarefas[[#This Row],[Data de início]])-INT(Tarefas[[#This Row],[Data de início]]))+1),\"\")","v":31}]
[{"$nulls":6},7,{"$f":"TODAY()+15","v":"2018-08-31"},{"$f":"Tarefas[[#This Row],[Data de início]]+15","v":"2018-09-15"},"Atividade 7",{"$f":"IFERROR(IF(LEN(Tarefas[[#This Row],[Data de início]])=0,\"\",(INT(Tarefas[[#This Row],[Data de término]])-INT(Tarefas[[#This Row],[Data de início]]))-(INT(Tarefas[[#This Row],[Data de início]])-INT(Tarefas[[#This Row],[Data de início]]))+1),\"\")","v":16}]
[{"$nulls":6},8,{"$f":"TODAY()+25","v":"2018-09-10"},{"$f":"Tarefas[[#This Row],[Data de início]]+5","v":"2018-09-15"},"Atividade 8",{"$f":"IFERROR(IF(LEN(Tarefas[[#This Row],[Data de início]])=0,\"\",(INT(Tarefas[[#This Row],[Data de término]])-INT(Tarefas[[#This Row],[Data de início]]))-(INT(Tarefas[[#This Row],[Data de início]])-INT(Tarefas[[#This Row],[Data de início]]))+1),\"\")","v":6}]
[{"$nulls":6},9,{"$f":"TODAY()+34","v":"2018-09-19"},{"$f":"Tarefas[[#This Row],[Data de início]]+2","v":"2018-09-21"},"Atividade 9",{"$f":"IFERROR(IF(LEN(Tarefas[[#This Row],[Data de início]])=0,\"\",(INT(Tarefas[[#This Row],[Data de término]])-INT(Tarefas[[#This Row],[Data de início]]))-(INT(Tarefas[[#This Row],[Data de início]])-INT(Tarefas[[#This Row],[Data de início]]))+1),\"\")","v":3}]
[{"$nulls":6},10,{"$f":"TODAY()+40","v":"2018-09-25"},{"$f":"Tarefas[[#This Row],[Data de início]]+30","v":"2018-10-25"},"Atividade 10",{"$f":"IFERROR(IF(LEN(Tarefas[[#This Row],[Data de início]])=0,\"\",(INT(Tarefas[[#This Row],[Data de término]])-INT(Tarefas[[#This Row],[Data de início]]))-(INT(Tarefas[[#This Row],[Data de início]])-INT(Tarefas[[#This Row],[Data de início]]))+1),\"\")","v":31}]
[{"$nulls":6},11,{"$f":"TODAY()+42","v":"2018-09-27"},{"$f":"Tarefas[[#This Row],[Data de início]]+23","v":"2018-10-20"},"Atividade 11",{"$f":"IFERROR(IF(LEN(Tarefas[[#This Row],[Data de início]])=0,\"\",(INT(Tarefas[[#This Row],[Data de término]])-INT(Tarefas[[#This Row],[Data de início]]))-(INT(Tarefas[[#This Row],[Data de início]])-INT(Tarefas[[#This Row],[Data de início]]))+1),\"\")","v":24}]
[{"$nulls":6},12,{"$f":"TODAY()+50","v":"2018-10-05"},{"$f":"Tarefas[[#This Row],[Data de início]]+5","v":"2018-10-10"},"Atividade 12",{"$f":"IFERROR(IF(LEN(Tarefas[[#This Row],[Data de início]])=0,\"\",(INT(Tarefas[[#This Row],[Data de término]])-INT(Tarefas[[#This Row],[Data de início]]))-(INT(Tarefas[[#This Row],[Data de início]])-INT(Tarefas[[#This Row],[Data de início]]))+1),\"\")","v":6}]
[{"$nulls":10},{"$f":"IFERROR(IF(LEN(Tarefas[[#This Row],[Data de início]])=0,\"\",(INT(Tarefas[[#This Row],[Data de término]])-INT(Tarefas[[#This Row],[Data de início]]))-(INT(Tarefas[[#This Row],[Data de início]])-INT(Tarefas[[#This Row],[Data de início]]))+1),\"\")","v":""}]
[{"$nulls":10},{"$f":"IFERROR(IF(LEN(Tarefas[[#This Row],[Data de início]])=0,\"\",(INT(Tarefas[[#This Row],[Data de término]])-INT(Tarefas[[#This Row],[Data de início]]))-(INT(Tarefas[[#This Row],[Data de início]])-INT(Tarefas[[#This Row],[Data de início]]))+1),\"\")","v":""}]
[{"$nulls":10},{"$f":"IFERROR(IF(LEN(Tarefas[[#This Row],[Data de início]])=0,\"\",(INT(Tarefas[[#This Row],[Data de término]])-INT(Tarefas[[#This Row],[Data de início]]))-(INT(Tarefas[[#This Row],[Data de início]])-INT(Tarefas[[#This Row],[Data de início]]))+1),\"\")","v":""}]
{"$rows_left_out":7}
{"sheet":"Gráfico de Gantt","index":1,"n_rows":1,"n_cols":1,"rows_kept":1}
["O Gráfico de Gantt, mostrando a data de Hoje, os marcos e as tarefas em um intervalo de datas, está nesta planilha. \nUma barra de rolagem está na linha 1, das células B1 a R1, e incrementa o intervalo de datas mostrando os marcos futuros.\nO gráfico é desenhado nas células B2 a R3.\nEsta é a última instrução nesta planilha."]

{"sheet":"Dados do gráf. dinâmico oculta","index":2,"n_rows":32,"n_cols":10,"rows_kept":32,"hidden":true}
["O título desta planilha está na célula B1.","Dados do gráf. dinâmico, NÃO edite ou exclua essa planilha!"]
["O título da tabela está nas células B2 e C2.",{"$f":"IF(TODAY()>=MIN(DadosDeTarefaDinâmica[Data de início]),\"Hoje\",\"\")","v":"Hoje"},"realce"]
["O cabeçalho da tabela está nas células B3 e C3. Essas coordenadas criam o realce de Hoje no gráfico.\nA primeira coluna marca o dia, a segunda indica para desenhar a linha que destaca a data de hoje.\nA data da primeira coluna pode mudar de forma que o intervalo de datas do gráfico fique legível conforme as datas progridem, no entanto, a coordenada Y de 0 indica que uma linha não foi desenhada.\nNão modifique ou exclua este conteúdo ou o gráfico pode deixar de funcionar. Para deixar de realçar a data de Hoje, basta selecionar \"não\" na planilha Dados do gráfico na célula D2.\nA próxima instrução está na célula A7.","realçar hoje na coordenada x","coordenada y"]
[null,{"$f":"IFERROR(IF(TODAY()<MIN(DadosDeTarefaDinâmica[Data de início]),MIN($B$11,MIN(DadosDeTarefaDinâmica[Data de início])),TODAY()),TODAY())","v":"2018-08-16"},{"$f":"IFERROR(IF(Acompanhar_Hoje=\"Sim\",IF(TODAY()<MIN(DadosDeTarefaDinâmica[Data de início]),0,9),0),0)","v":9}]
[null,{"$f":"IFERROR(IF(TODAY()<MIN(DadosDeTarefaDinâmica[Data de início]),MIN($B$11,MIN(DadosDeTarefaDinâmica[Data de início])),TODAY()),TODAY())","v":"2018-08-16"},{"$f":"IFERROR(IF(Acompanhar_Hoje=\"Sim\",IF(TODAY()<MIN(DadosDeTarefaDinâmica[Data de início]),0,9),0),0)","v":9}]
[]
["O cabeçalho da tabela está na célula B7.\nO incremento de rolagem na célula B8 representa os dados inclusos no gráfico e é exibido visualmente no Gráfico de Gantt a qualquer momento. \nUse a barra de rolagem na parte superior do gráfico, na linha 1 da planilha Gráfico de Gantt, para incrementar esse número.\nOs gráficos funcionam melhor com incrementos simples.\nA próxima instrução está na célula A10.","incremento de rolagem"]
[null,0]
[]
["O cabeçalho da tabela está nas células B10 e D10.\nO Intervalo do gráfico ajuda a selecionar o intervalo apropriado de tarefas e marcos. Não modifique esses campos.\nO número de maturação mantém o gráfico legível ao definir o amadurecimento das tarefas do intervalo e apenas incluir as que estão dentro do intervalo. Não modifique esse número.\nA próxima instrução está na célula A14.\n\n","Intervalo do gráfico",null,"maturação"]
[null,{"$f":"IFERROR(IF(IncrementoDeRolagem[incremento de rolagem]=0,Data_Inicial,IF(Data_Inicial+IncrementoDeRolagem[incremento de rolagem]*15<Data_Final,Data_Inicial+IncrementoDeRolagem[incremento de rolagem]*15,Data_Final-1)),\"\")","v":"2018-08-15"},null,45]
[null,{"$f":"IFERROR(IF($B$11+15<Data_Final,$B$11+15,Data_Final),\"\")","v":"2018-08-30"}]
[]
["O cabeçalho da tabela Dados dinâmicos de marcos está nas células B14 a E14. Uma anotação está na célula F14.\nEsta tabela cria o Gráfico de Gantt na planilha correspondente, desenhando sete marcos de cada vez.\nOs dados neste gráfico são gerado automaticamente com base no conteúdo da tabela acima. \nNão edite ou exclua esta tabela ou o seu conteúdo.\nA próxima instrução está na célula A17.","Tarefas","Data de início","Duração da tarefa em dias","posição","<-- esta tabela cria o gráfico de gantt, desenhando sete marcos de cada vez"]
[null,{"$f":"IFERROR(IF(LEN(OFFSET('Dados do gráfico'!$H6,IncrementoDeRolagem[incremento de rolagem],0,1,1))=0,\"\",IF(OR(OFFSET('Dados do gráfico'!$I6,IncrementoDeRolagem[incremento de rolagem],0,1,1)<=$B$12,OFFSET('Dados do gráfico'!$H6,IncrementoDeRolagem[incremento de rolagem],0,1,1)>=($B$11-$D$11)),INDEX(Tarefas[],OFFSET('Dados do gráfico'!$G6,IncrementoDeRolagem[incremento de rolagem],0,1,1),4),\"\")),\"\")","v":"Atividade 1"},{"$f":"IFERROR(IF(LEN(DadosDeTarefaDinâmica[[#This Row],[Tarefas]])=0,$B$11,INDEX(Tarefas[],OFFSET('Dados do gráfico'!$G6,IncrementoDeRolagem[incremento de rolagem],0,1,1),2)),\"\")","v":"2018-08-15"},{"$f":"IFERROR(IF(LEN(DadosDeTarefaDinâmica[[#This Row],[Tarefas]])=0,0,IF(AND('Dados do gráfico'!$H6<=$B$12,'Dados do gráfico'!$I6>=$B$12),ABS(OFFSET('Dados do gráfico'!$H6,IncrementoDeRolagem[incremento de rolagem],0,1,1)-$B$12)+1,OFFSET('Dados do gráfico'!$K6,IncrementoDeRolagem[incremento de rolagem],0,1,1))),\"\")","v":2},{"$f":"IFERROR(IF(LEN(DadosDeTarefaDinâmica[[#This Row],[Tarefas]])=0,\"\",8),\"\")","v":8}]
[null,{"$f":"IFERROR(IF(LEN(OFFSET('Dados do gráfico'!$H7,IncrementoDeRolagem[incremento de rolagem],0,1,1))=0,\"\",IF(OR(OFFSET('Dados do gráfico'!$I7,IncrementoDeRolagem[incremento de rolagem],0,1,1)<=$B$12,OFFSET('Dados do gráfico'!$H7,IncrementoDeRolagem[incremento de rolagem],0,1,1)>=($B$11-$D$11)),INDEX(Tarefas[],OFFSET('Dados do gráfico'!$G7,IncrementoDeRolagem[incremento de rolagem],0,1,1),4),\"\")),\"\")","v":"Atividade 2"},{"$f":"IFERROR(IF(LEN(DadosDeTarefaDinâmica[[#This Row],[Tarefas]])=0,$B$11,INDEX(Tarefas[],OFFSET('Dados do gráfico'!$G7,IncrementoDeRolagem[incremento de rolagem],0,1,1),2)),\"\")","v":"2018-08-16"},{"$f":"IFERROR(IF(LEN(DadosDeTarefaDinâmica[[#This Row],[Tarefas]])=0,0,IF(AND('Dados do gráfico'!$H7<=$B$12,'Dados do gráfico'!$I7>=$B$12),ABS(OFFSET('Dados do gráfico'!$H7,IncrementoDeRolagem[incremento de rolagem],0,1,1)-$B$12)+1,OFFSET('Dados do gráfico'!$K7,IncrementoDeRolagem[incremento de rolagem],0,1,1))),\"\")","v":2},{"$f":"IFERROR(IF(LEN(DadosDeTarefaDinâmica[[#This Row],[Tarefas]])=0,\"\",7),\"\")","v":7},null,"Gráfico de marcos"]
["As células G15 a I15 contêm cabeçalhos de tabela dos Dados dinâmicos de marcos. \nOs dados desta tabela podem parecer estar em branco, talvez as datas pareçam incorretas, mas não preencha, edite, exclua ou modifique estes dados ou correrá o risco de substituir as fórmulas e impedir a execução de gráficos.\nA tabela permite criar o gráfico com 15 marcos. Para criar um gráfico com mais de 15 marcos, basta expandir a tabela para acomodar o número desejado. Lembre-se de adicionar somente os marcos na planilha Dados do gráfico. Não adicione nenhum conteúdo nesta tabela.\nUma anotação está na célula J15.\nA próxima instrução está na célula A32.",{"$f":"IFERROR(IF(LEN(OFFSET('Dados do gráfico'!$H8,IncrementoDeRolagem[incremento de rolagem],0,1,1))=0,\"\",IF(OR(OFFSET('Dados do gráfico'!$I8,IncrementoDeRolagem[incremento de rolagem],0,1,1)<=$B$12,OFFSET('Dados do gráfico'!$H8,IncrementoDeRolagem[incremento de rolagem],0,1,1)>=($B$11-$D$11)),INDEX(Tarefas[],OFFSET('Dados do gráfico'!$G8,IncrementoDeRolagem[incremento de rolagem],0,1,1),4),\"\")),\"\")","v":"Atividade 3"},{"$f":"IFERROR(IF(LEN(DadosDeTarefaDinâmica[[#This Row],[Tarefas]])=0,$B$11,INDEX(Tarefas[],OFFSET('Dados do gráfico'!$G8,IncrementoDeRolagem[incremento de rolagem],0,1,1),2)),\"\")","v":"2018-08-16"},{"$f":"IFERROR(IF(LEN(DadosDeTarefaDinâmica[[#This Row],[Tarefas]])=0,0,IF(AND('Dados do gráfico'!$H8<=$B$12,'Dados do gráfico'!$I8>=$B$12),ABS(OFFSET('Dados do gráfico'!$H8,IncrementoDeRolagem[incremento de rolagem],0,1,1)-$B$12)+1,OFFSET('Dados do gráfico'!$K8,IncrementoDeRolagem[incremento de rolagem],0,1,1))),\"\")","v":6},{"$f":"IFERROR(IF(LEN(DadosDeTarefaDinâmica[[#This Row],[Tarefas]])=0,\"\",6),\"\")","v":6},null,"Marcos","Data","Linha de base","<-- esta tabela cria os marcadores de marcos no gráfico de gantt, demarcando apenas os marcos que se ajustam ao intervalo de datas mostrado; até 15 marcos"]
[null,{"$f":"IFERROR(IF(LEN(OFFSET('Dados do gráfico'!$H9,IncrementoDeRolagem[incremento de rolagem],0,1,1))=0,\"\",IF(OR(OFFSET('Dados do gráfico'!$I9,IncrementoDeRolagem[incremento de rolagem],0,1,1)<=$B$12,OFFSET('Dados do gráfico'!$H9,IncrementoDeRolagem[incremento de rolagem],0,1,1)>=($B$11-$D$11)),INDEX(Tarefas[],OFFSET('Dados do gráfico'!$G9,IncrementoDeRolagem[incremento de rolagem],0,1,1),4),\"\")),\"\")","v":"Atividade 4"},{"$f":"IFERROR(IF(LEN(DadosDeTarefaDinâmica[[#This Row],[Tarefas]])=0,$B$11,INDEX(Tarefas[],OFFSET('Dados do gráfico'!$G9,IncrementoDeRolagem[incremento de rolagem],0,1,1),2)),\"\")","v":"2018-08-17"},{"$f":"IFERROR(IF(LEN(DadosDeTarefaDinâmica[[#This Row],[Tarefas]])=0,0,IF(AND('Dados do gráfico'!$H9<=$B$12,'Dados do gráfico'!$I9>=$B$12),ABS(OFFSET('Dados do gráfico'!$H9,IncrementoDeRolagem[incremento de rolagem],0,1,1)-$B$12)+1,OFFSET('Dados do gráfico'!$K9,IncrementoDeRolagem[incremento de rolagem],0,1,1))),\"\")","v":8},{"$f":"IFERROR(IF(LEN(DadosDeTarefaDinâmica[[#This Row],[Tarefas]])=0,\"\",5),\"\")","v":5},null,{"$f":"IFERROR(IF(LEN('Dados do gráfico'!D6)=0,\"\",IF(AND('Dados do gráfico'!D6<=$B$12,'Dados do gráfico'!D6>=$B$11-$D$11),'Dados do gráfico'!E6,\"\")),\"\")","v":"Marco 1"},{"$f":"IFERROR(IF(LEN(DadosDeMarcoDinâmico[[#This Row],[Marcos]])=0,$B$12,'Dados do gráfico'!$D6),2)","v":"2018-08-25"},{"$f":"IFERROR(IF(LEN(DadosDeMarcoDinâmico[[#This Row],[Marcos]])=0,\"\",'Dados do gráfico'!$C6),\"\")","v":1}]
[null,{"$f":"IFERROR(IF(LEN(OFFSET('Dados do gráfico'!$H10,IncrementoDeRolagem[incremento de rolagem],0,1,1))=0,\"\",IF(OR(OFFSET('Dados do gráfico'!$I10,IncrementoDeRolagem[incremento de rolagem],0,1,1)<=$B$12,OFFSET('Dados do gráfico'!$H10,IncrementoDeRolagem[incremento de rolagem],0,1,1)>=($B$11-$D$11)),INDEX(Tarefas[],OFFSET('Dados do gráfico'!$G10,IncrementoDeRolagem[incremento de rolagem],0,1,1),4),\"\")),\"\")","v":"Atividade 5"},{"$f":"IFERROR(IF(LEN(DadosDeTarefaDinâmica[[#This Row],[Tarefas]])=0,$B$11,INDEX(Tarefas[],OFFSET('Dados do gráfico'!$G10,IncrementoDeRolagem[incremento de rolagem],0,1,1),2)),\"\")","v":"2018-08-24"},{"$f":"IFERROR(IF(LEN(DadosDeTarefaDinâmica[[#This Row],[Tarefas]])=0,0,IF(AND('Dados do gráfico'!$H10<=$B$12,'Dados do gráfico'!$I10>=$B$12),ABS(OFFSET('Dados do gráfico'!$H10,IncrementoDeRolagem[incremento de rolagem],0,1,1)-$B$12)+1,OFFSET('Dados do gráfico'!$K10,IncrementoDeRolagem[incremento de rolagem],0,1,1))),\"\")","v":7},{"$f":"IFERROR(IF(LEN(DadosDeTarefaDinâmica[[#This Row],[Tarefas]])=0,\"\",4),\"\")","v":4},null,{"$f":"IFERROR(IF(LEN('Dados do gráfico'!D7)=0,\"\",IF(AND('Dados do gráfico'!D7<=$B$12,'Dados do gráfico'!D7>=$B$11-$D$11),'Dados do gráfico'!E7,\"\")),\"\")","v":""},{"$f":"IFERROR(IF(LEN(DadosDeMarcoDinâmico[[#This Row],[Marcos]])=0,$B$12,'Dados do gráfico'!$D7),2)","v":"2018-08-30"},{"$f":"IFERROR(IF(LEN(DadosDeMarcoDinâmico[[#This Row],[Marcos]])=0,\"\",'Dados do gráfico'!$C7),\"\")","v":""}]
[null,{"$f":"IFERROR(IF(LEN(OFFSET('Dados do gráfico'!$H11,IncrementoDeRolagem[incremento de rolagem],0,1,1))=0,\"\",IF(OR(OFFSET('Dados do gráfico'!$I11,IncrementoDeRolagem[incremento de rolagem],0,1,1)<=$B$12,OFFSET('Dados do gráfico'!$H11,IncrementoDeRolagem[incremento de rolagem],0,1,1)>=($B$11-$D$11)),INDEX(Tarefas[],OFFSET('Dados do gráfico'!$G11,IncrementoDeRolagem[incremento de rolagem],0,1,1),4),\"\")),\"\")","v":"Atividade 6"},{"$f":"IFERROR(IF(LEN(DadosDeTarefaDinâmica[[#This Row],[Tarefas]])=0,$B$11,INDEX(Tarefas[],OFFSET('Dados do gráfico'!$G11,IncrementoDeRolagem[incremento de rolagem],0,1,1),2)),\"\")","v":"2018-08-28"},{"$f":"IFERROR(IF(LEN(DadosDeTarefaDinâmica[[#This Row],[Tarefas]])=0,0,IF(AND('Dados do gráfico'!$H11<=$B$12,'Dados do gráfico'!$I11>=$B$12),ABS(OFFSET('Dados do gráfico'!$H11,IncrementoDeRolagem[incremento de rolagem],0,1,1)-$B$12)+1,OFFSET('Dados do gráfico'!$K11,IncrementoDeRolagem[incremento de rolagem],0,1,1))),\"\")","v":3},{"$f":"IFERROR(IF(LEN(DadosDeTarefaDinâmica[[#This Row],[Tarefas]])=0,\"\",3),\"\")","v":3},null,{"$f":"IFERROR(IF(LEN('Dados do gráfico'!D8)=0,\"\",IF(AND('Dados do gráfico'!D8<=$B$12,'Dados do gráfico'!D8>=$B$11-$D$11),'Dados do gráfico'!E8,\"\")),\"\")","v":""},{"$f":"IFERROR(IF(LEN(DadosDeMarcoDinâmico[[#This Row],[Marcos]])=0,$B$12,'Dados do gráfico'!$D8),2)","v":"2018-08-30"},{"$f":"IFERROR(IF(LEN(DadosDeMarcoDinâmico[[#This Row],[Marcos]])=0,\"\",'Dados do gráfico'!$C8),\"\")","v":""}]
{"$rows_left_out":13}
{"sheet":"Sobre","index":3,"n_rows":11,"n_cols":1,"rows_kept":11}
["Sobre esta pasta de trabalho"]
["Insira as informações de marcos e tarefas na planilha Dados do gráfico. Para criar o gráfico de marcos ao longo da linha do tempo, digite 0 na coluna Nº, depois atualize a posição do rótulo como \"abaixo\" para evitar sobreposição de rótulos.\n\nA coluna de posição na tabela de marcos indica os marcos em um gráfico de tarefas, seja na mesma linha ou nas linhas empilhadas. Para criar esse gráfico na mesma linha, insira o mesmo número nessa coluna para cada marco. Para criar o gráfico em linhas diferentes, insira números diferentes. Os dados de amostra criam gráficos de todos os marcos ao longo da posição da linha 2.\n"]
["Guia para leitores de tela"]
["\nHá quatro planilhas nesta pasta de trabalho. \n\nDados do gráfico\nGráfico de Gantt\nDados do gráf. dinâmico (oculta)\nSobre\n\nAs instruções para cada planilha estão na coluna A, começando na célula A1 de cada planilha. Elas foram escritas com texto oculto. Cada etapa orienta você pelas informações nessa linha. Cada etapa subsequente continua na célula A2, A3 e assim por diante, caso isso não seja orientado explicitamente. Por exemplo, o texto da instrução pode mostrar \"continua na célula A6\" para a próxima etapa. \n\nO texto oculto não será impresso.\nPara remover essas instruções de uma planilha, basta excluir a coluna A.\n"]
["Dados do gráf. dinâmico (oculta)"]
["\nNão exclua ou modifique o conteúdo da planilha oculta. Isso pode comprometer a integridade do Gráfico de Gantt.\n\nOs dados podem parecer estar em branco, talvez as datas pareçam incorretas, mas não preencha, edite, exclua ou modifique os dados ou correrá o risco de substituir as fórmulas e interromper a capacidade de execução do gráfico.\n\nA tabela MarcoDinâmico permite criar um gráfico com 15 marcos. Para criar um gráfico com mais de 15 marcos, basta expandir a tabela para acomodar o número desejado. Lembre-se de adicionar somente os dados dos marcos reais na planilha Dados do gráfico.\n"]
["Dicas"]
["\nPor padrão, os marcos já estão no gráfico na linha 1 do Gráfico de Gantt usando a coluna Posição na planilha Dados do gráfico, começando na célula C5. Para montar os gráficos de marcos em linhas diferentes, simplesmente altere o número. \n"]
["A configuração padrão é realçar a data de hoje no Gráfico de Gantt. Para deixar de realçar a data de Hoje, basta selecionar \"não\" na planilha Dados do gráfico na célula D2.\n"]
["A linha do tempo das datas do Gráfico de Gantt é transformada em gráfico com um intervalo de cinco datas entre elas. Para alterar isso, selecione a linha do tempo na planilha Gráfico de Gantt e selecione Formatar Eixo. Altere a unidade principal de 5 para 1 ou 10, por exemplo. \n"]
["Esta é a última instrução nesta planilha."]