{"text_format":"3","workbook":"xlsx","n_sheets":4,"sheets":["INÍCIO","PARÂMETROS DE PROJETO","DETALHES DO PROJETO","TOTAIS DO PROJETO"],"not_rendered":{"charts":2,"defined_names":3,"pivot_tables":1},"read":"whole","date_system":"1900"}

{"sheet":"INÍCIO","index":0,"n_rows":7,"n_cols":2,"rows_kept":7}
[null,"SOBRE ESTE MODELO"]
[null,"Controle os parâmetros de projeto, detalhes do projeto e totais do projeto nessa pasta de trabalho do controlador de planejamento de eventos."]
[null,"Insira informações na planilha parâmetros de projeto para atualizar os gráficos de coluna e na planilha de detalhes do projeto. A Tabela dinâmica na planilha totais do projeto é atualizada automaticamente."]
[null,"Preencha o nome da empresa na planilha parâmetros e ela será atualizada automaticamente em outras planilhas."]
[null,"Observação:  "]
[null,"Instruções adicionais tem sido fornecidas na coluna A cada planilha na pasta de trabalho do controlador de planejamento de eventos. Este texto está oculto de propósito. Para removê-lo, selecione a coluna A e selecione Excluir. Para reexibir o texto, selecione a coluna A e altere a cor da fonte."]
{"$rows_left_out":2}
{"sheet":"PARÂMETROS DE PROJETO","index":1,"n_rows":19,"n_cols":9,"rows_kept":19,"merged":[[23,1,42,3]]}
[null,"Nome da Empresa"]
[null,"O controlador de projeto de gerenciamento do evento"]
[null,{"$f":"B1&\" Confidencial\"","v":"Nome da Empresa Confidencial"}]
[null,"As células azuis são calculadas para você. Não é necessário digitar nada nelas."]
[null,"TIPO DE PROJETO","GERENTE DE CONTAS","GERENTE DE PROJETOS","GERENCIADOR DE ESTRATÉGIA","ESPECIALISTA EM DESIGN","EQUIPE DO EVENTO","ADMINISTRADOR DE EQUIPE","Total"]
[null,"Desenvolvimento de estratégia de evento",{"v":0.2,"d":"20%"},{"v":0.1,"d":"10%"},{"v":0.6,"d":"60%"},{"v":0,"d":"0%"},{"v":0,"d":"0%"},{"v":0.1,"d":"10%"},{"$f":"SUM(Parâmetros[[#This Row],[GERENTE DE CONTAS]:[ADMINISTRADOR DE EQUIPE]])","v":{"v":1,"d":"100%"}}]
{"$rows_left_out":14}
{"sheet":"DETALHES DO PROJETO","index":2,"n_rows":10,"n_cols":23,"rows_kept":10}
[null,{"$f":"'PARÂMETROS DE PROJETO'!B1","v":"Nome da Empresa"}]
[null,"O controlador de projeto de gerenciamento do evento"]
[null,{"$f":"'PARÂMETROS DE PROJETO'!B3","v":"Nome da Empresa Confidencial"}]
["Insira as informações na tabela Detalhes do Projeto, começando na célula à direita.\nINFORMAÇÕES\nPara adicionar uma linha na tabela à direita, selecione o botão inferior direito da células no corpo da tabela (não o total de linha) e pressione a tecla Tab ou pressione a tecla SHIFT + F10 onde você deseja a linha inserida e selecione Inserir | Linhas da tabela acima/abaixo.\nVerifique se todas as linhas não utilizadas foram excluídas, como a tabela dinâmica totais do projeto usará todas as células de tabelas e, caso contrário, daria resultados incorretos.","NOME DO PROJETO","TIPO DE PROJETO","INÍCIO ESTIMADO","TÉRMINO ESTIMADO","INÍCIO REAL","TÉRMINO REAL","HORAS DE TRABALHO ESTIMADAS","TRABALHO REAL","DURAÇÃO ESTIMADA","DURAÇÃO REAL","GERENTE DE CONTAS","GERENTE DE PROJETOS","GERENCIADOR DE ESTRATÉGIA","ESPECIALISTA EM DESIGN","EQUIPE DO EVENTO","ADMINISTRADOR DE EQUIPE","GERENTE DE CONTAS ","GERENTE DE PROJETOS ","GERENCIADOR DE ESTRATÉGIA ","ESPECIALISTA EM DESIGN ","EQUIPE DO EVENTO ","ADMINISTRADOR DE EQUIPE "]
[null,"Projeto 1","Desenvolvimento de estratégia de evento",{"$f":"DATE(YEAR(TODAY()),6,9)","v":"2022-06-09"},{"$f":" DATE(YEAR(TODAY()),8,7)","v":"2022-08-07"},{"$f":"DATE(YEAR(TODAY()),6,29)","v":"2022-06-29"},{"$f":"DATE(YEAR(TODAY()),9,3)","v":"2022-09-03"},200,220,{"$f":"DAYS360(DetalhesDoProjeto[[#This Row],[INÍCIO ESTIMADO]],DetalhesDoProjeto[[#This Row],[TÉRMINO ESTIMADO]],FALSE)","v":58},{"$f":"DAYS360(DetalhesDoProjeto[[#This Row],[INÍCIO REAL]],DetalhesDoProjeto[[#This Row],[TÉRMINO REAL]],FALSE)","v":64},{"$f":"INDEX(Parâmetros[],MATCH(DetalhesDoProjeto[[#This Row],[TIPO DE PROJETO]],Parâmetros[TIPO DE PROJETO],0),MATCH(DetalhesDoProjeto[[#Headers],[GERENTE DE CONTAS]],Parâmetros[#Headers],0))*INDEX('PARÂMETROS DE PROJETO'!$B$12:$H$12,1,MATCH(DetalhesDoProjeto[[#Headers],[GERENTE DE CONTAS]],Parâmetros[#Headers],0))*DetalhesDoProjeto[[#This Row],[HORAS DE TRABALHO ESTIMADAS]]","v":{"v":7200,"d":"R$ 7,200"}},{"$f":"INDEX(Parâmetros[],MATCH(DetalhesDoProjeto[[#This Row],[TIPO DE PROJETO]],Parâmetros[TIPO DE PROJETO],0),MATCH(DetalhesDoProjeto[[#Headers],[GERENTE DE PROJETOS]],Parâmetros[#Headers],0))*INDEX('PARÂMETROS DE PROJETO'!$B$12:$H$12,1,MATCH(DetalhesDoProjeto[[#Headers],[GERENTE DE PROJETOS]],Parâmetros[#Headers],0))*DetalhesDoProjeto[[#This Row],[HORAS DE TRABALHO ESTIMADAS]]","v":{"v":2400,"d":"R$ 2,400"}},{"$f":"INDEX(Parâmetros[],MATCH(DetalhesDoProjeto[[#This Row],[TIPO DE PROJETO]],Parâmetros[TIPO DE PROJETO],0),MATCH(DetalhesDoProjeto[[#Headers],[GERENCIADOR DE ESTRATÉGIA]],Parâmetros[#Headers],0))*INDEX('PARÂMETROS DE PROJETO'!$B$12:$H$12,1,MATCH(DetalhesDoProjeto[[#Headers],[GERENCIADOR DE ESTRATÉGIA]],Parâmetros[#Headers],0))*DetalhesDoProjeto[[#This Row],[HORAS DE TRABALHO ESTIMADAS]]","v":{"v":18000,"d":"R$ 18,000"}},{"$f":"INDEX(Parâmetros[],MATCH(DetalhesDoProjeto[[#This Row],[TIPO DE PROJETO]],Parâmetros[TIPO DE PROJETO],0),MATCH(DetalhesDoProjeto[[#Headers],[ESPECIALISTA EM DESIGN]],Parâmetros[#Headers],0))*INDEX('PARÂMETROS DE PROJETO'!$B$12:$H$12,1,MATCH(DetalhesDoProjeto[[#Headers],[ESPECIALISTA EM DESIGN]],Parâmetros[#Headers],0))*DetalhesDoProjeto[[#This Row],[HORAS DE TRABALHO ESTIMADAS]]","v":{"v":0,"d":"R$ 0"}},{"$f":"INDEX(Parâmetros[],MATCH(DetalhesDoProjeto[[#This Row],[TIPO DE PROJETO]],Parâmetros[TIPO DE PROJETO],0),MATCH(DetalhesDoProjeto[[#Headers],[EQUIPE DO EVENTO]],Parâmetros[#Headers],0))*INDEX('PARÂMETROS DE PROJETO'!$B$12:$H$12,1,MATCH(DetalhesDoProjeto[[#Headers],[EQUIPE DO EVENTO]],Parâmetros[#Headers],0))*DetalhesDoProjeto[[#This Row],[HORAS DE TRABALHO ESTIMADAS]]","v":{"v":0,"d":"R$ 0"}},{"$f":"INDEX(Parâmetros[],MATCH(DetalhesDoProjeto[[#This Row],[TIPO DE PROJETO]],Parâmetros[TIPO DE PROJETO],0),MATCH(DetalhesDoProjeto[[#Headers],[ADMINISTRADOR DE EQUIPE]],Parâmetros[#Headers],0))*INDEX('PARÂMETROS DE PROJETO'!$B$12:$H$12,1,MATCH(DetalhesDoProjeto[[#Headers],[ADMINISTRADOR DE EQUIPE]],Parâmetros[#Headers],0))*DetalhesDoProjeto[[#This Row],[HORAS DE TRABALHO ESTIMADAS]]","v":{"v":1200,"d":"R$ 1,200"}},{"$f":"INDEX(Parâmetros[],MATCH(DetalhesDoProjeto[[#This Row],[TIPO DE PROJETO]],Parâmetros[TIPO DE PROJETO],0),MATCH(DetalhesDoProjeto[[#Headers],[GERENTE DE CONTAS]],Parâmetros[#Headers],0))*INDEX('PARÂMETROS DE PROJETO'!$B$12:$H$12,1,MATCH(DetalhesDoProjeto[[#Headers],[GERENTE DE CONTAS]],Parâmetros[#Headers],0))*DetalhesDoProjeto[[#This Row],[TRABALHO REAL]]","v":{"v":7920,"d":"R$ 7,920"}},{"$f":"INDEX(Parâmetros[],MATCH(DetalhesDoProjeto[[#This Row],[TIPO DE PROJETO]],Parâmetros[TIPO DE PROJETO],0),MATCH(DetalhesDoProjeto[[#Headers],[GERENTE DE PROJETOS]],Parâmetros[#Headers],0))*INDEX('PARÂMETROS DE PROJETO'!$B$12:$H$12,1,MATCH(DetalhesDoProjeto[[#Headers],[GERENTE DE PROJETOS]],Parâmetros[#Headers],0))*DetalhesDoProjeto[[#This Row],[TRABALHO REAL]]","v":{"v":2640,"d":"R$ 2,640"}},{"$f":"INDEX(Parâmetros[],MATCH(DetalhesDoProjeto[[#This Row],[TIPO DE PROJETO]],Parâmetros[TIPO DE PROJETO],0),MATCH(DetalhesDoProjeto[[#Headers],[GERENCIADOR DE ESTRATÉGIA]],Parâmetros[#Headers],0))*INDEX('PARÂMETROS DE PROJETO'!$B$12:$H$12,1,MATCH(DetalhesDoProjeto[[#Headers],[GERENCIADOR DE ESTRATÉGIA]],Parâmetros[#Headers],0))*DetalhesDoProjeto[[#This Row],[TRABALHO REAL]]","v":{"v":19800,"d":"R$ 19,800"}},{"$f":"INDEX(Parâmetros[],MATCH(DetalhesDoProjeto[[#This Row],[TIPO DE PROJETO]],Parâmetros[TIPO DE PROJETO],0),MATCH(DetalhesDoProjeto[[#Headers],[ESPECIALISTA EM DESIGN]],Parâmetros[#Headers],0))*INDEX('PARÂMETROS DE PROJETO'!$B$12:$H$12,1,MATCH(DetalhesDoProjeto[[#Headers],[ESPECIALISTA EM DESIGN]],Parâmetros[#Headers],0))*DetalhesDoProjeto[[#This Row],[TRABALHO REAL]]","v":{"v":0,"d":"R$ 0"}},{"$f":"INDEX(Parâmetros[],MATCH(DetalhesDoProjeto[[#This Row],[TIPO DE PROJETO]],Parâmetros[TIPO DE PROJETO],0),MATCH(DetalhesDoProjeto[[#Headers],[EQUIPE DO EVENTO]],Parâmetros[#Headers],0))*INDEX('PARÂMETROS DE PROJETO'!$B$12:$H$12,1,MATCH(DetalhesDoProjeto[[#Headers],[EQUIPE DO EVENTO]],Parâmetros[#Headers],0))*DetalhesDoProjeto[[#This Row],[TRABALHO REAL]]","v":{"v":0,"d":"R$ 0"}},{"$f":"INDEX(Parâmetros[],MATCH(DetalhesDoProjeto[[#This Row],[TIPO DE PROJETO]],Parâmetros[TIPO DE PROJETO],0),MATCH(DetalhesDoProjeto[[#Headers],[ADMINISTRADOR DE EQUIPE]],Parâmetros[#Headers],0))*INDEX('PARÂMETROS DE PROJETO'!$B$12:$H$12,1,MATCH(DetalhesDoProjeto[[#Headers],[ADMINISTRADOR DE EQUIPE]],Parâmetros[#Headers],0))*DetalhesDoProjeto[[#This Row],[TRABALHO REAL]]","v":{"v":1320,"d":"R$ 1,320"}}]
[null,"Projeto 2","Planejador de eventos",{"$f":"DATE(YEAR(TODAY())+1,6,25)","v":"2023-06-25"},{"$f":"DATE(YEAR(TODAY())+1,7,27)","v":"2023-07-27"},{"$f":"DATE(YEAR(TODAY()),7,15)","v":"2022-07-15"},{"$f":"DATE(YEAR(TODAY())+1,8,25)","v":"2023-08-25"},400,390,{"$f":"DAYS360(DetalhesDoProjeto[[#This Row],[INÍCIO ESTIMADO]],DetalhesDoProjeto[[#This Row],[TÉRMINO ESTIMADO]],FALSE)","v":32},{"$f":"DAYS360(DetalhesDoProjeto[[#This Row],[INÍCIO REAL]],DetalhesDoProjeto[[#This Row],[TÉRMINO REAL]],FALSE)","v":400},{"$f":"INDEX(Parâmetros[],MATCH(DetalhesDoProjeto[[#This Row],[TIPO DE PROJETO]],Parâmetros[TIPO DE PROJETO],0),MATCH(DetalhesDoProjeto[[#Headers],[GERENTE DE CONTAS]],Parâmetros[#Headers],0))*INDEX('PARÂMETROS DE PROJETO'!$B$12:$H$12,1,MATCH(DetalhesDoProjeto[[#Headers],[GERENTE DE CONTAS]],Parâmetros[#Headers],0))*DetalhesDoProjeto[[#This Row],[HORAS DE TRABALHO ESTIMADAS]]","v":{"v":14400,"d":"R$ 14,400"}},{"$f":"INDEX(Parâmetros[],MATCH(DetalhesDoProjeto[[#This Row],[TIPO DE PROJETO]],Parâmetros[TIPO DE PROJETO],0),MATCH(DetalhesDoProjeto[[#Headers],[GERENTE DE PROJETOS]],Parâmetros[#Headers],0))*INDEX('PARÂMETROS DE PROJETO'!$B$12:$H$12,1,MATCH(DetalhesDoProjeto[[#Headers],[GERENTE DE PROJETOS]],Parâmetros[#Headers],0))*DetalhesDoProjeto[[#This Row],[HORAS DE TRABALHO ESTIMADAS]]","v":{"v":24000,"d":"R$ 24,000"}},{"$f":"INDEX(Parâmetros[],MATCH(DetalhesDoProjeto[[#This Row],[TIPO DE PROJETO]],Parâmetros[TIPO DE PROJETO],0),MATCH(DetalhesDoProjeto[[#Headers],[GERENCIADOR DE ESTRATÉGIA]],Parâmetros[#Headers],0))*INDEX('PARÂMETROS DE PROJETO'!$B$12:$H$12,1,MATCH(DetalhesDoProjeto[[#Headers],[GERENCIADOR DE ESTRATÉGIA]],Parâmetros[#Headers],0))*DetalhesDoProjeto[[#This Row],[HORAS DE TRABALHO ESTIMADAS]]","v":{"v":6000,"d":"R$ 6,000"}},{"$f":"INDEX(Parâmetros[],MATCH(DetalhesDoProjeto[[#This Row],[TIPO DE PROJETO]],Parâmetros[TIPO DE PROJETO],0),MATCH(DetalhesDoProjeto[[#Headers],[ESPECIALISTA EM DESIGN]],Parâmetros[#Headers],0))*INDEX('PARÂMETROS DE PROJETO'!$B$12:$H$12,1,MATCH(DetalhesDoProjeto[[#Headers],[ESPECIALISTA EM DESIGN]],Parâmetros[#Headers],0))*DetalhesDoProjeto[[#This Row],[HORAS DE TRABALHO ESTIMADAS]]","v":{"v":4000,"d":"R$ 4,000"}},{"$f":"INDEX(Parâmetros[],MATCH(DetalhesDoProjeto[[#This Row],[TIPO DE PROJETO]],Parâmetros[TIPO DE PROJETO],0),MATCH(DetalhesDoProjeto[[#Headers],[EQUIPE DO EVENTO]],Parâmetros[#Headers],0))*INDEX('PARÂMETROS DE PROJETO'!$B$12:$H$12,1,MATCH(DetalhesDoProjeto[[#Headers],[EQUIPE DO EVENTO]],Parâmetros[#Headers],0))*DetalhesDoProjeto[[#This Row],[HORAS DE TRABALHO ESTIMADAS]]","v":{"v":0,"d":"R$ 0"}},{"$f":"INDEX(Parâmetros[],MATCH(DetalhesDoProjeto[[#This Row],[TIPO DE PROJETO]],Parâmetros[TIPO DE PROJETO],0),MATCH(DetalhesDoProjeto[[#Headers],[ADMINISTRADOR DE EQUIPE]],Parâmetros[#Headers],0))*INDEX('PARÂMETROS DE PROJETO'!$B$12:$H$12,1,MATCH(DetalhesDoProjeto[[#Headers],[ADMINISTRADOR DE EQUIPE]],Parâmetros[#Headers],0))*DetalhesDoProjeto[[#This Row],[HORAS DE TRABALHO ESTIMADAS]]","v":{"v":2400,"d":"R$ 2,400"}},{"$f":"INDEX(Parâmetros[],MATCH(DetalhesDoProjeto[[#This Row],[TIPO DE PROJETO]],Parâmetros[TIPO DE PROJETO],0),MATCH(DetalhesDoProjeto[[#Headers],[GERENTE DE CONTAS]],Parâmetros[#Headers],0))*INDEX('PARÂMETROS DE PROJETO'!$B$12:$H$12,1,MATCH(DetalhesDoProjeto[[#Headers],[GERENTE DE CONTAS]],Parâmetros[#Headers],0))*DetalhesDoProjeto[[#This Row],[TRABALHO REAL]]","v":{"v":14040,"d":"R$ 14,040"}},{"$f":"INDEX(Parâmetros[],MATCH(DetalhesDoProjeto[[#This Row],[TIPO DE PROJETO]],Parâmetros[TIPO DE PROJETO],0),MATCH(DetalhesDoProjeto[[#Headers],[GERENTE DE PROJETOS]],Parâmetros[#Headers],0))*INDEX('PARÂMETROS DE PROJETO'!$B$12:$H$12,1,MATCH(DetalhesDoProjeto[[#Headers],[GERENTE DE PROJETOS]],Parâmetros[#Headers],0))*DetalhesDoProjeto[[#This Row],[TRABALHO REAL]]","v":{"v":23400,"d":"R$ 23,400"}},{"$f":"INDEX(Parâmetros[],MATCH(DetalhesDoProjeto[[#This Row],[TIPO DE PROJETO]],Parâmetros[TIPO DE PROJETO],0),MATCH(DetalhesDoProjeto[[#Headers],[GERENCIADOR DE ESTRATÉGIA]],Parâmetros[#Headers],0))*INDEX('PARÂMETROS DE PROJETO'!$B$12:$H$12,1,MATCH(DetalhesDoProjeto[[#Headers],[GERENCIADOR DE ESTRATÉGIA]],Parâmetros[#Headers],0))*DetalhesDoProjeto[[#This Row],[TRABALHO REAL]]","v":{"v":5850,"d":"R$ 5,850"}},{"$f":"INDEX(Parâmetros[],MATCH(DetalhesDoProjeto[[#This Row],[TIPO DE PROJETO]],Parâmetros[TIPO DE PROJETO],0),MATCH(DetalhesDoProjeto[[#Headers],[ESPECIALISTA EM DESIGN]],Parâmetros[#Headers],0))*INDEX('PARÂMETROS DE PROJETO'!$B$12:$H$12,1,MATCH(DetalhesDoProjeto[[#Headers],[ESPECIALISTA EM DESIGN]],Parâmetros[#Headers],0))*DetalhesDoProjeto[[#This Row],[TRABALHO REAL]]","v":{"v":3900,"d":"R$ 3,900"}},{"$f":"INDEX(Parâmetros[],MATCH(DetalhesDoProjeto[[#This Row],[TIPO DE PROJETO]],Parâmetros[TIPO DE PROJETO],0),MATCH(DetalhesDoProjeto[[#Headers],[EQUIPE DO EVENTO]],Parâmetros[#Headers],0))*INDEX('PARÂMETROS DE PROJETO'!$B$12:$H$12,1,MATCH(DetalhesDoProjeto[[#Headers],[EQUIPE DO EVENTO]],Parâmetros[#Headers],0))*DetalhesDoProjeto[[#This Row],[TRABALHO REAL]]","v":{"v":0,"d":"R$ 0"}},{"$f":"INDEX(Parâmetros[],MATCH(DetalhesDoProjeto[[#This Row],[TIPO DE PROJETO]],Parâmetros[TIPO DE PROJETO],0),MATCH(DetalhesDoProjeto[[#Headers],[ADMINISTRADOR DE EQUIPE]],Parâmetros[#Headers],0))*INDEX('PARÂMETROS DE PROJETO'!$B$12:$H$12,1,MATCH(DetalhesDoProjeto[[#Headers],[ADMINISTRADOR DE EQUIPE]],Parâmetros[#Headers],0))*DetalhesDoProjeto[[#This Row],[TRABALHO REAL]]","v":{"v":2340,"d":"R$ 2,340"}}]
{"$rows_left_out":5}
{"sheet":"TOTAIS DO PROJETO","index":3,"n_rows":10,"n_cols":14,"rows_kept":10}
[null,{"$f":"'PARÂMETROS DE PROJETO'!B1","v":"Nome da Empresa"}]
[null,"O controlador de projeto de gerenciamento do evento"]
[null,{"$f":"'PARÂMETROS DE PROJETO'!B3","v":"Nome da Empresa Confidencial"}]
["A tabela dinâmica começando na célula à direita é atualizada automaticamente.\nINFORMAÇÕES\nPara atualizar a tabela dinâmica à direita, selecione-a (qualquer célula dentro da tabela dinâmica) com as ferramentas de tabela dinâmica | guia faixa de ANÁLISE, selecione Atualizar ou pressione a tecla SHIFT+F10 em qualquer célula na tabela dinâmica e selecione Atualizar.","NOME DO PROJETO","GERENTE DE CONTAS ESTIMADO","GERENTE DE PROJETOS ESTIMADO","GERENCIADOR DE ESTRATÉGIA ESTIMADO","ESPECIALISTA EM DESIGN ESTIMADO","EQUIPE DO EVENTO ESTIMADO","ADMINISTRADOR DE EQUIPE ESTIMADO","GERENTE DE CONTAS REAL","GERENTE DE PROJETOS REAL","GERENCIADOR DE ESTRATÉGIA REAL","ESPECIALISTA EM DESIGN REAL","EQUIPE DO EVENTO REAL","ADMINISTRADOR DE EQUIPE REAL"]
[null,"Projeto 1",{"v":7200,"d":"R$ 7,200.00"},{"v":2400,"d":"R$ 2,400.00"},{"v":18000,"d":"R$ 18,000.00"},{"v":0,"d":"R$ 0.00"},{"v":0,"d":"R$ 0.00"},{"v":1200,"d":"R$ 1,200.00"},{"v":7920,"d":"R$ 7,920.00"},{"v":2640,"d":"R$ 2,640.00"},{"v":19800,"d":"R$ 19,800.00"},{"v":0,"d":"R$ 0.00"},{"v":0,"d":"R$ 0.00"},{"v":1320,"d":"R$ 1,320.00"}]
[null,"Projeto 2",{"v":14400,"d":"R$ 14,400.00"},{"v":24000,"d":"R$ 24,000.00"},{"v":6000,"d":"R$ 6,000.00"},{"v":4000,"d":"R$ 4,000.00"},{"v":0,"d":"R$ 0.00"},{"v":2400,"d":"R$ 2,400.00"},{"v":14040,"d":"R$ 14,040.00"},{"v":23400,"d":"R$ 23,400.00"},{"v":5850,"d":"R$ 5,850.00"},{"v":3900,"d":"R$ 3,900.00"},{"v":0,"d":"R$ 0.00"},{"v":2340,"d":"R$ 2,340.00"}]
{"$rows_left_out":4}