{"text_format":"3","workbook":"xlsx","n_sheets":3,"sheets":["Entrada de Dados de Medicação","Agenda Semanal Imprimível","Posologia"],"not_rendered":{"external_links":3,"defined_names":9},"read":"whole","date_system":"1900"}

{"sheet":"Entrada de Dados de Medicação","index":0,"n_rows":7,"n_cols":8,"rows_kept":7}
[]
[{"$nulls":3},"ENTRADA DE DADOS DE MEDICAÇÃO"]
[]
[{"$nulls":3},"Dia","Data","Medicação","Tomado à(s)","Diário nos Restantes"]
[{"$nulls":3},{"$f":"IF(Agenda[[#This Row],[Data]]=\"\",\"-\",CHOOSE(WEEKDAY(Agenda[[#This Row],[Data]]),\"Domingo\",\"Segunda-feira\",\"Terça-feira\",\"Quarta-feira\",\"Quinta-feira\",\"Sexta-feira\",\"Sábado\"))","v":"Terça-feira"},"2013-06-04","Medicação para tireoide","07:00:00",{"$f":"IFERROR(VLOOKUP(Agenda[[#This Row],[Medicação]],Posologia!$D$5:$H$8,5,0)-COUNTIFS(Agenda[Medicação],Agenda[[#This Row],[Medicação]],Agenda[Data],Agenda[[#This Row],[Data]]),\"\")","v":1}]
[{"$nulls":3},{"$f":"IF(Agenda[[#This Row],[Data]]=\"\",\"-\",CHOOSE(WEEKDAY(Agenda[[#This Row],[Data]]),\"Domingo\",\"Segunda-feira\",\"Terça-feira\",\"Quarta-feira\",\"Quinta-feira\",\"Sexta-feira\",\"Sábado\"))","v":"Terça-feira"},"2013-06-04","Complexo Multivitamínico","08:00:00",{"$f":"IFERROR(VLOOKUP(Agenda[[#This Row],[Medicação]],Posologia!$D$5:$H$8,5,0)-COUNTIFS(Agenda[Medicação],Agenda[[#This Row],[Medicação]],Agenda[Data],Agenda[[#This Row],[Data]]),\"\")","v":0}]
[{"$nulls":3},{"$f":"IF(Agenda[[#This Row],[Data]]=\"\",\"-\",CHOOSE(WEEKDAY(Agenda[[#This Row],[Data]]),\"Domingo\",\"Segunda-feira\",\"Terça-feira\",\"Quarta-feira\",\"Quinta-feira\",\"Sexta-feira\",\"Sábado\"))","v":"Terça-feira"},"2013-06-04","Vitaminas oftalmológicas","10:00:00",{"$f":"IFERROR(VLOOKUP(Agenda[[#This Row],[Medicação]],Posologia!$D$5:$H$8,5,0)-COUNTIFS(Agenda[Medicação],Agenda[[#This Row],[Medicação]],Agenda[Data],Agenda[[#This Row],[Data]]),\"\")","v":0}]

{"sheet":"Agenda Semanal Imprimível","index":1,"n_rows":7,"n_cols":10,"rows_kept":7}
[]
[{"$nulls":3},"AGENDA DE MEDICAÇÃO"]
[]
[{"$nulls":3},"Domingo","Segunda-feira","Terça-feira","Quarta-feira","Quinta-feira","Sexta-feira","Sábado"]
[{"$nulls":3},"Medicação para tireoide","Medicação para tireoide","Medicação para tireoide","Medicação para tireoide","Medicação para tireoide","Medicação para tireoide","Medicação para tireoide"]
[{"$nulls":3},"Vitaminas Oftalmológicas","Vitaminas Oftalmológicas","Vitaminas Oftalmológicas","Vitaminas Oftalmológicas","Vitaminas Oftalmológicas","Vitaminas Oftalmológicas","Vitaminas Oftalmológicas"]
[{"$nulls":3},"Complexo Multivitamínico","Complexo Multivitamínico","Complexo Multivitamínico","Complexo Multivitamínico","Complexo Multivitamínico","Complexo Multivitamínico","Complexo Multivitamínico"]

{"sheet":"Posologia","index":2,"n_rows":8,"n_cols":8,"rows_kept":8}
[]
[{"$nulls":3},"POSOLOGIA"]
[]
[{"$nulls":3},"Medicações","A cada","Frequência","Ativo","Por Dia"]
[{"$nulls":3},"Medicação para tireoide",2,"Dia","Sim",{"$f":"IF(OR(Posologia!$F5=\"Conforme a necessidade\",Posologia!$G5=\"No\"),0,Posologia!$E5*LOOKUP(Posologia!$F5,{\"Dia\",1;\"Horas\",3}))","v":2}]
[{"$nulls":3},"Complexo Multivitamínico",1,"Dia","Sim",{"$f":"IF(OR(Posologia!$F6=\"Conforme a necessidade\",Posologia!$G6=\"No\"),0,Posologia!$E6*LOOKUP(Posologia!$F6,{\"Dia\",1;\"Horas\",3}))","v":1}]
[{"$nulls":3},"Vitaminas oftalmológicas",1,"Dia","Sim",{"$f":"IF(OR(Posologia!$F7=\"Conforme a necessidade\",Posologia!$G7=\"No\"),0,Posologia!$E7*LOOKUP(Posologia!$F7,{\"Dia\",1;\"Horas\",3}))","v":1}]
[{"$nulls":3},"Ibuprofen",1,"Conforme a necessidade","Não",{"$f":"IF(OR(Posologia!$F8=\"Conforme a necessidade\",Posologia!$G8=\"No\"),0,Posologia!$E8*LOOKUP(Posologia!$F8,{\"Dia\",1;\"Horas\",3}))","v":0}]