{"text_format":"3","workbook":"xlsx","n_sheets":3,"sheets":["Dziennik szkoleń","Lista kursów","Informacje o pracownikach"],"not_rendered":{"defined_names":13},"read":"whole","date_system":"1900"}

{"sheet":"Dziennik szkoleń","index":0,"n_rows":23,"n_cols":9,"rows_kept":23}
[]
[]
[null,null,"DZIENNIK SZKOLEŃ"]
{"$rows_empty":8}
[null,null,"DATA SZKOLENIA","IMIĘ I NAZWISKO","KURS","OSOBA PROWADZĄCA","UDZIAŁ","ZALICZONY/NIEZALICZONY","UWAGI"]
[null,null,"2012-06-01","Tomasz Bator","Wprowadzenie dla pracowników",{"$f":"IF(tbl_Dziennik_szkoleń[[#This Row],[KURS]]=\"\",\"\",IFERROR(VLOOKUP(tbl_Dziennik_szkoleń[[#This Row],[KURS]],tbl_Lista_kursów[],2,0),\"Not Found\"))","v":"Krzysztof Florczak"},"Tak","Zaliczony","Świetna osoba prowadząca."]
[null,null,"2012-06-02","Wojciech Dyszkiewicz","Wprowadzenie dla pracowników",{"$f":"IF(tbl_Dziennik_szkoleń[[#This Row],[KURS]]=\"\",\"\",IFERROR(VLOOKUP(tbl_Dziennik_szkoleń[[#This Row],[KURS]],tbl_Lista_kursów[],2,0),\"Not Found\"))","v":"Krzysztof Florczak"},"Tak","Niezaliczony","Musiał szybciej wyjść, nie mógł ukończyć."]
[null,null,"2012-06-03","Rafał Misztal","Wprowadzenie dla pracowników",{"$f":"IF(tbl_Dziennik_szkoleń[[#This Row],[KURS]]=\"\",\"\",IFERROR(VLOOKUP(tbl_Dziennik_szkoleń[[#This Row],[KURS]],tbl_Lista_kursów[],2,0),\"Not Found\"))","v":"Krzysztof Florczak"},"Tak","Zaliczony","Ostatnia możliwość w tym kwartale."]
[null,null,"2012-06-03","Wojciech Dyszkiewicz","Wprowadzenie dla pracowników",{"$f":"IF(tbl_Dziennik_szkoleń[[#This Row],[KURS]]=\"\",\"\",IFERROR(VLOOKUP(tbl_Dziennik_szkoleń[[#This Row],[KURS]],tbl_Lista_kursów[],2,0),\"Not Found\"))","v":"Krzysztof Florczak"},"Tak","Zaliczony","Ostatnia możliwość w tym kwartale."]
[null,null,"2012-06-04","Wojciech Dyszkiewicz","Zakres działań pracowników",{"$f":"IF(tbl_Dziennik_szkoleń[[#This Row],[KURS]]=\"\",\"\",IFERROR(VLOOKUP(tbl_Dziennik_szkoleń[[#This Row],[KURS]],tbl_Lista_kursów[],2,0),\"Not Found\"))","v":"Joanna Rybka"},"Tak","Zaliczony","Pierwsza możliwość w tym kwartale."]
[null,null,"2012-06-04","Rafał Misztal","Zakres działań pracowników",{"$f":"IF(tbl_Dziennik_szkoleń[[#This Row],[KURS]]=\"\",\"\",IFERROR(VLOOKUP(tbl_Dziennik_szkoleń[[#This Row],[KURS]],tbl_Lista_kursów[],2,0),\"Not Found\"))","v":"Joanna Rybka"},"Tak","Zaliczony","Pierwsza możliwość w tym kwartale."]
[null,null,"2012-06-04","Rafał Misztal","Księgowość dla średniozaawansowanych",{"$f":"IF(tbl_Dziennik_szkoleń[[#This Row],[KURS]]=\"\",\"\",IFERROR(VLOOKUP(tbl_Dziennik_szkoleń[[#This Row],[KURS]],tbl_Lista_kursów[],2,0),\"Not Found\"))","v":"Joanna Rybka"},"Tak","Zaliczony","Szkolenie zamknięte."]
[null,null,"2012-06-04","Tomasz Bator","Zakres działań pracowników",{"$f":"IF(tbl_Dziennik_szkoleń[[#This Row],[KURS]]=\"\",\"\",IFERROR(VLOOKUP(tbl_Dziennik_szkoleń[[#This Row],[KURS]],tbl_Lista_kursów[],2,0),\"Not Found\"))","v":"Joanna Rybka"},"Tak","Zaliczony","Pierwsza możliwość w tym kwartale."]
[null,null,"2012-06-05","Tomasz Bator","Księgowość dla średniozaawansowanych",{"$f":"IF(tbl_Dziennik_szkoleń[[#This Row],[KURS]]=\"\",\"\",IFERROR(VLOOKUP(tbl_Dziennik_szkoleń[[#This Row],[KURS]],tbl_Lista_kursów[],2,0),\"Not Found\"))","v":"Joanna Rybka"},"Nie","Planowany","Pracownik nie brał jeszcze udziału."]
[null,null,"2012-06-05","Wojciech Dyszkiewicz","Księgowość dla zaawansowanych",{"$f":"IF(tbl_Dziennik_szkoleń[[#This Row],[KURS]]=\"\",\"\",IFERROR(VLOOKUP(tbl_Dziennik_szkoleń[[#This Row],[KURS]],tbl_Lista_kursów[],2,0),\"Not Found\"))","v":"Krzysztof Florczak"},"Nie","Planowany","Pracownik nie brał jeszcze udziału."]
[{"$nulls":5},{"$f":"IF(tbl_Dziennik_szkoleń[[#This Row],[KURS]]=\"\",\"\",IFERROR(VLOOKUP(tbl_Dziennik_szkoleń[[#This Row],[KURS]],tbl_Lista_kursów[],2,0),\"Not Found\"))","v":""}]

{"sheet":"Lista kursów","index":1,"n_rows":10,"n_cols":6,"rows_kept":10}
[]
[]
[null,null,"LISTA KURSÓW"]
[]
[null,null,"TYTUŁ","OSOBA PROWADZĄCA","OPIS","GODZINY"]
[null,null,"Wprowadzenie dla pracowników","Krzysztof Florczak","Podstawowy kurs wprowadzający dla nowych pracowników. Przedstawia cele i oczekiwania poszczególnych działów oraz ramy czasowe i ograniczenia.",2]
[null,null,"Zakres działań pracowników","Joanna Rybka","Podstawowe działania pracowników wraz z zestawem porad.",1]
[null,null,"Zakres działań pracowników","Krzysztof Florczak","Procedury i wytyczne dotyczące księgowości — poziom podstawowy.",1.5]
[null,null,"Księgowość dla średniozaawansowanych","Joanna Rybka","Procedury i wytyczne dotyczące księgowości — poziom średniozaawansowany.",2]
[null,null,"Księgowość dla zaawansowanych","Krzysztof Florczak","Procedury i wytyczne dotyczące księgowości — poziom zaawansowany.",2]

{"sheet":"Informacje o pracownikach","index":2,"n_rows":9,"n_cols":5,"rows_kept":9}
[]
[]
[null,null,"INFORMACJE O PRACOWNIKACH"]
[]
[null,null,"IMIĘ I NAZWISKO","DZIAŁ","TYTUŁ"]
[null,null,"Tomasz Bator","Sprzedaż","Główny księgowy"]
[null,null,"Wojciech Dyszkiewicz","Księgowość","Księgowy"]
[null,null,"Rafał Misztal","Księgowość","Księgowy"]
[null,null,"Ewa Lesiak","Księgowość","Księgowy"]