{"text_format":"3","workbook":"xlsx","n_sheets":3,"sheets":["Dane sprzedaży","Raport sprzedaży","Zapasy"],"not_rendered":{"defined_names":10,"pivot_tables":1},"read":"whole","date_system":"1900"}

{"sheet":"Dane sprzedaży","index":0,"n_rows":13,"n_cols":11,"rows_kept":13}
[]
[null,"DZIENNA SPRZEDAŻ Z KASY FISKALNEJ"]
[]
[]
[]
[{"$nulls":10}," "]
[{"$nulls":10}," "]
[null,"DATA","GODZINA","NUMER TRANSAKCJI","JEDNOSTKA SKU/NR PRODUKTU","OPIS","KWOTA SPRZEDAŻY","STAWKA PODATKU (%)","KWOTA PODATKU OD SPRZEDAŻY","SUMA"]
[null,{"v":40940,"d":"4094000.00%"},"10:30:00",1001,90001,{"$f":"IFERROR(IF(ISNA(VLOOKUP('Dane sprzedaży'!$E9,tblZapasy[],2,0)),\"\",VLOOKUP('Dane sprzedaży'!$E9,tblZapasy[],2,0)),\"Nie odnaleziono opisu\")","v":"Koc"},{"v":74.95,"d":"74.95 zł"},{"v":0.05,"d":"5.00%"},{"$f":"'Dane sprzedaży'!$G9*'Dane sprzedaży'!$H9","v":{"v":3.7475000000000005,"d":"3.75 zł"}},{"$f":"'Dane sprzedaży'!$G9+'Dane sprzedaży'!$I9","v":{"v":78.6975,"d":"78.70 zł"}}]
[null,{"v":40940,"d":"4094000.00%"},"10:33:00",1002,90023,{"$f":"IFERROR(IF(ISNA(VLOOKUP('Dane sprzedaży'!$E10,tblZapasy[],2,0)),\"\",VLOOKUP('Dane sprzedaży'!$E10,tblZapasy[],2,0)),\"Nie odnaleziono opisu\")","v":"Obrus okrągły, 60 cm"},{"v":34.99,"d":"34.99 zł"},{"v":0.05,"d":"5.00%"},{"$f":"'Dane sprzedaży'!$G10*'Dane sprzedaży'!$H10","v":{"v":1.7495000000000003,"d":"1.75 zł"}},{"$f":"'Dane sprzedaży'!$G10+'Dane sprzedaży'!$I10","v":{"v":36.7395,"d":"36.74 zł"}}]
[null,{"v":40940,"d":"4094000.00%"},"10:45:00",1003,90005,{"$f":"IFERROR(IF(ISNA(VLOOKUP('Dane sprzedaży'!$E11,tblZapasy[],2,0)),\"\",VLOOKUP('Dane sprzedaży'!$E11,tblZapasy[],2,0)),\"Nie odnaleziono opisu\")","v":"Talerz okrągły"},{"v":55.95,"d":"55.95 zł"},{"v":0.05,"d":"5.00%"},{"$f":"'Dane sprzedaży'!$G11*'Dane sprzedaży'!$H11","v":{"v":2.7975000000000003,"d":"2.80 zł"}},{"$f":"'Dane sprzedaży'!$G11+'Dane sprzedaży'!$I11","v":{"v":58.7475,"d":"58.75 zł"}}]
[null,{"v":40940,"d":"4094000.00%"},"10:55:00",1004,90004,{"$f":"IFERROR(IF(ISNA(VLOOKUP('Dane sprzedaży'!$E12,tblZapasy[],2,0)),\"\",VLOOKUP('Dane sprzedaży'!$E12,tblZapasy[],2,0)),\"Nie odnaleziono opisu\")","v":"Talerz kwadratowy"},{"v":2.95,"d":"2.95 zł"},{"v":0.05,"d":"5.00%"},{"$f":"'Dane sprzedaży'!$G12*'Dane sprzedaży'!$H12","v":{"v":0.14750000000000002,"d":"0.15 zł"}},{"$f":"'Dane sprzedaży'!$G12+'Dane sprzedaży'!$I12","v":{"v":3.0975,"d":"3.10 zł"}}]
[null,{"v":40940,"d":"4094000.00%"},"11:45:00",1005,90002,{"$f":"IFERROR(IF(ISNA(VLOOKUP('Dane sprzedaży'!$E13,tblZapasy[],2,0)),\"\",VLOOKUP('Dane sprzedaży'!$E13,tblZapasy[],2,0)),\"Nie odnaleziono opisu\")","v":"Poduszka"},{"v":14.98,"d":"14.98 zł"},{"v":0.05,"d":"5.00%"},{"$f":"'Dane sprzedaży'!$G13*'Dane sprzedaży'!$H13","v":{"v":0.7490000000000001,"d":"0.75 zł"}},{"$f":"'Dane sprzedaży'!$G13+'Dane sprzedaży'!$I13","v":{"v":15.729000000000001,"d":"15.73 zł"}}]

{"sheet":"Raport sprzedaży","index":1,"n_rows":14,"n_cols":7,"rows_kept":14}
[]
[null,"DZIENNA SPRZEDAŻ Z KASY FISKALNEJ"]
[]
[]
[]
[]
[]
[null,"JEDNOSTKA SKU/NR PRODUKTU","OPIS","DATA","KWOTA SPRZEDAŻY ","KWOTA PODATKU OD SPRZEDAŻY ","SUMA "]
[null,90001,"Koc",{"v":40940,"d":"4094000.00%"},{"v":74.95,"d":"74.95 zł"},{"v":3.7475000000000005,"d":"3.75 zł"},{"v":78.6975,"d":"78.70 zł"}]
[null,90002,"Poduszka",{"v":40940,"d":"4094000.00%"},{"v":14.98,"d":"14.98 zł"},{"v":0.7490000000000001,"d":"0.75 zł"},{"v":15.729000000000001,"d":"15.73 zł"}]
[null,90004,"Talerz kwadratowy",{"v":40940,"d":"4094000.00%"},{"v":2.95,"d":"2.95 zł"},{"v":0.14750000000000002,"d":"0.15 zł"},{"v":3.0975,"d":"3.10 zł"}]
[null,90005,"Talerz okrągły",{"v":40940,"d":"4094000.00%"},{"v":55.95,"d":"55.95 zł"},{"v":2.7975000000000003,"d":"2.80 zł"},{"v":58.7475,"d":"58.75 zł"}]
[null,90023,"Obrus okrągły, 60 cm",{"v":40940,"d":"4094000.00%"},{"v":34.99,"d":"34.99 zł"},{"v":1.7495000000000003,"d":"1.75 zł"},{"v":36.7395,"d":"36.74 zł"}]
[null,"Suma końcowa",null,null,{"v":183.82000000000002,"d":"183.82 zł"},{"v":9.191000000000003,"d":"9.19 zł"},{"v":193.011,"d":"193.01 zł"}]

{"sheet":"Zapasy","index":2,"n_rows":31,"n_cols":3,"rows_kept":31}
[]
[null,"DZIENNA SPRZEDAŻ Z KASY FISKALNEJ"]
[]
[]
[]
[]
[]
[null,"JEDNOSTKA SKU/NR PRODUKTU","OPIS"]
[null,90001,"Koc"]
[null,90002,"Poduszka"]
[null,90003,"Prześcieradła"]
[null,90004,"Talerz kwadratowy"]
[null,90005,"Talerz okrągły"]
[null,90006,"Misa duża"]
[null,90007,"Misa mała"]
[null,90008,"Talerz okrągły, mały"]
[null,90009,"Widelec, mały"]
[null,90010,"Widelec, duży"]
[null,90011,"Łyżka, mała"]
[null,90012,"Łyżka, duża"]
[null,90013,"Nóż do masła, mały"]
[null,90014,"Nóż do masła, duży"]
[null,90015,"Obrus, 10 x 5"]
[null,90016,"Obrus, 8 x 5"]
[null,90017,"Obrus, 8 x 8"]
[null,90018,"Obrus, 6 x 6"]
[null,90019,"Obrus, 6 x 4"]
[null,90020,"Obrus, 4 x 4"]
[null,90021,"Obrus okrągły, 100 cm"]
[null,90022,"Obrus okrągły, 80 cm"]
[null,90023,"Obrus okrągły, 60 cm"]