{"text_format":"3","workbook":"xlsx","n_sheets":4,"sheets":["BEGIN","PROJECTPARAMETERS","PROJECTGEGEVENS","PROJECTTOTALEN"],"not_rendered":{"charts":2,"defined_names":3,"pivot_tables":1},"read":"whole","date_system":"1900"}

{"sheet":"BEGIN","index":0,"n_rows":7,"n_cols":2,"rows_kept":7}
[null,"OVER DEZE SJABLOON"]
[null,"In deze werkmap kunt u de projectparameters, projectgegevens en projecttotalen bijhouden voor het evenement dat u wilt organiseren."]
[null,"Voer de gegevens in op het werkblad Projectparameters om de kolomdiagrammen bij te werken. Voer tevens de gegevens in op het werkblad Projectgegevens. De draaitabel op het werkblad Projecttotalen wordt automatisch bijgewerkt."]
[null,"Voer de bedrijfsnaam in op het werkblad Projectparameters om deze op alle werkbladen automatisch bij te werken."]
[null,"Opmerking:  "]
[null,"In kolom A van elk werkblad in deze werkmap staan aanvullende instructies. Deze tekst is opzettelijk verborgen. Als u tekst wilt verwijderen, selecteert u kolom A en drukt u op Delete. Als u de tekst zichtbaar wilt maken, selecteert u kolom A en wijzigt u de tekenkleur."]
{"$rows_left_out":2}
{"sheet":"PROJECTPARAMETERS","index":1,"n_rows":19,"n_cols":9,"rows_kept":19,"merged":[[23,1,42,3]]}
[null,"Bedrijfsnaam"]
[null,"Tracker voor evenementenbeheerproject"]
[null,{"$f":"B1&\" Vertrouwelijk\"","v":"Bedrijfsnaam Vertrouwelijk"}]
[null,"Gearceerde cellen worden voor u berekend. U hoeft ze niet in te vullen."]
[null,"PROJECTTYPE","ACCOUNTMANAGER","PROJECTMANAGER","STRATEGIEMANAGER","ONTWERPDESKUNDIGE","PERSONEEL EVENEMENT","PERSONEEL ADMINISTRATIE","Totaal"]
[null,"Ontwikkeling van evenementstrategie",{"v":0.2,"d":"20%"},{"v":0.1,"d":"10%"},{"v":0.6,"d":"60%"},{"v":0,"d":"0%"},{"v":0,"d":"0%"},{"v":0.1,"d":"10%"},{"$f":"SUM(Parameters[[#This Row],[ACCOUNTMANAGER]:[PERSONEEL ADMINISTRATIE]])","v":{"v":1,"d":"100%"}}]
{"$rows_left_out":14}
{"sheet":"PROJECTGEGEVENS","index":2,"n_rows":10,"n_cols":23,"rows_kept":10}
[null,{"$f":"PROJECTPARAMETERS!B1","v":"Bedrijfsnaam"}]
[null,"Tracker voor evenementenbeheerproject"]
[null,{"$f":"PROJECTPARAMETERS!B3","v":"Bedrijfsnaam Vertrouwelijk"}]
["Typ de projectgegevens in de tabel die in de cel rechts begint.\nINFORMATIE\nAls u een rij aan de tabel rechts wilt toevoegen, selecteert u de laatste cel rechtsonder in de tabel (niet de rij met totalen) en drukt u op Tab. U kunt ook op Shift+F10 drukken op de plek waar u de rij wilt invoegen. Kies dan voor Invoegen > Tabelrijen boven/onder.\nZorg ervoor dat u ongebruikte rijen verwijdert. De draaitabel Projecttotalen gebruikt alle cellen in de berekening. Wanneer er ongebruikte cellen voorkomen, kunnen de resultaten onjuist zijn.","PROJECTNAAM","PROJECTTYPE","GESCHATTE BEGINDATUM","GESCHATTE EINDDATUM","WERKELIJKE BEGINDATUM","WERKELIJKE EINDDATUM","GESCHATTE WERKUREN","WERKELIJKE WERKUREN","GESCHATTE DUUR","WERKELIJKE DUUR","ACCOUNTMANAGER","PROJECTMANAGER","STRATEGIEMANAGER","ONTWERPDESKUNDIGE","PERSONEEL EVENEMENT","PERSONEEL ADMINISTRATIE","ACCOUNTMANAGER ","PROJECTMANAGER ","STRATEGIEMANAGER ","ONTWERPDESKUNDIGE ","PERSONEEL EVENEMENT ","PERSONEEL ADMINISTRATIE "]
[null,"Project 1","Ontwikkeling van evenementstrategie",{"$f":"DATE(YEAR(TODAY()),6,9)","v":"2022-06-09"},{"$f":" DATE(YEAR(TODAY()),8,7)","v":"2022-08-07"},{"$f":"DATE(YEAR(TODAY()),6,29)","v":"2022-06-29"},{"$f":"DATE(YEAR(TODAY()),9,3)","v":"2022-09-03"},200,220,{"$f":"DAYS360(Projectgegevens[[#This Row],[GESCHATTE BEGINDATUM]],Projectgegevens[[#This Row],[GESCHATTE EINDDATUM]],FALSE)","v":58},{"$f":"DAYS360(Projectgegevens[[#This Row],[WERKELIJKE BEGINDATUM]],Projectgegevens[[#This Row],[WERKELIJKE EINDDATUM]],FALSE)","v":64},{"$f":"INDEX(Parameters[],MATCH(Projectgegevens[[#This Row],[PROJECTTYPE]],Parameters[PROJECTTYPE],0),MATCH(Projectgegevens[[#Headers],[ACCOUNTMANAGER]],Parameters[#Headers],0))*INDEX(PROJECTPARAMETERS!$B$12:$H$12,1,MATCH(Projectgegevens[[#Headers],[ACCOUNTMANAGER]],Parameters[#Headers],0))*Projectgegevens[[#This Row],[GESCHATTE WERKUREN]]","v":{"v":7200,"d":"€ 7,200"}},{"$f":"INDEX(Parameters[],MATCH(Projectgegevens[[#This Row],[PROJECTTYPE]],Parameters[PROJECTTYPE],0),MATCH(Projectgegevens[[#Headers],[PROJECTMANAGER]],Parameters[#Headers],0))*INDEX(PROJECTPARAMETERS!$B$12:$H$12,1,MATCH(Projectgegevens[[#Headers],[PROJECTMANAGER]],Parameters[#Headers],0))*Projectgegevens[[#This Row],[GESCHATTE WERKUREN]]","v":{"v":2400,"d":"€ 2,400"}},{"$f":"INDEX(Parameters[],MATCH(Projectgegevens[[#This Row],[PROJECTTYPE]],Parameters[PROJECTTYPE],0),MATCH(Projectgegevens[[#Headers],[STRATEGIEMANAGER]],Parameters[#Headers],0))*INDEX(PROJECTPARAMETERS!$B$12:$H$12,1,MATCH(Projectgegevens[[#Headers],[STRATEGIEMANAGER]],Parameters[#Headers],0))*Projectgegevens[[#This Row],[GESCHATTE WERKUREN]]","v":{"v":18000,"d":"€ 18,000"}},{"$f":"INDEX(Parameters[],MATCH(Projectgegevens[[#This Row],[PROJECTTYPE]],Parameters[PROJECTTYPE],0),MATCH(Projectgegevens[[#Headers],[ONTWERPDESKUNDIGE]],Parameters[#Headers],0))*INDEX(PROJECTPARAMETERS!$B$12:$H$12,1,MATCH(Projectgegevens[[#Headers],[ONTWERPDESKUNDIGE]],Parameters[#Headers],0))*Projectgegevens[[#This Row],[GESCHATTE WERKUREN]]","v":{"v":0,"d":"€ 0"}},{"$f":"INDEX(Parameters[],MATCH(Projectgegevens[[#This Row],[PROJECTTYPE]],Parameters[PROJECTTYPE],0),MATCH(Projectgegevens[[#Headers],[PERSONEEL EVENEMENT]],Parameters[#Headers],0))*INDEX(PROJECTPARAMETERS!$B$12:$H$12,1,MATCH(Projectgegevens[[#Headers],[PERSONEEL EVENEMENT]],Parameters[#Headers],0))*Projectgegevens[[#This Row],[GESCHATTE WERKUREN]]","v":{"v":0,"d":"€ 0"}},{"$f":"INDEX(Parameters[],MATCH(Projectgegevens[[#This Row],[PROJECTTYPE]],Parameters[PROJECTTYPE],0),MATCH(Projectgegevens[[#Headers],[PERSONEEL ADMINISTRATIE]],Parameters[#Headers],0))*INDEX(PROJECTPARAMETERS!$B$12:$H$12,1,MATCH(Projectgegevens[[#Headers],[PERSONEEL ADMINISTRATIE]],Parameters[#Headers],0))*Projectgegevens[[#This Row],[GESCHATTE WERKUREN]]","v":{"v":1200,"d":"€ 1,200"}},{"$f":"INDEX(Parameters[],MATCH(Projectgegevens[[#This Row],[PROJECTTYPE]],Parameters[PROJECTTYPE],0),MATCH(Projectgegevens[[#Headers],[ACCOUNTMANAGER]],Parameters[#Headers],0))*INDEX(PROJECTPARAMETERS!$B$12:$H$12,1,MATCH(Projectgegevens[[#Headers],[ACCOUNTMANAGER]],Parameters[#Headers],0))*Projectgegevens[[#This Row],[WERKELIJKE WERKUREN]]","v":{"v":7920,"d":"€ 7,920"}},{"$f":"INDEX(Parameters[],MATCH(Projectgegevens[[#This Row],[PROJECTTYPE]],Parameters[PROJECTTYPE],0),MATCH(Projectgegevens[[#Headers],[PROJECTMANAGER]],Parameters[#Headers],0))*INDEX(PROJECTPARAMETERS!$B$12:$H$12,1,MATCH(Projectgegevens[[#Headers],[PROJECTMANAGER]],Parameters[#Headers],0))*Projectgegevens[[#This Row],[WERKELIJKE WERKUREN]]","v":{"v":2640,"d":"€ 2,640"}},{"$f":"INDEX(Parameters[],MATCH(Projectgegevens[[#This Row],[PROJECTTYPE]],Parameters[PROJECTTYPE],0),MATCH(Projectgegevens[[#Headers],[STRATEGIEMANAGER]],Parameters[#Headers],0))*INDEX(PROJECTPARAMETERS!$B$12:$H$12,1,MATCH(Projectgegevens[[#Headers],[STRATEGIEMANAGER]],Parameters[#Headers],0))*Projectgegevens[[#This Row],[WERKELIJKE WERKUREN]]","v":{"v":19800,"d":"€ 19,800"}},{"$f":"INDEX(Parameters[],MATCH(Projectgegevens[[#This Row],[PROJECTTYPE]],Parameters[PROJECTTYPE],0),MATCH(Projectgegevens[[#Headers],[ONTWERPDESKUNDIGE]],Parameters[#Headers],0))*INDEX(PROJECTPARAMETERS!$B$12:$H$12,1,MATCH(Projectgegevens[[#Headers],[ONTWERPDESKUNDIGE]],Parameters[#Headers],0))*Projectgegevens[[#This Row],[WERKELIJKE WERKUREN]]","v":{"v":0,"d":"€ 0"}},{"$f":"INDEX(Parameters[],MATCH(Projectgegevens[[#This Row],[PROJECTTYPE]],Parameters[PROJECTTYPE],0),MATCH(Projectgegevens[[#Headers],[PERSONEEL EVENEMENT]],Parameters[#Headers],0))*INDEX(PROJECTPARAMETERS!$B$12:$H$12,1,MATCH(Projectgegevens[[#Headers],[PERSONEEL EVENEMENT]],Parameters[#Headers],0))*Projectgegevens[[#This Row],[WERKELIJKE WERKUREN]]","v":{"v":0,"d":"€ 0"}},{"$f":"INDEX(Parameters[],MATCH(Projectgegevens[[#This Row],[PROJECTTYPE]],Parameters[PROJECTTYPE],0),MATCH(Projectgegevens[[#Headers],[PERSONEEL ADMINISTRATIE]],Parameters[#Headers],0))*INDEX(PROJECTPARAMETERS!$B$12:$H$12,1,MATCH(Projectgegevens[[#Headers],[PERSONEEL ADMINISTRATIE]],Parameters[#Headers],0))*Projectgegevens[[#This Row],[WERKELIJKE WERKUREN]]","v":{"v":1320,"d":"€ 1,320"}}]
[null,"Project 2","Evenementen organiseren",{"$f":"DATE(YEAR(TODAY())+1,6,25)","v":"2023-06-25"},{"$f":"DATE(YEAR(TODAY())+1,7,27)","v":"2023-07-27"},{"$f":"DATE(YEAR(TODAY()),7,15)","v":"2022-07-15"},{"$f":"DATE(YEAR(TODAY())+1,8,25)","v":"2023-08-25"},400,390,{"$f":"DAYS360(Projectgegevens[[#This Row],[GESCHATTE BEGINDATUM]],Projectgegevens[[#This Row],[GESCHATTE EINDDATUM]],FALSE)","v":32},{"$f":"DAYS360(Projectgegevens[[#This Row],[WERKELIJKE BEGINDATUM]],Projectgegevens[[#This Row],[WERKELIJKE EINDDATUM]],FALSE)","v":400},{"$f":"INDEX(Parameters[],MATCH(Projectgegevens[[#This Row],[PROJECTTYPE]],Parameters[PROJECTTYPE],0),MATCH(Projectgegevens[[#Headers],[ACCOUNTMANAGER]],Parameters[#Headers],0))*INDEX(PROJECTPARAMETERS!$B$12:$H$12,1,MATCH(Projectgegevens[[#Headers],[ACCOUNTMANAGER]],Parameters[#Headers],0))*Projectgegevens[[#This Row],[GESCHATTE WERKUREN]]","v":{"v":14400,"d":"€ 14,400"}},{"$f":"INDEX(Parameters[],MATCH(Projectgegevens[[#This Row],[PROJECTTYPE]],Parameters[PROJECTTYPE],0),MATCH(Projectgegevens[[#Headers],[PROJECTMANAGER]],Parameters[#Headers],0))*INDEX(PROJECTPARAMETERS!$B$12:$H$12,1,MATCH(Projectgegevens[[#Headers],[PROJECTMANAGER]],Parameters[#Headers],0))*Projectgegevens[[#This Row],[GESCHATTE WERKUREN]]","v":{"v":24000,"d":"€ 24,000"}},{"$f":"INDEX(Parameters[],MATCH(Projectgegevens[[#This Row],[PROJECTTYPE]],Parameters[PROJECTTYPE],0),MATCH(Projectgegevens[[#Headers],[STRATEGIEMANAGER]],Parameters[#Headers],0))*INDEX(PROJECTPARAMETERS!$B$12:$H$12,1,MATCH(Projectgegevens[[#Headers],[STRATEGIEMANAGER]],Parameters[#Headers],0))*Projectgegevens[[#This Row],[GESCHATTE WERKUREN]]","v":{"v":6000,"d":"€ 6,000"}},{"$f":"INDEX(Parameters[],MATCH(Projectgegevens[[#This Row],[PROJECTTYPE]],Parameters[PROJECTTYPE],0),MATCH(Projectgegevens[[#Headers],[ONTWERPDESKUNDIGE]],Parameters[#Headers],0))*INDEX(PROJECTPARAMETERS!$B$12:$H$12,1,MATCH(Projectgegevens[[#Headers],[ONTWERPDESKUNDIGE]],Parameters[#Headers],0))*Projectgegevens[[#This Row],[GESCHATTE WERKUREN]]","v":{"v":4000,"d":"€ 4,000"}},{"$f":"INDEX(Parameters[],MATCH(Projectgegevens[[#This Row],[PROJECTTYPE]],Parameters[PROJECTTYPE],0),MATCH(Projectgegevens[[#Headers],[PERSONEEL EVENEMENT]],Parameters[#Headers],0))*INDEX(PROJECTPARAMETERS!$B$12:$H$12,1,MATCH(Projectgegevens[[#Headers],[PERSONEEL EVENEMENT]],Parameters[#Headers],0))*Projectgegevens[[#This Row],[GESCHATTE WERKUREN]]","v":{"v":0,"d":"€ 0"}},{"$f":"INDEX(Parameters[],MATCH(Projectgegevens[[#This Row],[PROJECTTYPE]],Parameters[PROJECTTYPE],0),MATCH(Projectgegevens[[#Headers],[PERSONEEL ADMINISTRATIE]],Parameters[#Headers],0))*INDEX(PROJECTPARAMETERS!$B$12:$H$12,1,MATCH(Projectgegevens[[#Headers],[PERSONEEL ADMINISTRATIE]],Parameters[#Headers],0))*Projectgegevens[[#This Row],[GESCHATTE WERKUREN]]","v":{"v":2400,"d":"€ 2,400"}},{"$f":"INDEX(Parameters[],MATCH(Projectgegevens[[#This Row],[PROJECTTYPE]],Parameters[PROJECTTYPE],0),MATCH(Projectgegevens[[#Headers],[ACCOUNTMANAGER]],Parameters[#Headers],0))*INDEX(PROJECTPARAMETERS!$B$12:$H$12,1,MATCH(Projectgegevens[[#Headers],[ACCOUNTMANAGER]],Parameters[#Headers],0))*Projectgegevens[[#This Row],[WERKELIJKE WERKUREN]]","v":{"v":14040,"d":"€ 14,040"}},{"$f":"INDEX(Parameters[],MATCH(Projectgegevens[[#This Row],[PROJECTTYPE]],Parameters[PROJECTTYPE],0),MATCH(Projectgegevens[[#Headers],[PROJECTMANAGER]],Parameters[#Headers],0))*INDEX(PROJECTPARAMETERS!$B$12:$H$12,1,MATCH(Projectgegevens[[#Headers],[PROJECTMANAGER]],Parameters[#Headers],0))*Projectgegevens[[#This Row],[WERKELIJKE WERKUREN]]","v":{"v":23400,"d":"€ 23,400"}},{"$f":"INDEX(Parameters[],MATCH(Projectgegevens[[#This Row],[PROJECTTYPE]],Parameters[PROJECTTYPE],0),MATCH(Projectgegevens[[#Headers],[STRATEGIEMANAGER]],Parameters[#Headers],0))*INDEX(PROJECTPARAMETERS!$B$12:$H$12,1,MATCH(Projectgegevens[[#Headers],[STRATEGIEMANAGER]],Parameters[#Headers],0))*Projectgegevens[[#This Row],[WERKELIJKE WERKUREN]]","v":{"v":5850,"d":"€ 5,850"}},{"$f":"INDEX(Parameters[],MATCH(Projectgegevens[[#This Row],[PROJECTTYPE]],Parameters[PROJECTTYPE],0),MATCH(Projectgegevens[[#Headers],[ONTWERPDESKUNDIGE]],Parameters[#Headers],0))*INDEX(PROJECTPARAMETERS!$B$12:$H$12,1,MATCH(Projectgegevens[[#Headers],[ONTWERPDESKUNDIGE]],Parameters[#Headers],0))*Projectgegevens[[#This Row],[WERKELIJKE WERKUREN]]","v":{"v":3900,"d":"€ 3,900"}},{"$f":"INDEX(Parameters[],MATCH(Projectgegevens[[#This Row],[PROJECTTYPE]],Parameters[PROJECTTYPE],0),MATCH(Projectgegevens[[#Headers],[PERSONEEL EVENEMENT]],Parameters[#Headers],0))*INDEX(PROJECTPARAMETERS!$B$12:$H$12,1,MATCH(Projectgegevens[[#Headers],[PERSONEEL EVENEMENT]],Parameters[#Headers],0))*Projectgegevens[[#This Row],[WERKELIJKE WERKUREN]]","v":{"v":0,"d":"€ 0"}},{"$f":"INDEX(Parameters[],MATCH(Projectgegevens[[#This Row],[PROJECTTYPE]],Parameters[PROJECTTYPE],0),MATCH(Projectgegevens[[#Headers],[PERSONEEL ADMINISTRATIE]],Parameters[#Headers],0))*INDEX(PROJECTPARAMETERS!$B$12:$H$12,1,MATCH(Projectgegevens[[#Headers],[PERSONEEL ADMINISTRATIE]],Parameters[#Headers],0))*Projectgegevens[[#This Row],[WERKELIJKE WERKUREN]]","v":{"v":2340,"d":"€ 2,340"}}]
{"$rows_left_out":5}
{"sheet":"PROJECTTOTALEN","index":3,"n_rows":10,"n_cols":14,"rows_kept":10}
[null,{"$f":"PROJECTPARAMETERS!B1","v":"Bedrijfsnaam"}]
[null,"Tracker voor evenementenbeheerproject"]
[null,{"$f":"PROJECTPARAMETERS!B3","v":"Bedrijfsnaam Vertrouwelijk"}]
["De draaitabel in de cel rechts wordt automatisch bijgewerkt.\nINFORMATIE\nAls u de draaitabel rechts wilt vernieuwen, klikt u op een van de cellen binnen de draaitabel en klikt u op het tabblad Hulpmiddelen voor draaitabellen - Analyseren op Vernieuwen. U kunt ook op Shift+F10 drukken wanneer u een cel van de draaitabel hebt geselecteerd. Klik vervolgens op Vernieuwen.","PROJECTNAAM","ACCOUNTMANAGER - GESCHAT","PROJECTMANAGER - GESCHAT","STRATEGIEMANAGER - GESCHAT","ONTWERPDESKUNDIGE - GESCHAT","PERSONEEL EVENEMENT - GESCHAT","PERSONEEL ADMINISTRATIE - GESCHAT","ACCOUNTMANAGER - WERKELIJK","PROJECTMANAGER - WERKELIJK","STRATEGIEMANAGER - WERKELIJK","ONTWERPDESKUNDIGE - WERKELIJK","PERSONEEL EVENEMENT - WERKELIJK","PERSONEEL ADMINISTRATIE - WERKELIJK"]
[null,"Project 1",{"v":7200,"d":"€ 7,200.00"},{"v":2400,"d":"€ 2,400.00"},{"v":18000,"d":"€ 18,000.00"},{"v":0,"d":"€ 0.00"},{"v":0,"d":"€ 0.00"},{"v":1200,"d":"€ 1,200.00"},{"v":7920,"d":"€ 7,920.00"},{"v":2640,"d":"€ 2,640.00"},{"v":19800,"d":"€ 19,800.00"},{"v":0,"d":"€ 0.00"},{"v":0,"d":"€ 0.00"},{"v":1320,"d":"€ 1,320.00"}]
[null,"Project 2",{"v":14400,"d":"€ 14,400.00"},{"v":24000,"d":"€ 24,000.00"},{"v":6000,"d":"€ 6,000.00"},{"v":4000,"d":"€ 4,000.00"},{"v":0,"d":"€ 0.00"},{"v":2400,"d":"€ 2,400.00"},{"v":14040,"d":"€ 14,040.00"},{"v":23400,"d":"€ 23,400.00"},{"v":5850,"d":"€ 5,850.00"},{"v":3900,"d":"€ 3,900.00"},{"v":0,"d":"€ 0.00"},{"v":2340,"d":"€ 2,340.00"}]
{"$rows_left_out":4}