{"text_format":"3","workbook":"xlsx","n_sheets":6,"sheets":["Thuis","Persoonlijke gegevens","Reisgegevens","Hotel en activiteiten","Autohuur","Gegevens voor noodgevallen"],"not_rendered":{"images":19,"defined_names":10},"read":"whole","date_system":"1900"}

{"sheet":"Thuis","index":0,"n_rows":34,"n_cols":22,"rows_kept":34,"merged":[[32,1,32,3],[32,6,32,8],[32,11,32,13],[32,16,32,18],[32,21,32,23],[33,1,33,3],[33,6,33,8],[33,11,33,13],[33,16,33,18],[33,21,33,23]]}
{"$rows_empty":32}
[null,{"$f":"PersoonlijkeVermelding/TotaalPersoonlijk","v":{"v":1,"d":"100%"}},{"$nulls":4},{"$f":"Reizenvermelding/TotaalReizen","v":{"v":0.65,"d":"65%"}},{"$nulls":4},{"$f":"Hotelvermelding/TotaalHotel","v":{"v":0.5384615384615384,"d":"54%"}},{"$nulls":4},{"$f":"IF(Autohuur!D4=\"Ja\",Autohuurvermelding/TotaalAutohuur,1)","v":{"v":0.2857142857142857,"d":"29%"}},{"$nulls":4},{"$f":"Noodgevallenvermelding/TotaalNoodgevallen","v":{"v":0.625,"d":"63%"}}]
[null,{"$f":"TEXT(B33,\"0% \"\"voltooid\"\"\")","v":"100% voltooid"},{"$nulls":4},{"$f":"TEXT(G33,\"0% \"\"voltooid\"\"\")","v":"65% voltooid"},{"$nulls":4},{"$f":"TEXT(L33,\"0% \"\"voltooid\"\"\")","v":"54% voltooid"},{"$nulls":4},{"$f":"TEXT(Q33,\"0% \"\"voltooid\"\"\")","v":"29% voltooid"},{"$nulls":4},{"$f":"TEXT(V33,\"0% \"\"voltooid\"\"\")","v":"63% voltooid"}]

{"sheet":"Persoonlijke gegevens","index":1,"n_rows":11,"n_cols":5,"rows_kept":11,"merged":[[4,2,5,2],[4,3,5,3],[4,4,5,4],[7,2,8,2],[7,3,8,3],[7,4,8,4],[17,1,17,4]]}
[]
[]
[{"$f":"IF(COUNTA(B4:B8)<1,\"*\",\"\")","v":""},"Volledige naam en bijnamen",{"$f":"IF(E3=\"\",1,\"\")","v":""},"Thuisadres","Beukenlaan 5, 3100 AA"]
[null,"Richard Arts"]
[null,"Nils Blaauboer",{"$f":"IF(E5=\"\",1,\"\")","v":""},"Telefoon thuis",3455550123]
[null,"Ties Arts"]
[]
[null,null,{"$f":"IF((E8=0)+(E8=\"\"),1,\"\")","v":""},"Mobiele telefoons",3455550124]
[]
[]
[{"$f":"PersoonlijkeVermelding","v":3},{"$f":"IF(A11<>TotaalPersoonlijk,\"Ontbrekende belangrijke gegevens\",\"Belangrijke gegevens volledig\")","v":"Belangrijke gegevens volledig"}]

{"sheet":"Reisgegevens","index":2,"n_rows":18,"n_cols":6,"rows_kept":18,"merged":[[23,1,23,5]]}
[]
[]
[null,"Vertrekgegevens",null,null,"Gegevens van terugreis"]
[{"$f":"IF(C4=\"\",1,\"\")","v":""},"Datum",{"$f":"TODAY()+45","v":"2013-01-05"},{"$f":"IF(F4=\"\",1,\"\")","v":""},"Datum",{"$f":"TODAY()+51","v":"2013-01-11"}]
[{"$f":"IF(C5=\"\",1,\"\")","v":""},"Luchtvaartmaatschappij","Blue Yonder Airlines","","Luchtvaartmaatschappij","Blue Yonder Airlines"]
[{"$f":"IF(C6=\"\",1,\"\")","v":""},"Vluchtnummer","WS192",1,"Vluchtnummer"]
[{"$f":"IF(C7=\"\",1,\"\")","v":""},"Van","Columbus","","Van","Amsterdam"]
[{"$f":"IF(C8=\"\",1,\"\")","v":""},"Vertrektijd","12:30:00",1,"Vertrektijd"]
[null,"Vertrekterminal/-gate",null,1,"Vertrekterminal/-gate"]
[{"$f":"IF(C10=\"\",1,\"\")","v":""},"Naar","Amsterdam",1,"Naar"]
[{"$f":"IF(C11=\"\",1,\"\")","v":""},"Aankomsttijd","12:32:00",1,"Aankomsttijd"]
[null,"Vluchtduur","6 uur",null,"Vluchtduur"]
[{"$f":"IF(C13=\"\",1,\"\")","v":""},"Stoelnummers","A1, A2,A3",{"$f":"IF(F13=\"\",1,\"\")","v":1},"Stoelnummers"]
[{"$f":"IF(C14=\"\",1,\"\")","v":""},"Bevestigingsnummers","Zelfde",{"$f":"IF(F14=\"\",1,\"\")","v":1},"Bevestigingsnummers"]
[{"$f":"IF(C15=\"\",1,\"\")","v":""},"Maaltijd","Geen beperkingen",null,"Maaltijd"]
[null,"Telefoonnummer luchtvaartmaatschappij",1235550234,null,"Telefoonnummer luchtvaartmaatschappij",1235550234]
[]
[{"$f":"Reizenvermelding","v":13},{"$f":"IF(A18<>TotaalReizen,\"Ontbrekende belangrijke gegevens\",\"Belangrijke gegevens volledig\")","v":"Ontbrekende belangrijke gegevens"}]

{"sheet":"Hotel en activiteiten","index":3,"n_rows":15,"n_cols":7,"rows_kept":15,"merged":[[21,1,21,6]]}
[]
[]
[null,"Verblijfs-/overnachtingsgegevens hotel",{"$nulls":3},"Gegevens vakantieactiviteit"]
[{"$f":"IF(C4=\"\",1,\"\")","v":""},"Reserveringsdatum",{"$f":"TODAY()+45","v":"2013-01-05"},null,null,"Activiteit 1","SkiÃ«n"]
["","Naam hotel","Skihut",null,{"$f":"IF(AND($G$4<>\"\",G5=\"\"),1,\"\")","v":1},"Datums/tijden"]
["","Adres hotel","Hoofdstraat 789",null,{"$f":"IF(AND($G$4<>\"\",G6=\"\"),1,\"\")","v":1},"Reserveringsdatum"]
["","Telefoonnummer hotel","Amsterdam",null,{"$f":"IF(AND($G$4<>\"\",G7=\"\"),1,\"\")","v":1},"Bevestigingsnummer"]
["","Incheckdag/-tijd",{"$f":"TODAY()+45.5","v":"2013-01-05T12:00:00"},null,null,"Activiteit 2","Wijngaard en -handel De Jong"]
["","Uitcheckdag/-tijd",{"$f":"TODAY()+50.5","v":"2013-01-10T12:00:00"},null,{"$f":"IF(AND($G$8<>\"\",G9=\"\"),1,\"\")","v":1},"Datums/tijden"]
["","Bevestigingsnummer","CJ1234567",null,{"$f":"IF(AND($G$8<>\"\",G10=\"\"),1,\"\")","v":1},"Reserveringsdatum"]
[{"$nulls":4},{"$f":"IF(AND($G$8<>\"\",G11=\"\"),1,\"\")","v":1},"Bevestigingsnummer"]
[{"$f":"Hotelvermelding","v":7},{"$f":"IF(A12<>TotaalHotel,\"Ontbrekende belangrijke gegevens\",\"Belangrijke gegevens volledig\")","v":"Ontbrekende belangrijke gegevens"},{"$nulls":3},"Activiteit 3"]
[{"$nulls":4},{"$f":"IF(AND($G$12<>\"\",G13=\"\"),1,\"\")","v":""},"Datums/tijden"]
[{"$nulls":4},{"$f":"IF(AND($G$12<>\"\",G14=\"\"),1,\"\")","v":""},"Reserveringsdatum"]
[{"$nulls":4},{"$f":"IF(AND($G$12<>\"\",G15=\"\"),1,\"\")","v":""},"Bevestigingsnummer"]

{"sheet":"Autohuur","index":4,"n_rows":13,"n_cols":4,"rows_kept":13,"merged":[[18,0,18,4]]}
[]
[]
[null,null,"Gegevens autohuur"]
[null,null,"Auto huren?","Ja"]
[null,{"$f":"IF(AND($D$4=\"Ja\",D5=\"\"),1,\"\")","v":""},"Reserveringsdatum",{"$f":"TODAY()+45","v":"2013-01-05"}]
[null,1,"Verhuurbedrijf"]
[null,1,"Dag/tijd van ophalen"]
[null,1,"Dag/tijd van inleveren"]
[null,1,"Bevestigingsnummer"]
[null,"","Autotype","Economie"]
[null,1,"Telefoonnummer"]
[]
[null,{"$f":"Autohuurvermelding","v":2},{"$f":"IF(B13<>TotaalAutohuur,\"Ontbrekende belangrijke gegevens\",\"Belangrijke gegevens volledig\")","v":"Ontbrekende belangrijke gegevens"}]

{"sheet":"Gegevens voor noodgevallen","index":5,"n_rows":11,"n_cols":6,"rows_kept":11,"merged":[[3,4,4,4],[3,5,4,5],[3,6,4,6],[5,4,6,4],[5,5,6,5],[5,6,6,6],[7,5,8,5],[7,6,8,6],[16,1,16,6]]}
[]
[]
[null,"Verzekeringsgegevens",{"$nulls":3},"Gegevens contactpersoon bij noodgeval"]
[{"$f":"IF(C4=\"\",1,\"\")","v":""},"Verzekeringsmaatschappij","Giga Verzekeringen",null,{"$f":"IF(G4=\"\",1,\"\")","v":1},"Naam / relatie / telefoonnummer"]
["","Telefoonnummer",1235550567]
["","Dekkingstype","1900-01-05",null,{"$f":"IF(G6=\"\",1,\"\")","v":1},"Naam / relatie / telefoonnummer"]
["","Bevestigingsnummer","1900-01-05"]
["","Aankoopdatum",{"$f":"TODAY()","v":"2012-11-21"},null,null,"Naam / relatie / telefoonnummer"]
[1,"Dekkingsdatums"]
[]
[{"$f":"Noodgevallenvermelding","v":5},{"$f":"IF(A11<>TotaalNoodgevallen,\"Ontbrekende belangrijke gegevens\",\"Belangrijke gegevens volledig\")","v":"Ontbrekende belangrijke gegevens"}]