{"text_format":"3","workbook":"xlsx","n_sheets":5,"sheets":["Overzicht jaar tot heden","1e kw.","2e kw.","3e kw.","4e kw."],"not_rendered":{"defined_names":12},"read":"whole","date_system":"1900"}

{"sheet":"Overzicht jaar tot heden","index":0,"n_rows":36,"n_cols":12,"rows_kept":36,"merged":[[3,0,3,6]]}
["Bedrijfsnaam"]
["Aanwezigheid bijhouden, overzicht jaar tot heden"]
["Datum"]
[{"$f":"Company_Name","v":"Bedrijfsnaam"},{"$nulls":6},"VERTROUWELIJK"]
["Achternaam","Voornaam","Vakantie","Persoonlijk","Ziek","BSN","Positie","Supervisor","Datum in dienst","Opmerkingen","Vakantiedagen \nper jaar","Vakantiedagen \nresterend"]
["Achternaam","Voornaam",{"$f":"SUM('1e kw.:4e kw.'!C6)","v":3},{"$f":"SUM('1e kw.:4e kw.'!D6)","v":0},{"$f":"SUM('1e kw.:4e kw.'!E6)","v":1},"xxxxxxxxx","Manager","Naam",null,null,10,{"$f":"K6-C6","v":7}]
[null,null,{"$f":"SUM('1e kw.:4e kw.'!C7)","v":0},{"$f":"SUM('1e kw.:4e kw.'!D7)","v":0},{"$f":"SUM('1e kw.:4e kw.'!E7)","v":0},{"$nulls":6},{"$f":"K7-C7","v":0}]
[null,null,{"$f":"SUM('1e kw.:4e kw.'!C8)","v":0},{"$f":"SUM('1e kw.:4e kw.'!D8)","v":0},{"$f":"SUM('1e kw.:4e kw.'!E8)","v":0},{"$nulls":6},0]
[null,null,{"$f":"SUM('1e kw.:4e kw.'!C9)","v":0},{"$f":"SUM('1e kw.:4e kw.'!D9)","v":0},{"$f":"SUM('1e kw.:4e kw.'!E9)","v":0},{"$nulls":6},0]
[null,null,{"$f":"SUM('1e kw.:4e kw.'!C10)","v":0},{"$f":"SUM('1e kw.:4e kw.'!D10)","v":0},{"$f":"SUM('1e kw.:4e kw.'!E10)","v":0},{"$nulls":6},0]
[null,null,{"$f":"SUM('1e kw.:4e kw.'!C11)","v":0},{"$f":"SUM('1e kw.:4e kw.'!D11)","v":0},{"$f":"SUM('1e kw.:4e kw.'!E11)","v":0},{"$nulls":6},0]
[null,null,{"$f":"SUM('1e kw.:4e kw.'!C12)","v":0},{"$f":"SUM('1e kw.:4e kw.'!D12)","v":0},{"$f":"SUM('1e kw.:4e kw.'!E12)","v":0},{"$nulls":6},0]
[null,null,{"$f":"SUM('1e kw.:4e kw.'!C13)","v":0},{"$f":"SUM('1e kw.:4e kw.'!D13)","v":0},{"$f":"SUM('1e kw.:4e kw.'!E13)","v":0},{"$nulls":6},0]
[null,null,{"$f":"SUM('1e kw.:4e kw.'!C14)","v":0},{"$f":"SUM('1e kw.:4e kw.'!D14)","v":0},{"$f":"SUM('1e kw.:4e kw.'!E14)","v":0},{"$nulls":6},0]
[null,null,{"$f":"SUM('1e kw.:4e kw.'!C15)","v":0},{"$f":"SUM('1e kw.:4e kw.'!D15)","v":0},{"$f":"SUM('1e kw.:4e kw.'!E15)","v":0},{"$nulls":6},0]
[null,null,{"$f":"SUM('1e kw.:4e kw.'!C16)","v":0},{"$f":"SUM('1e kw.:4e kw.'!D16)","v":0},{"$f":"SUM('1e kw.:4e kw.'!E16)","v":0},{"$nulls":6},0]
[null,null,{"$f":"SUM('1e kw.:4e kw.'!C17)","v":0},{"$f":"SUM('1e kw.:4e kw.'!D17)","v":0},{"$f":"SUM('1e kw.:4e kw.'!E17)","v":0},{"$nulls":6},0]
[null,null,{"$f":"SUM('1e kw.:4e kw.'!C18)","v":0},{"$f":"SUM('1e kw.:4e kw.'!D18)","v":0},{"$f":"SUM('1e kw.:4e kw.'!E18)","v":0},{"$nulls":6},0]
[null,null,{"$f":"SUM('1e kw.:4e kw.'!C19)","v":0},{"$f":"SUM('1e kw.:4e kw.'!D19)","v":0},{"$f":"SUM('1e kw.:4e kw.'!E19)","v":0},{"$nulls":6},0]
[null,null,{"$f":"SUM('1e kw.:4e kw.'!C20)","v":0},{"$f":"SUM('1e kw.:4e kw.'!D20)","v":0},{"$f":"SUM('1e kw.:4e kw.'!E20)","v":0},{"$nulls":6},0]
[null,null,{"$f":"SUM('1e kw.:4e kw.'!C21)","v":0},{"$f":"SUM('1e kw.:4e kw.'!D21)","v":0},{"$f":"SUM('1e kw.:4e kw.'!E21)","v":0},{"$nulls":6},0]
[null,null,{"$f":"SUM('1e kw.:4e kw.'!C22)","v":0},{"$f":"SUM('1e kw.:4e kw.'!D22)","v":0},{"$f":"SUM('1e kw.:4e kw.'!E22)","v":0},{"$nulls":6},0]
[null,null,{"$f":"SUM('1e kw.:4e kw.'!C23)","v":0},{"$f":"SUM('1e kw.:4e kw.'!D23)","v":0},{"$f":"SUM('1e kw.:4e kw.'!E23)","v":0},{"$nulls":6},0]
[null,null,{"$f":"SUM('1e kw.:4e kw.'!C24)","v":0},{"$f":"SUM('1e kw.:4e kw.'!D24)","v":0},{"$f":"SUM('1e kw.:4e kw.'!E24)","v":0},{"$nulls":6},0]
[null,null,{"$f":"SUM('1e kw.:4e kw.'!C25)","v":0},{"$f":"SUM('1e kw.:4e kw.'!D25)","v":0},{"$f":"SUM('1e kw.:4e kw.'!E25)","v":0},{"$nulls":6},0]
[null,null,{"$f":"SUM('1e kw.:4e kw.'!C26)","v":0},{"$f":"SUM('1e kw.:4e kw.'!D26)","v":0},{"$f":"SUM('1e kw.:4e kw.'!E26)","v":0},{"$nulls":6},0]
[null,null,{"$f":"SUM('1e kw.:4e kw.'!C27)","v":0},{"$f":"SUM('1e kw.:4e kw.'!D27)","v":0},{"$f":"SUM('1e kw.:4e kw.'!E27)","v":0},{"$nulls":6},0]
[null,null,{"$f":"SUM('1e kw.:4e kw.'!C28)","v":0},{"$f":"SUM('1e kw.:4e kw.'!D28)","v":0},{"$f":"SUM('1e kw.:4e kw.'!E28)","v":0},{"$nulls":6},0]
[null,null,{"$f":"SUM('1e kw.:4e kw.'!C29)","v":0},{"$f":"SUM('1e kw.:4e kw.'!D29)","v":0},{"$f":"SUM('1e kw.:4e kw.'!E29)","v":0},{"$nulls":6},0]
[null,null,{"$f":"SUM('1e kw.:4e kw.'!C30)","v":0},{"$f":"SUM('1e kw.:4e kw.'!D30)","v":0},{"$f":"SUM('1e kw.:4e kw.'!E30)","v":0},{"$nulls":6},0]
[null,null,{"$f":"SUM('1e kw.:4e kw.'!C31)","v":0},{"$f":"SUM('1e kw.:4e kw.'!D31)","v":0},{"$f":"SUM('1e kw.:4e kw.'!E31)","v":0},{"$nulls":6},0]
[null,null,{"$f":"SUM('1e kw.:4e kw.'!C32)","v":0},{"$f":"SUM('1e kw.:4e kw.'!D32)","v":0},{"$f":"SUM('1e kw.:4e kw.'!E32)","v":0},{"$nulls":6},0]
[null,null,{"$f":"SUM('1e kw.:4e kw.'!C33)","v":0},{"$f":"SUM('1e kw.:4e kw.'!D33)","v":0},{"$f":"SUM('1e kw.:4e kw.'!E33)","v":0},{"$nulls":6},0]
[null,null,{"$f":"SUM('1e kw.:4e kw.'!C34)","v":0},{"$f":"SUM('1e kw.:4e kw.'!D34)","v":0},{"$f":"SUM('1e kw.:4e kw.'!E34)","v":0},{"$nulls":6},0]
[null,null,{"$f":"SUM('1e kw.:4e kw.'!C35)","v":0},{"$f":"SUM('1e kw.:4e kw.'!D35)","v":0},{"$f":"SUM('1e kw.:4e kw.'!E35)","v":0},{"$nulls":6},0]
[null,null,{"$f":"SUM('1e kw.:4e kw.'!C36)","v":0},{"$f":"SUM('1e kw.:4e kw.'!D36)","v":0},{"$f":"SUM('1e kw.:4e kw.'!E36)","v":0},{"$nulls":6},0]

{"sheet":"1e kw.","index":1,"n_rows":36,"n_cols":95,"rows_kept":36,"merged":[[3,0,3,6]]}
[{"$f":"Company_Name","v":"Bedrijfsnaam"}]
["Aanwezigheid bijhouden, 1e kwartaal"]
["Datum"]
[{"$f":"Company_Name","v":"Bedrijfsnaam"},{"$nulls":6},"VERTROUWELIJK"]
["Achternaam","Voornaam","Vakantie","Persoonlijk","Ziek","1-1","2-1","3-1","4-1","5-1","6-1","7-1","8-1","9-1","10-1","11-1","12-1","13-1","14-1","15-1","16-1","17-1","18-1","19-1","20-1","21-1","22-1","23-1","24-1","25-1","26-1","27-1","28-1","29-1","30-1","31-1","1-2","2-2","3-2","4-2","5-2","6-2","7-2","8-2","9-2","10-2","11-2","12-2","13-2","14-2","15-2","16-2","17-2","18-2","19-2","20-2","21-2","22-2","23-2","24-2","25-2","26-2","27-2","28-2","1-3","2-3","3-3","4-3","5-3","6-3","7-3","8-3","9-3","10-3","11-3","12-3","13-3","14-3","15-3","16-3","17-3","18-3","19-3","20-3","21-3","22-3","23-3","24-3","25-3","26-3","27-3","28-3","29-3","30-3","31-3"]
[{"$f":"IF(ISBLANK('Overzicht jaar tot heden'!A6),\"\",'Overzicht jaar tot heden'!A6)","v":"Achternaam"},{"$f":"IF(ISBLANK('Overzicht jaar tot heden'!B6),\"\",'Overzicht jaar tot heden'!B6)","v":"Voornaam"},{"$f":"COUNTIF($F6:$CQ6, \"V\")","v":3},{"$f":"COUNTIF($F6:$CQ6, \"P\")","v":0},{"$f":"COUNTIF($F6:$CQ6, \"Z\")","v":1},"V","V","V",{"$nulls":4},"Z"]
[{"$f":"IF(ISBLANK('Overzicht jaar tot heden'!A7),\"\",'Overzicht jaar tot heden'!A7)","v":""},{"$f":"IF(ISBLANK('Overzicht jaar tot heden'!B7),\"\",'Overzicht jaar tot heden'!B7)","v":""},0,0,0]
[{"$f":"IF(ISBLANK('Overzicht jaar tot heden'!A8),\"\",'Overzicht jaar tot heden'!A8)","v":""},{"$f":"IF(ISBLANK('Overzicht jaar tot heden'!B8),\"\",'Overzicht jaar tot heden'!B8)","v":""},0,0,0]
[{"$f":"IF(ISBLANK('Overzicht jaar tot heden'!A9),\"\",'Overzicht jaar tot heden'!A9)","v":""},{"$f":"IF(ISBLANK('Overzicht jaar tot heden'!B9),\"\",'Overzicht jaar tot heden'!B9)","v":""},0,0,0]
[{"$f":"IF(ISBLANK('Overzicht jaar tot heden'!A10),\"\",'Overzicht jaar tot heden'!A10)","v":""},{"$f":"IF(ISBLANK('Overzicht jaar tot heden'!B10),\"\",'Overzicht jaar tot heden'!B10)","v":""},0,0,0]
[{"$f":"IF(ISBLANK('Overzicht jaar tot heden'!A11),\"\",'Overzicht jaar tot heden'!A11)","v":""},{"$f":"IF(ISBLANK('Overzicht jaar tot heden'!B11),\"\",'Overzicht jaar tot heden'!B11)","v":""},0,0,0]
[{"$f":"IF(ISBLANK('Overzicht jaar tot heden'!A12),\"\",'Overzicht jaar tot heden'!A12)","v":""},{"$f":"IF(ISBLANK('Overzicht jaar tot heden'!B12),\"\",'Overzicht jaar tot heden'!B12)","v":""},0,0,0]
[{"$f":"IF(ISBLANK('Overzicht jaar tot heden'!A13),\"\",'Overzicht jaar tot heden'!A13)","v":""},{"$f":"IF(ISBLANK('Overzicht jaar tot heden'!B13),\"\",'Overzicht jaar tot heden'!B13)","v":""},0,0,0]
[{"$f":"IF(ISBLANK('Overzicht jaar tot heden'!A14),\"\",'Overzicht jaar tot heden'!A14)","v":""},{"$f":"IF(ISBLANK('Overzicht jaar tot heden'!B14),\"\",'Overzicht jaar tot heden'!B14)","v":""},0,0,0]
[{"$f":"IF(ISBLANK('Overzicht jaar tot heden'!A15),\"\",'Overzicht jaar tot heden'!A15)","v":""},{"$f":"IF(ISBLANK('Overzicht jaar tot heden'!B15),\"\",'Overzicht jaar tot heden'!B15)","v":""},0,0,0]
[{"$f":"IF(ISBLANK('Overzicht jaar tot heden'!A16),\"\",'Overzicht jaar tot heden'!A16)","v":""},{"$f":"IF(ISBLANK('Overzicht jaar tot heden'!B16),\"\",'Overzicht jaar tot heden'!B16)","v":""},0,0,0]
[{"$f":"IF(ISBLANK('Overzicht jaar tot heden'!A17),\"\",'Overzicht jaar tot heden'!A17)","v":""},{"$f":"IF(ISBLANK('Overzicht jaar tot heden'!B17),\"\",'Overzicht jaar tot heden'!B17)","v":""},0,0,0]
[{"$f":"IF(ISBLANK('Overzicht jaar tot heden'!A18),\"\",'Overzicht jaar tot heden'!A18)","v":""},{"$f":"IF(ISBLANK('Overzicht jaar tot heden'!B18),\"\",'Overzicht jaar tot heden'!B18)","v":""},0,0,0]
[{"$f":"IF(ISBLANK('Overzicht jaar tot heden'!A19),\"\",'Overzicht jaar tot heden'!A19)","v":""},{"$f":"IF(ISBLANK('Overzicht jaar tot heden'!B19),\"\",'Overzicht jaar tot heden'!B19)","v":""},0,0,0]
[{"$f":"IF(ISBLANK('Overzicht jaar tot heden'!A20),\"\",'Overzicht jaar tot heden'!A20)","v":""},{"$f":"IF(ISBLANK('Overzicht jaar tot heden'!B20),\"\",'Overzicht jaar tot heden'!B20)","v":""},0,0,0]
[{"$f":"IF(ISBLANK('Overzicht jaar tot heden'!A21),\"\",'Overzicht jaar tot heden'!A21)","v":""},{"$f":"IF(ISBLANK('Overzicht jaar tot heden'!B21),\"\",'Overzicht jaar tot heden'!B21)","v":""},0,0,0]
[{"$f":"IF(ISBLANK('Overzicht jaar tot heden'!A22),\"\",'Overzicht jaar tot heden'!A22)","v":""},{"$f":"IF(ISBLANK('Overzicht jaar tot heden'!B22),\"\",'Overzicht jaar tot heden'!B22)","v":""},0,0,0]
[{"$f":"IF(ISBLANK('Overzicht jaar tot heden'!A23),\"\",'Overzicht jaar tot heden'!A23)","v":""},{"$f":"IF(ISBLANK('Overzicht jaar tot heden'!B23),\"\",'Overzicht jaar tot heden'!B23)","v":""},0,0,0]
[{"$f":"IF(ISBLANK('Overzicht jaar tot heden'!A24),\"\",'Overzicht jaar tot heden'!A24)","v":""},{"$f":"IF(ISBLANK('Overzicht jaar tot heden'!B24),\"\",'Overzicht jaar tot heden'!B24)","v":""},0,0,0]
[{"$f":"IF(ISBLANK('Overzicht jaar tot heden'!A25),\"\",'Overzicht jaar tot heden'!A25)","v":""},{"$f":"IF(ISBLANK('Overzicht jaar tot heden'!B25),\"\",'Overzicht jaar tot heden'!B25)","v":""},0,0,0]
[{"$f":"IF(ISBLANK('Overzicht jaar tot heden'!A26),\"\",'Overzicht jaar tot heden'!A26)","v":""},{"$f":"IF(ISBLANK('Overzicht jaar tot heden'!B26),\"\",'Overzicht jaar tot heden'!B26)","v":""},0,0,0]
[{"$f":"IF(ISBLANK('Overzicht jaar tot heden'!A27),\"\",'Overzicht jaar tot heden'!A27)","v":""},{"$f":"IF(ISBLANK('Overzicht jaar tot heden'!B27),\"\",'Overzicht jaar tot heden'!B27)","v":""},0,0,0]
[{"$f":"IF(ISBLANK('Overzicht jaar tot heden'!A28),\"\",'Overzicht jaar tot heden'!A28)","v":""},{"$f":"IF(ISBLANK('Overzicht jaar tot heden'!B28),\"\",'Overzicht jaar tot heden'!B28)","v":""},0,0,0]
[{"$f":"IF(ISBLANK('Overzicht jaar tot heden'!A29),\"\",'Overzicht jaar tot heden'!A29)","v":""},{"$f":"IF(ISBLANK('Overzicht jaar tot heden'!B29),\"\",'Overzicht jaar tot heden'!B29)","v":""},0,0,0]
[{"$f":"IF(ISBLANK('Overzicht jaar tot heden'!A30),\"\",'Overzicht jaar tot heden'!A30)","v":""},{"$f":"IF(ISBLANK('Overzicht jaar tot heden'!B30),\"\",'Overzicht jaar tot heden'!B30)","v":""},0,0,0]
[{"$f":"IF(ISBLANK('Overzicht jaar tot heden'!A31),\"\",'Overzicht jaar tot heden'!A31)","v":""},{"$f":"IF(ISBLANK('Overzicht jaar tot heden'!B31),\"\",'Overzicht jaar tot heden'!B31)","v":""},0,0,0]
[{"$f":"IF(ISBLANK('Overzicht jaar tot heden'!A32),\"\",'Overzicht jaar tot heden'!A32)","v":""},{"$f":"IF(ISBLANK('Overzicht jaar tot heden'!B32),\"\",'Overzicht jaar tot heden'!B32)","v":""},0,0,0]
[{"$f":"IF(ISBLANK('Overzicht jaar tot heden'!A33),\"\",'Overzicht jaar tot heden'!A33)","v":""},{"$f":"IF(ISBLANK('Overzicht jaar tot heden'!B33),\"\",'Overzicht jaar tot heden'!B33)","v":""},0,0,0]
[{"$f":"IF(ISBLANK('Overzicht jaar tot heden'!A34),\"\",'Overzicht jaar tot heden'!A34)","v":""},{"$f":"IF(ISBLANK('Overzicht jaar tot heden'!B34),\"\",'Overzicht jaar tot heden'!B34)","v":""},0,0,0]
[{"$f":"IF(ISBLANK('Overzicht jaar tot heden'!A35),\"\",'Overzicht jaar tot heden'!A35)","v":""},{"$f":"IF(ISBLANK('Overzicht jaar tot heden'!B35),\"\",'Overzicht jaar tot heden'!B35)","v":""},0,0,0]
[{"$f":"IF(ISBLANK('Overzicht jaar tot heden'!A36),\"\",'Overzicht jaar tot heden'!A36)","v":""},{"$f":"IF(ISBLANK('Overzicht jaar tot heden'!B36),\"\",'Overzicht jaar tot heden'!B36)","v":""},0,0,0]

{"sheet":"2e kw.","index":2,"n_rows":36,"n_cols":96,"rows_kept":36,"merged":[[3,0,3,6]]}
[{"$f":"Company_Name","v":"Bedrijfsnaam"}]
["Aanwezigheid bijhouden, 2e kwartaal"]
["Datum"]
[{"$f":"Company_Name","v":"Bedrijfsnaam"},{"$nulls":6},"VERTROUWELIJK"]
["Achternaam","Voornaam","Vakantie","Persoonlijk","Ziek","1-4","2-4","3-4","4-4","5-4","6-4","7-4","8-4","9-4","10-4","11-4","12-4","13-4","14-4","15-4","16-4","17-4","18-4","19-4","20-4","21-4","22-4","23-4","24-4","25-4","26-4","27-4","28-4","29-4","30-4","1-5","2-5","3-5","4-5","5-5","6-5","7-5","8-5","9-5","10-5","11-5","12-5","13-5","14-5","15-5","16-5","17-5","18-5","19-5","20-5","21-5","22-5","23-5","24-5","25-5","26-5","27-5","28-5","29-5","30-5","31-5","1-6","2-6","3-6","4-6","5-6","6-6","7-6","8-6","9-6","10-6","11-6","12-6","13-6","14-6","15-6","16-6","17-6","18-6","19-6","20-6","21-6","22-6","23-6","24-6","25-6","26-6","27-6","28-6","29-6","30-6"]
[{"$f":"IF(ISBLANK('Overzicht jaar tot heden'!A6),\"\",'Overzicht jaar tot heden'!A6)","v":"Achternaam"},{"$f":"IF(ISBLANK('Overzicht jaar tot heden'!B6),\"\",'Overzicht jaar tot heden'!B6)","v":"Voornaam"},{"$f":"COUNTIF($F6:$CR6, \"V\")","v":0},{"$f":"COUNTIF($F6:$CR6, \"P\")","v":0},{"$f":"COUNTIF($F6:$CR6, \"Z\")","v":0}]
[{"$f":"IF(ISBLANK('Overzicht jaar tot heden'!A7),\"\",'Overzicht jaar tot heden'!A7)","v":""},{"$f":"IF(ISBLANK('Overzicht jaar tot heden'!B7),\"\",'Overzicht jaar tot heden'!B7)","v":""},{"$f":"COUNTIF($F7:$CR7, \"V\")","v":0},{"$f":"COUNTIF($F7:$CR7, \"P\")","v":0},0]
[{"$f":"IF(ISBLANK('Overzicht jaar tot heden'!A8),\"\",'Overzicht jaar tot heden'!A8)","v":""},{"$f":"IF(ISBLANK('Overzicht jaar tot heden'!B8),\"\",'Overzicht jaar tot heden'!B8)","v":""},0,0,0]
[{"$f":"IF(ISBLANK('Overzicht jaar tot heden'!A9),\"\",'Overzicht jaar tot heden'!A9)","v":""},{"$f":"IF(ISBLANK('Overzicht jaar tot heden'!B9),\"\",'Overzicht jaar tot heden'!B9)","v":""},0,0,0]
[{"$f":"IF(ISBLANK('Overzicht jaar tot heden'!A10),\"\",'Overzicht jaar tot heden'!A10)","v":""},{"$f":"IF(ISBLANK('Overzicht jaar tot heden'!B10),\"\",'Overzicht jaar tot heden'!B10)","v":""},0,0,0]
[{"$f":"IF(ISBLANK('Overzicht jaar tot heden'!A11),\"\",'Overzicht jaar tot heden'!A11)","v":""},{"$f":"IF(ISBLANK('Overzicht jaar tot heden'!B11),\"\",'Overzicht jaar tot heden'!B11)","v":""},0,0,0]
[{"$f":"IF(ISBLANK('Overzicht jaar tot heden'!A12),\"\",'Overzicht jaar tot heden'!A12)","v":""},{"$f":"IF(ISBLANK('Overzicht jaar tot heden'!B12),\"\",'Overzicht jaar tot heden'!B12)","v":""},0,0,0]
[{"$f":"IF(ISBLANK('Overzicht jaar tot heden'!A13),\"\",'Overzicht jaar tot heden'!A13)","v":""},{"$f":"IF(ISBLANK('Overzicht jaar tot heden'!B13),\"\",'Overzicht jaar tot heden'!B13)","v":""},0,0,0]
[{"$f":"IF(ISBLANK('Overzicht jaar tot heden'!A14),\"\",'Overzicht jaar tot heden'!A14)","v":""},{"$f":"IF(ISBLANK('Overzicht jaar tot heden'!B14),\"\",'Overzicht jaar tot heden'!B14)","v":""},0,0,0]
[{"$f":"IF(ISBLANK('Overzicht jaar tot heden'!A15),\"\",'Overzicht jaar tot heden'!A15)","v":""},{"$f":"IF(ISBLANK('Overzicht jaar tot heden'!B15),\"\",'Overzicht jaar tot heden'!B15)","v":""},0,0,0]
[{"$f":"IF(ISBLANK('Overzicht jaar tot heden'!A16),\"\",'Overzicht jaar tot heden'!A16)","v":""},{"$f":"IF(ISBLANK('Overzicht jaar tot heden'!B16),\"\",'Overzicht jaar tot heden'!B16)","v":""},0,0,0]
[{"$f":"IF(ISBLANK('Overzicht jaar tot heden'!A17),\"\",'Overzicht jaar tot heden'!A17)","v":""},{"$f":"IF(ISBLANK('Overzicht jaar tot heden'!B17),\"\",'Overzicht jaar tot heden'!B17)","v":""},0,0,0]
[{"$f":"IF(ISBLANK('Overzicht jaar tot heden'!A18),\"\",'Overzicht jaar tot heden'!A18)","v":""},{"$f":"IF(ISBLANK('Overzicht jaar tot heden'!B18),\"\",'Overzicht jaar tot heden'!B18)","v":""},0,0,0]
[{"$f":"IF(ISBLANK('Overzicht jaar tot heden'!A19),\"\",'Overzicht jaar tot heden'!A19)","v":""},{"$f":"IF(ISBLANK('Overzicht jaar tot heden'!B19),\"\",'Overzicht jaar tot heden'!B19)","v":""},0,0,0]
[{"$f":"IF(ISBLANK('Overzicht jaar tot heden'!A20),\"\",'Overzicht jaar tot heden'!A20)","v":""},{"$f":"IF(ISBLANK('Overzicht jaar tot heden'!B20),\"\",'Overzicht jaar tot heden'!B20)","v":""},0,0,0]
[{"$f":"IF(ISBLANK('Overzicht jaar tot heden'!A21),\"\",'Overzicht jaar tot heden'!A21)","v":""},{"$f":"IF(ISBLANK('Overzicht jaar tot heden'!B21),\"\",'Overzicht jaar tot heden'!B21)","v":""},0,0,0]
[{"$f":"IF(ISBLANK('Overzicht jaar tot heden'!A22),\"\",'Overzicht jaar tot heden'!A22)","v":""},{"$f":"IF(ISBLANK('Overzicht jaar tot heden'!B22),\"\",'Overzicht jaar tot heden'!B22)","v":""},0,0,0]
[{"$f":"IF(ISBLANK('Overzicht jaar tot heden'!A23),\"\",'Overzicht jaar tot heden'!A23)","v":""},{"$f":"IF(ISBLANK('Overzicht jaar tot heden'!B23),\"\",'Overzicht jaar tot heden'!B23)","v":""},0,0,0]
[{"$f":"IF(ISBLANK('Overzicht jaar tot heden'!A24),\"\",'Overzicht jaar tot heden'!A24)","v":""},{"$f":"IF(ISBLANK('Overzicht jaar tot heden'!B24),\"\",'Overzicht jaar tot heden'!B24)","v":""},0,0,0]
[{"$f":"IF(ISBLANK('Overzicht jaar tot heden'!A25),\"\",'Overzicht jaar tot heden'!A25)","v":""},{"$f":"IF(ISBLANK('Overzicht jaar tot heden'!B25),\"\",'Overzicht jaar tot heden'!B25)","v":""},0,0,0]
[{"$f":"IF(ISBLANK('Overzicht jaar tot heden'!A26),\"\",'Overzicht jaar tot heden'!A26)","v":""},{"$f":"IF(ISBLANK('Overzicht jaar tot heden'!B26),\"\",'Overzicht jaar tot heden'!B26)","v":""},0,0,0]
[{"$f":"IF(ISBLANK('Overzicht jaar tot heden'!A27),\"\",'Overzicht jaar tot heden'!A27)","v":""},{"$f":"IF(ISBLANK('Overzicht jaar tot heden'!B27),\"\",'Overzicht jaar tot heden'!B27)","v":""},0,0,0]
[{"$f":"IF(ISBLANK('Overzicht jaar tot heden'!A28),\"\",'Overzicht jaar tot heden'!A28)","v":""},{"$f":"IF(ISBLANK('Overzicht jaar tot heden'!B28),\"\",'Overzicht jaar tot heden'!B28)","v":""},0,0,0]
[{"$f":"IF(ISBLANK('Overzicht jaar tot heden'!A29),\"\",'Overzicht jaar tot heden'!A29)","v":""},{"$f":"IF(ISBLANK('Overzicht jaar tot heden'!B29),\"\",'Overzicht jaar tot heden'!B29)","v":""},0,0,0]
[{"$f":"IF(ISBLANK('Overzicht jaar tot heden'!A30),\"\",'Overzicht jaar tot heden'!A30)","v":""},{"$f":"IF(ISBLANK('Overzicht jaar tot heden'!B30),\"\",'Overzicht jaar tot heden'!B30)","v":""},0,0,0]
[{"$f":"IF(ISBLANK('Overzicht jaar tot heden'!A31),\"\",'Overzicht jaar tot heden'!A31)","v":""},{"$f":"IF(ISBLANK('Overzicht jaar tot heden'!B31),\"\",'Overzicht jaar tot heden'!B31)","v":""},0,0,0]
[{"$f":"IF(ISBLANK('Overzicht jaar tot heden'!A32),\"\",'Overzicht jaar tot heden'!A32)","v":""},{"$f":"IF(ISBLANK('Overzicht jaar tot heden'!B32),\"\",'Overzicht jaar tot heden'!B32)","v":""},0,0,0]
[{"$f":"IF(ISBLANK('Overzicht jaar tot heden'!A33),\"\",'Overzicht jaar tot heden'!A33)","v":""},{"$f":"IF(ISBLANK('Overzicht jaar tot heden'!B33),\"\",'Overzicht jaar tot heden'!B33)","v":""},0,0,0]
[{"$f":"IF(ISBLANK('Overzicht jaar tot heden'!A34),\"\",'Overzicht jaar tot heden'!A34)","v":""},{"$f":"IF(ISBLANK('Overzicht jaar tot heden'!B34),\"\",'Overzicht jaar tot heden'!B34)","v":""},0,0,0]
[{"$f":"IF(ISBLANK('Overzicht jaar tot heden'!A35),\"\",'Overzicht jaar tot heden'!A35)","v":""},{"$f":"IF(ISBLANK('Overzicht jaar tot heden'!B35),\"\",'Overzicht jaar tot heden'!B35)","v":""},0,0,0]
[{"$f":"IF(ISBLANK('Overzicht jaar tot heden'!A36),\"\",'Overzicht jaar tot heden'!A36)","v":""},{"$f":"IF(ISBLANK('Overzicht jaar tot heden'!B36),\"\",'Overzicht jaar tot heden'!B36)","v":""},0,0,0]

{"sheet":"3e kw.","index":3,"n_rows":36,"n_cols":97,"rows_kept":36,"merged":[[3,0,3,6]]}
[{"$f":"Company_Name","v":"Bedrijfsnaam"}]
["Aanwezigheid bijhouden, 3e kwartaal"]
["Datum"]
[{"$f":"Company_Name","v":"Bedrijfsnaam"},{"$nulls":6},"VERTROUWELIJK"]
["Achternaam","Voornaam","Vakantie","Persoonlijk","Ziek","1-7","2-7","3-7","4-7","5-7","6-7","7-7","8-7","9-7","10-7","11-7","12-7","13-7","14-7","15-7","16-7","17-7","18-7","19-7","20-7","21-7","22-7","23-7","24-7","25-7","26-7","27-7","28-7","29-7","30-7","31-7","1-8","2-8","3-8","4-8","5-8","6-8","7-8","8-8","9-8","10-8","11-8","12-8","13-8","14-8","15-8","16-8","17-8","18-8","19-8","20-8","21-8","22-8","23-8","24-8","25-8","26-8","27-8","28-8","29-8","30-8","31-8","1-9","2-9","3-9","4-9","5-9","6-9","7-9","8-9","9-9","10-9","11-9","12-9","13-9","14-9","15-9","16-9","17-9","18-9","19-9","20-9","21-9","22-9","23-9","24-9","25-9","26-9","27-9","28-9","29-9","30-9"]
[{"$f":"IF(ISBLANK('Overzicht jaar tot heden'!A6),\"\",'Overzicht jaar tot heden'!A6)","v":"Achternaam"},{"$f":"IF(ISBLANK('Overzicht jaar tot heden'!B6),\"\",'Overzicht jaar tot heden'!B6)","v":"Voornaam"},{"$f":"COUNTIF($F6:$CS6, \"V\")","v":0},{"$f":"COUNTIF($F6:$CS6, \"P\")","v":0},{"$f":"COUNTIF($F6:$CS6, \"Z\")","v":0}]
[{"$f":"IF(ISBLANK('Overzicht jaar tot heden'!A7),\"\",'Overzicht jaar tot heden'!A7)","v":""},{"$f":"IF(ISBLANK('Overzicht jaar tot heden'!B7),\"\",'Overzicht jaar tot heden'!B7)","v":""},{"$f":"COUNTIF($F7:$CS7, \"V\")","v":0},{"$f":"COUNTIF($F7:$CS7, \"P\")","v":0},0]
[{"$f":"IF(ISBLANK('Overzicht jaar tot heden'!A8),\"\",'Overzicht jaar tot heden'!A8)","v":""},{"$f":"IF(ISBLANK('Overzicht jaar tot heden'!B8),\"\",'Overzicht jaar tot heden'!B8)","v":""},0,0,0]
[{"$f":"IF(ISBLANK('Overzicht jaar tot heden'!A9),\"\",'Overzicht jaar tot heden'!A9)","v":""},{"$f":"IF(ISBLANK('Overzicht jaar tot heden'!B9),\"\",'Overzicht jaar tot heden'!B9)","v":""},0,0,0]
[{"$f":"IF(ISBLANK('Overzicht jaar tot heden'!A10),\"\",'Overzicht jaar tot heden'!A10)","v":""},{"$f":"IF(ISBLANK('Overzicht jaar tot heden'!B10),\"\",'Overzicht jaar tot heden'!B10)","v":""},0,0,0]
[{"$f":"IF(ISBLANK('Overzicht jaar tot heden'!A11),\"\",'Overzicht jaar tot heden'!A11)","v":""},{"$f":"IF(ISBLANK('Overzicht jaar tot heden'!B11),\"\",'Overzicht jaar tot heden'!B11)","v":""},0,0,0]
[{"$f":"IF(ISBLANK('Overzicht jaar tot heden'!A12),\"\",'Overzicht jaar tot heden'!A12)","v":""},{"$f":"IF(ISBLANK('Overzicht jaar tot heden'!B12),\"\",'Overzicht jaar tot heden'!B12)","v":""},0,0,0]
[{"$f":"IF(ISBLANK('Overzicht jaar tot heden'!A13),\"\",'Overzicht jaar tot heden'!A13)","v":""},{"$f":"IF(ISBLANK('Overzicht jaar tot heden'!B13),\"\",'Overzicht jaar tot heden'!B13)","v":""},0,0,0]
[{"$f":"IF(ISBLANK('Overzicht jaar tot heden'!A14),\"\",'Overzicht jaar tot heden'!A14)","v":""},{"$f":"IF(ISBLANK('Overzicht jaar tot heden'!B14),\"\",'Overzicht jaar tot heden'!B14)","v":""},0,0,0]
[{"$f":"IF(ISBLANK('Overzicht jaar tot heden'!A15),\"\",'Overzicht jaar tot heden'!A15)","v":""},{"$f":"IF(ISBLANK('Overzicht jaar tot heden'!B15),\"\",'Overzicht jaar tot heden'!B15)","v":""},0,0,0]
[{"$f":"IF(ISBLANK('Overzicht jaar tot heden'!A16),\"\",'Overzicht jaar tot heden'!A16)","v":""},{"$f":"IF(ISBLANK('Overzicht jaar tot heden'!B16),\"\",'Overzicht jaar tot heden'!B16)","v":""},0,0,0]
[{"$f":"IF(ISBLANK('Overzicht jaar tot heden'!A17),\"\",'Overzicht jaar tot heden'!A17)","v":""},{"$f":"IF(ISBLANK('Overzicht jaar tot heden'!B17),\"\",'Overzicht jaar tot heden'!B17)","v":""},0,0,0]
[{"$f":"IF(ISBLANK('Overzicht jaar tot heden'!A18),\"\",'Overzicht jaar tot heden'!A18)","v":""},{"$f":"IF(ISBLANK('Overzicht jaar tot heden'!B18),\"\",'Overzicht jaar tot heden'!B18)","v":""},0,0,0]
[{"$f":"IF(ISBLANK('Overzicht jaar tot heden'!A19),\"\",'Overzicht jaar tot heden'!A19)","v":""},{"$f":"IF(ISBLANK('Overzicht jaar tot heden'!B19),\"\",'Overzicht jaar tot heden'!B19)","v":""},0,0,0]
[{"$f":"IF(ISBLANK('Overzicht jaar tot heden'!A20),\"\",'Overzicht jaar tot heden'!A20)","v":""},{"$f":"IF(ISBLANK('Overzicht jaar tot heden'!B20),\"\",'Overzicht jaar tot heden'!B20)","v":""},0,0,0]
[{"$f":"IF(ISBLANK('Overzicht jaar tot heden'!A21),\"\",'Overzicht jaar tot heden'!A21)","v":""},{"$f":"IF(ISBLANK('Overzicht jaar tot heden'!B21),\"\",'Overzicht jaar tot heden'!B21)","v":""},0,0,0]
[{"$f":"IF(ISBLANK('Overzicht jaar tot heden'!A22),\"\",'Overzicht jaar tot heden'!A22)","v":""},{"$f":"IF(ISBLANK('Overzicht jaar tot heden'!B22),\"\",'Overzicht jaar tot heden'!B22)","v":""},0,0,0]
[{"$f":"IF(ISBLANK('Overzicht jaar tot heden'!A23),\"\",'Overzicht jaar tot heden'!A23)","v":""},{"$f":"IF(ISBLANK('Overzicht jaar tot heden'!B23),\"\",'Overzicht jaar tot heden'!B23)","v":""},0,0,0]
[{"$f":"IF(ISBLANK('Overzicht jaar tot heden'!A24),\"\",'Overzicht jaar tot heden'!A24)","v":""},{"$f":"IF(ISBLANK('Overzicht jaar tot heden'!B24),\"\",'Overzicht jaar tot heden'!B24)","v":""},0,0,0]
[{"$f":"IF(ISBLANK('Overzicht jaar tot heden'!A25),\"\",'Overzicht jaar tot heden'!A25)","v":""},{"$f":"IF(ISBLANK('Overzicht jaar tot heden'!B25),\"\",'Overzicht jaar tot heden'!B25)","v":""},0,0,0]
[{"$f":"IF(ISBLANK('Overzicht jaar tot heden'!A26),\"\",'Overzicht jaar tot heden'!A26)","v":""},{"$f":"IF(ISBLANK('Overzicht jaar tot heden'!B26),\"\",'Overzicht jaar tot heden'!B26)","v":""},0,0,0]
[{"$f":"IF(ISBLANK('Overzicht jaar tot heden'!A27),\"\",'Overzicht jaar tot heden'!A27)","v":""},{"$f":"IF(ISBLANK('Overzicht jaar tot heden'!B27),\"\",'Overzicht jaar tot heden'!B27)","v":""},0,0,0]
[{"$f":"IF(ISBLANK('Overzicht jaar tot heden'!A28),\"\",'Overzicht jaar tot heden'!A28)","v":""},{"$f":"IF(ISBLANK('Overzicht jaar tot heden'!B28),\"\",'Overzicht jaar tot heden'!B28)","v":""},0,0,0]
[{"$f":"IF(ISBLANK('Overzicht jaar tot heden'!A29),\"\",'Overzicht jaar tot heden'!A29)","v":""},{"$f":"IF(ISBLANK('Overzicht jaar tot heden'!B29),\"\",'Overzicht jaar tot heden'!B29)","v":""},0,0,0]
[{"$f":"IF(ISBLANK('Overzicht jaar tot heden'!A30),\"\",'Overzicht jaar tot heden'!A30)","v":""},{"$f":"IF(ISBLANK('Overzicht jaar tot heden'!B30),\"\",'Overzicht jaar tot heden'!B30)","v":""},0,0,0]
[{"$f":"IF(ISBLANK('Overzicht jaar tot heden'!A31),\"\",'Overzicht jaar tot heden'!A31)","v":""},{"$f":"IF(ISBLANK('Overzicht jaar tot heden'!B31),\"\",'Overzicht jaar tot heden'!B31)","v":""},0,0,0]
[{"$f":"IF(ISBLANK('Overzicht jaar tot heden'!A32),\"\",'Overzicht jaar tot heden'!A32)","v":""},{"$f":"IF(ISBLANK('Overzicht jaar tot heden'!B32),\"\",'Overzicht jaar tot heden'!B32)","v":""},0,0,0]
[{"$f":"IF(ISBLANK('Overzicht jaar tot heden'!A33),\"\",'Overzicht jaar tot heden'!A33)","v":""},{"$f":"IF(ISBLANK('Overzicht jaar tot heden'!B33),\"\",'Overzicht jaar tot heden'!B33)","v":""},0,0,0]
[{"$f":"IF(ISBLANK('Overzicht jaar tot heden'!A34),\"\",'Overzicht jaar tot heden'!A34)","v":""},{"$f":"IF(ISBLANK('Overzicht jaar tot heden'!B34),\"\",'Overzicht jaar tot heden'!B34)","v":""},0,0,0]
[{"$f":"IF(ISBLANK('Overzicht jaar tot heden'!A35),\"\",'Overzicht jaar tot heden'!A35)","v":""},{"$f":"IF(ISBLANK('Overzicht jaar tot heden'!B35),\"\",'Overzicht jaar tot heden'!B35)","v":""},0,0,0]
[{"$f":"IF(ISBLANK('Overzicht jaar tot heden'!A36),\"\",'Overzicht jaar tot heden'!A36)","v":""},{"$f":"IF(ISBLANK('Overzicht jaar tot heden'!B36),\"\",'Overzicht jaar tot heden'!B36)","v":""},0,0,0]

{"sheet":"4e kw.","index":4,"n_rows":36,"n_cols":97,"rows_kept":36,"merged":[[3,0,3,6]]}
[{"$f":"Company_Name","v":"Bedrijfsnaam"}]
["Aanwezigheid bijhouden, 4e kwartaal"]
["Datum"]
[{"$f":"Company_Name","v":"Bedrijfsnaam"},{"$nulls":6},"VERTROUWELIJK"]
["Achternaam","Voornaam","Vakantie","Persoonlijk","Ziek","1-10","2-10","3-10","4-10","5-10","6-10","7-10","8-10","9-10","10-10","11-10","12-10","13-10","14-10","15-10","16-10","17-10","18-10","19-10","20-10","21-10","22-10","23-10","24-10","25-10","26-10","27-10","28-10","29-10","30-10","31-10","1-11","2-11","3-11","4-11","5-11","6-11","7-11","8-11","9-11","10-11","11-11","12-11","13-11","14-11","15-11","16-11","17-11","18-11","19-11","20-11","21-11","22-11","23-11","24-11","25-11","26-11","27-11","28-11","29-11","30-11","1-12","2-12","3-12","4-12","5-12","6-12","7-12","8-12","9-12","10-12","11-12","12-12","13-12","14-12","15-12","16-12","17-12","18-12","19-12","20-12","21-12","22-12","23-12","24-12","25-12","26-12","27-12","28-12","29-12","30-12","31-12"]
[{"$f":"IF(ISBLANK('Overzicht jaar tot heden'!A6),\"\",'Overzicht jaar tot heden'!A6)","v":"Achternaam"},{"$f":"IF(ISBLANK('Overzicht jaar tot heden'!B6),\"\",'Overzicht jaar tot heden'!B6)","v":"Voornaam"},{"$f":"COUNTIF($F6:$CS6, \"V\")","v":0},{"$f":"COUNTIF($F6:CS6, \"P\")","v":0},{"$f":"COUNTIF($F6:CS6, \"Z\")","v":0}]
[{"$f":"IF(ISBLANK('Overzicht jaar tot heden'!A7),\"\",'Overzicht jaar tot heden'!A7)","v":""},{"$f":"IF(ISBLANK('Overzicht jaar tot heden'!B7),\"\",'Overzicht jaar tot heden'!B7)","v":""},0,{"$f":"COUNTIF($F7:CS7, \"P\")","v":0},{"$f":"COUNTIF($F7:CS7, \"Z\")","v":0}]
[{"$f":"IF(ISBLANK('Overzicht jaar tot heden'!A8),\"\",'Overzicht jaar tot heden'!A8)","v":""},{"$f":"IF(ISBLANK('Overzicht jaar tot heden'!B8),\"\",'Overzicht jaar tot heden'!B8)","v":""},0,{"$f":"COUNTIF($F8:CS8, \"P\")","v":0},{"$f":"COUNTIF($F8:CS8, \"Z\")","v":0}]
[{"$f":"IF(ISBLANK('Overzicht jaar tot heden'!A9),\"\",'Overzicht jaar tot heden'!A9)","v":""},{"$f":"IF(ISBLANK('Overzicht jaar tot heden'!B9),\"\",'Overzicht jaar tot heden'!B9)","v":""},0,{"$f":"COUNTIF($F9:CS9, \"P\")","v":0},{"$f":"COUNTIF($F9:CS9, \"Z\")","v":0}]
[{"$f":"IF(ISBLANK('Overzicht jaar tot heden'!A10),\"\",'Overzicht jaar tot heden'!A10)","v":""},{"$f":"IF(ISBLANK('Overzicht jaar tot heden'!B10),\"\",'Overzicht jaar tot heden'!B10)","v":""},0,{"$f":"COUNTIF($F10:CS10, \"P\")","v":0},{"$f":"COUNTIF($F10:CS10, \"Z\")","v":0}]
[{"$f":"IF(ISBLANK('Overzicht jaar tot heden'!A11),\"\",'Overzicht jaar tot heden'!A11)","v":""},{"$f":"IF(ISBLANK('Overzicht jaar tot heden'!B11),\"\",'Overzicht jaar tot heden'!B11)","v":""},0,{"$f":"COUNTIF($F11:CS11, \"P\")","v":0},{"$f":"COUNTIF($F11:CS11, \"Z\")","v":0}]
[{"$f":"IF(ISBLANK('Overzicht jaar tot heden'!A12),\"\",'Overzicht jaar tot heden'!A12)","v":""},{"$f":"IF(ISBLANK('Overzicht jaar tot heden'!B12),\"\",'Overzicht jaar tot heden'!B12)","v":""},0,{"$f":"COUNTIF($F12:CS12, \"P\")","v":0},{"$f":"COUNTIF($F12:CS12, \"Z\")","v":0}]
[{"$f":"IF(ISBLANK('Overzicht jaar tot heden'!A13),\"\",'Overzicht jaar tot heden'!A13)","v":""},{"$f":"IF(ISBLANK('Overzicht jaar tot heden'!B13),\"\",'Overzicht jaar tot heden'!B13)","v":""},0,{"$f":"COUNTIF($F13:CS13, \"P\")","v":0},{"$f":"COUNTIF($F13:CS13, \"Z\")","v":0}]
[{"$f":"IF(ISBLANK('Overzicht jaar tot heden'!A14),\"\",'Overzicht jaar tot heden'!A14)","v":""},{"$f":"IF(ISBLANK('Overzicht jaar tot heden'!B14),\"\",'Overzicht jaar tot heden'!B14)","v":""},0,{"$f":"COUNTIF($F14:CS14, \"P\")","v":0},{"$f":"COUNTIF($F14:CS14, \"Z\")","v":0}]
[{"$f":"IF(ISBLANK('Overzicht jaar tot heden'!A15),\"\",'Overzicht jaar tot heden'!A15)","v":""},{"$f":"IF(ISBLANK('Overzicht jaar tot heden'!B15),\"\",'Overzicht jaar tot heden'!B15)","v":""},0,{"$f":"COUNTIF($F15:CS15, \"P\")","v":0},{"$f":"COUNTIF($F15:CS15, \"Z\")","v":0}]
[{"$f":"IF(ISBLANK('Overzicht jaar tot heden'!A16),\"\",'Overzicht jaar tot heden'!A16)","v":""},{"$f":"IF(ISBLANK('Overzicht jaar tot heden'!B16),\"\",'Overzicht jaar tot heden'!B16)","v":""},0,{"$f":"COUNTIF($F16:CS16, \"P\")","v":0},{"$f":"COUNTIF($F16:CS16, \"Z\")","v":0}]
[{"$f":"IF(ISBLANK('Overzicht jaar tot heden'!A17),\"\",'Overzicht jaar tot heden'!A17)","v":""},{"$f":"IF(ISBLANK('Overzicht jaar tot heden'!B17),\"\",'Overzicht jaar tot heden'!B17)","v":""},0,{"$f":"COUNTIF($F17:CS17, \"P\")","v":0},{"$f":"COUNTIF($F17:CS17, \"Z\")","v":0}]
[{"$f":"IF(ISBLANK('Overzicht jaar tot heden'!A18),\"\",'Overzicht jaar tot heden'!A18)","v":""},{"$f":"IF(ISBLANK('Overzicht jaar tot heden'!B18),\"\",'Overzicht jaar tot heden'!B18)","v":""},0,{"$f":"COUNTIF($F18:CS18, \"P\")","v":0},{"$f":"COUNTIF($F18:CS18, \"Z\")","v":0}]
[{"$f":"IF(ISBLANK('Overzicht jaar tot heden'!A19),\"\",'Overzicht jaar tot heden'!A19)","v":""},{"$f":"IF(ISBLANK('Overzicht jaar tot heden'!B19),\"\",'Overzicht jaar tot heden'!B19)","v":""},0,{"$f":"COUNTIF($F19:CS19, \"P\")","v":0},{"$f":"COUNTIF($F19:CS19, \"Z\")","v":0}]
[{"$f":"IF(ISBLANK('Overzicht jaar tot heden'!A20),\"\",'Overzicht jaar tot heden'!A20)","v":""},{"$f":"IF(ISBLANK('Overzicht jaar tot heden'!B20),\"\",'Overzicht jaar tot heden'!B20)","v":""},0,{"$f":"COUNTIF($F20:CS20, \"P\")","v":0},{"$f":"COUNTIF($F20:CS20, \"Z\")","v":0}]
[{"$f":"IF(ISBLANK('Overzicht jaar tot heden'!A21),\"\",'Overzicht jaar tot heden'!A21)","v":""},{"$f":"IF(ISBLANK('Overzicht jaar tot heden'!B21),\"\",'Overzicht jaar tot heden'!B21)","v":""},0,{"$f":"COUNTIF($F21:CS21, \"P\")","v":0},{"$f":"COUNTIF($F21:CS21, \"Z\")","v":0}]
[{"$f":"IF(ISBLANK('Overzicht jaar tot heden'!A22),\"\",'Overzicht jaar tot heden'!A22)","v":""},{"$f":"IF(ISBLANK('Overzicht jaar tot heden'!B22),\"\",'Overzicht jaar tot heden'!B22)","v":""},0,{"$f":"COUNTIF($F22:CS22, \"P\")","v":0},{"$f":"COUNTIF($F22:CS22, \"Z\")","v":0}]
[{"$f":"IF(ISBLANK('Overzicht jaar tot heden'!A23),\"\",'Overzicht jaar tot heden'!A23)","v":""},{"$f":"IF(ISBLANK('Overzicht jaar tot heden'!B23),\"\",'Overzicht jaar tot heden'!B23)","v":""},0,{"$f":"COUNTIF($F23:CS23, \"P\")","v":0},{"$f":"COUNTIF($F23:CS23, \"Z\")","v":0}]
[{"$f":"IF(ISBLANK('Overzicht jaar tot heden'!A24),\"\",'Overzicht jaar tot heden'!A24)","v":""},{"$f":"IF(ISBLANK('Overzicht jaar tot heden'!B24),\"\",'Overzicht jaar tot heden'!B24)","v":""},0,{"$f":"COUNTIF($F24:CS24, \"P\")","v":0},{"$f":"COUNTIF($F24:CS24, \"Z\")","v":0}]
[{"$f":"IF(ISBLANK('Overzicht jaar tot heden'!A25),\"\",'Overzicht jaar tot heden'!A25)","v":""},{"$f":"IF(ISBLANK('Overzicht jaar tot heden'!B25),\"\",'Overzicht jaar tot heden'!B25)","v":""},0,{"$f":"COUNTIF($F25:CS25, \"P\")","v":0},{"$f":"COUNTIF($F25:CS25, \"Z\")","v":0}]
[{"$f":"IF(ISBLANK('Overzicht jaar tot heden'!A26),\"\",'Overzicht jaar tot heden'!A26)","v":""},{"$f":"IF(ISBLANK('Overzicht jaar tot heden'!B26),\"\",'Overzicht jaar tot heden'!B26)","v":""},0,{"$f":"COUNTIF($F26:CS26, \"P\")","v":0},{"$f":"COUNTIF($F26:CS26, \"Z\")","v":0}]
[{"$f":"IF(ISBLANK('Overzicht jaar tot heden'!A27),\"\",'Overzicht jaar tot heden'!A27)","v":""},{"$f":"IF(ISBLANK('Overzicht jaar tot heden'!B27),\"\",'Overzicht jaar tot heden'!B27)","v":""},0,{"$f":"COUNTIF($F27:CS27, \"P\")","v":0},{"$f":"COUNTIF($F27:CS27, \"Z\")","v":0}]
[{"$f":"IF(ISBLANK('Overzicht jaar tot heden'!A28),\"\",'Overzicht jaar tot heden'!A28)","v":""},{"$f":"IF(ISBLANK('Overzicht jaar tot heden'!B28),\"\",'Overzicht jaar tot heden'!B28)","v":""},0,{"$f":"COUNTIF($F28:CS28, \"P\")","v":0},{"$f":"COUNTIF($F28:CS28, \"Z\")","v":0}]
[{"$f":"IF(ISBLANK('Overzicht jaar tot heden'!A29),\"\",'Overzicht jaar tot heden'!A29)","v":""},{"$f":"IF(ISBLANK('Overzicht jaar tot heden'!B29),\"\",'Overzicht jaar tot heden'!B29)","v":""},0,{"$f":"COUNTIF($F29:CS29, \"P\")","v":0},{"$f":"COUNTIF($F29:CS29, \"Z\")","v":0}]
[{"$f":"IF(ISBLANK('Overzicht jaar tot heden'!A30),\"\",'Overzicht jaar tot heden'!A30)","v":""},{"$f":"IF(ISBLANK('Overzicht jaar tot heden'!B30),\"\",'Overzicht jaar tot heden'!B30)","v":""},0,{"$f":"COUNTIF($F30:CS30, \"P\")","v":0},{"$f":"COUNTIF($F30:CS30, \"Z\")","v":0}]
[{"$f":"IF(ISBLANK('Overzicht jaar tot heden'!A31),\"\",'Overzicht jaar tot heden'!A31)","v":""},{"$f":"IF(ISBLANK('Overzicht jaar tot heden'!B31),\"\",'Overzicht jaar tot heden'!B31)","v":""},0,{"$f":"COUNTIF($F31:CS31, \"P\")","v":0},{"$f":"COUNTIF($F31:CS31, \"Z\")","v":0}]
[{"$f":"IF(ISBLANK('Overzicht jaar tot heden'!A32),\"\",'Overzicht jaar tot heden'!A32)","v":""},{"$f":"IF(ISBLANK('Overzicht jaar tot heden'!B32),\"\",'Overzicht jaar tot heden'!B32)","v":""},0,{"$f":"COUNTIF($F32:CS32, \"P\")","v":0},{"$f":"COUNTIF($F32:CS32, \"Z\")","v":0}]
[{"$f":"IF(ISBLANK('Overzicht jaar tot heden'!A33),\"\",'Overzicht jaar tot heden'!A33)","v":""},{"$f":"IF(ISBLANK('Overzicht jaar tot heden'!B33),\"\",'Overzicht jaar tot heden'!B33)","v":""},0,{"$f":"COUNTIF($F33:CS33, \"P\")","v":0},{"$f":"COUNTIF($F33:CS33, \"Z\")","v":0}]
[{"$f":"IF(ISBLANK('Overzicht jaar tot heden'!A34),\"\",'Overzicht jaar tot heden'!A34)","v":""},{"$f":"IF(ISBLANK('Overzicht jaar tot heden'!B34),\"\",'Overzicht jaar tot heden'!B34)","v":""},0,{"$f":"COUNTIF($F34:CS34, \"P\")","v":0},{"$f":"COUNTIF($F34:CS34, \"Z\")","v":0}]
[{"$f":"IF(ISBLANK('Overzicht jaar tot heden'!A35),\"\",'Overzicht jaar tot heden'!A35)","v":""},{"$f":"IF(ISBLANK('Overzicht jaar tot heden'!B35),\"\",'Overzicht jaar tot heden'!B35)","v":""},0,{"$f":"COUNTIF($F35:CS35, \"P\")","v":0},{"$f":"COUNTIF($F35:CS35, \"Z\")","v":0}]
[{"$f":"IF(ISBLANK('Overzicht jaar tot heden'!A36),\"\",'Overzicht jaar tot heden'!A36)","v":""},{"$f":"IF(ISBLANK('Overzicht jaar tot heden'!B36),\"\",'Overzicht jaar tot heden'!B36)","v":""},0,{"$f":"COUNTIF($F36:CS36, \"P\")","v":0},{"$f":"COUNTIF($F36:CS36, \"Z\")","v":0}]