{"text_format":"3","workbook":"xlsx","n_sheets":4,"sheets":["START","PROSJEKTPARAMETERE","PROSJEKTDETALJER","PROSJEKTTOTALER"],"not_rendered":{"charts":2,"defined_names":3,"pivot_tables":1},"read":"whole","date_system":"1900"}

{"sheet":"START","index":0,"n_rows":7,"n_cols":2,"rows_kept":7}
[null,"OM DENNE MALEN"]
[null,"Spor prosjektparametere, prosjektdetaljer og prosjekttotaler i arbeidsboken Sporing av arrangementsplanlegging."]
[null,"Skriv inn informasjon i Prosjektparametere-regnearket for å oppdatere stolpediagrammer, og i Prosjektdetaljer-regneark. Pivottabell i Prosjektkostnader-regnearket oppdateres automatisk."]
[null,"Fyll ut firmanavn i Parametere-regnearket, og de vil automatisk oppdateres i andre regneark."]
[null,"Obs!  "]
[null,"Flere instruksjoner finnes i kolonne A i hvert regneark i arbeidsboken Sporing av arrangementsplanlegging. Denne teksten er skjult med hensikt. Hvis du vil fjerne teksten, velger du kolonne A og deretter SLETT. Hvis du vil vise teksten, velger du kolonne A, og endrer deretter skriftfarge."]
{"$rows_left_out":2}
{"sheet":"PROSJEKTPARAMETERE","index":1,"n_rows":19,"n_cols":9,"rows_kept":19,"merged":[[23,1,42,3]]}
[null,"Firmanavn"]
[null,"Prosjektsporing for arrangementsbehandling"]
[null,{"$f":"B1&\" Konfidensielt\"","v":"Firmanavn Konfidensielt"}]
[null,"Skyggelagte celler beregnes for deg. Du trenger ikke å skrive inn noe i dem."]
[null,"PROSJEKTTYPE","KUNDEANSVARLIG","PROSJEKTLEDER","STRATEGILEDER","UTFORMINGSSPESIALIST","ARRANGEMENTSBEMANNING","ADMINISTRASJONSPERSONALE","Totalt"]
[null,"Utvikling av arrangementsstrategi",{"v":0.2,"d":"20%"},{"v":0.1,"d":"10%"},{"v":0.6,"d":"60%"},{"v":0,"d":"0%"},{"v":0,"d":"0%"},{"v":0.1,"d":"10%"},{"$f":"SUM(Parametere[[#This Row],[KUNDEANSVARLIG]:[ADMINISTRASJONSPERSONALE]])","v":{"v":1,"d":"100%"}}]
{"$rows_left_out":14}
{"sheet":"PROSJEKTDETALJER","index":2,"n_rows":10,"n_cols":23,"rows_kept":10}
[null,{"$f":"PROSJEKTPARAMETERE!B1","v":"Firmanavn"}]
[null,"Prosjektsporing for arrangementsbehandling"]
[null,{"$f":"PROSJEKTPARAMETERE!B3","v":"Firmanavn Konfidensielt"}]
["Angi informasjon i Prosjektdetaljer-tabellen, som starter i cellen til høyre.\nINFORMASJON\nHvis du vil legge til en rad i tabellen til høyre, velger du cellen lengst til høyre i tabellen (ikke Totaler-raden). Trykk på TAB, eller trykk på SKIFT+F10 der du ønsker å sette inn en rad. Velg deretter Sett inn | Tabellrader ovenfor/nedenfor.\nSørg for at du sletter alle ubrukte rader. Dette er fordi at PROSJEKTTOTALER-pivottabellen bruker alle tabellcellene, og ellers ville ha gitt deg feil resultat.","PROSJEKTNAVN","PROSJEKTTYPE","BEREGNET START","BEREGNET AVSLUTNING","FAKTISK START","FAKTISK AVSLUTNING","BEREGNET ARBEID","FAKTISK ARBEID","BEREGNET VARIGHET","FAKTISK VARIGHET","KUNDEANSVARLIG","PROSJEKTLEDER","STRATEGILEDER","UTFORMINGSSPESIALIST","ARRANGEMENTSBEMANNING","ADMINISTRASJONSPERSONALE","KUNDEANSVARLIG ","PROSJEKTLEDER ","STRATEGILEDER ","UTFORMINGSSPESIALIST ","ARRANGEMENTSBEMANNING ","ADMINISTRASJONSPERSONALE "]
[null,"Prosjekt 1","Utvikling av arrangementsstrategi",{"$f":"DATE(YEAR(TODAY()),6,9)","v":"2022-06-09"},{"$f":" DATE(YEAR(TODAY()),8,7)","v":"2022-08-07"},{"$f":"DATE(YEAR(TODAY()),6,29)","v":"2022-06-29"},{"$f":"DATE(YEAR(TODAY()),9,3)","v":"2022-09-03"},200,220,{"$f":"DAYS360(Prosjektdetaljer[[#This Row],[BEREGNET START]],Prosjektdetaljer[[#This Row],[BEREGNET AVSLUTNING]],FALSE)","v":58},{"$f":"DAYS360(Prosjektdetaljer[[#This Row],[FAKTISK START]],Prosjektdetaljer[[#This Row],[FAKTISK AVSLUTNING]],FALSE)","v":64},{"$f":"INDEX(Parametere[],MATCH(Prosjektdetaljer[[#This Row],[PROSJEKTTYPE]],Parametere[PROSJEKTTYPE],0),MATCH(Prosjektdetaljer[[#Headers],[KUNDEANSVARLIG]],Parametere[#Headers],0))*INDEX(PROSJEKTPARAMETERE!$B$12:$H$12,1,MATCH(Prosjektdetaljer[[#Headers],[KUNDEANSVARLIG]],Parametere[#Headers],0))*Prosjektdetaljer[[#This Row],[BEREGNET ARBEID]]","v":{"v":7200,"d":"kr 7,200"}},{"$f":"INDEX(Parametere[],MATCH(Prosjektdetaljer[[#This Row],[PROSJEKTTYPE]],Parametere[PROSJEKTTYPE],0),MATCH(Prosjektdetaljer[[#Headers],[PROSJEKTLEDER]],Parametere[#Headers],0))*INDEX(PROSJEKTPARAMETERE!$B$12:$H$12,1,MATCH(Prosjektdetaljer[[#Headers],[PROSJEKTLEDER]],Parametere[#Headers],0))*Prosjektdetaljer[[#This Row],[BEREGNET ARBEID]]","v":{"v":2400,"d":"kr 2,400"}},{"$f":"INDEX(Parametere[],MATCH(Prosjektdetaljer[[#This Row],[PROSJEKTTYPE]],Parametere[PROSJEKTTYPE],0),MATCH(Prosjektdetaljer[[#Headers],[STRATEGILEDER]],Parametere[#Headers],0))*INDEX(PROSJEKTPARAMETERE!$B$12:$H$12,1,MATCH(Prosjektdetaljer[[#Headers],[STRATEGILEDER]],Parametere[#Headers],0))*Prosjektdetaljer[[#This Row],[BEREGNET ARBEID]]","v":{"v":18000,"d":"kr 18,000"}},{"$f":"INDEX(Parametere[],MATCH(Prosjektdetaljer[[#This Row],[PROSJEKTTYPE]],Parametere[PROSJEKTTYPE],0),MATCH(Prosjektdetaljer[[#Headers],[UTFORMINGSSPESIALIST]],Parametere[#Headers],0))*INDEX(PROSJEKTPARAMETERE!$B$12:$H$12,1,MATCH(Prosjektdetaljer[[#Headers],[UTFORMINGSSPESIALIST]],Parametere[#Headers],0))*Prosjektdetaljer[[#This Row],[BEREGNET ARBEID]]","v":{"v":0,"d":"kr 0"}},{"$f":"INDEX(Parametere[],MATCH(Prosjektdetaljer[[#This Row],[PROSJEKTTYPE]],Parametere[PROSJEKTTYPE],0),MATCH(Prosjektdetaljer[[#Headers],[ARRANGEMENTSBEMANNING]],Parametere[#Headers],0))*INDEX(PROSJEKTPARAMETERE!$B$12:$H$12,1,MATCH(Prosjektdetaljer[[#Headers],[ARRANGEMENTSBEMANNING]],Parametere[#Headers],0))*Prosjektdetaljer[[#This Row],[BEREGNET ARBEID]]","v":{"v":0,"d":"kr 0"}},{"$f":"INDEX(Parametere[],MATCH(Prosjektdetaljer[[#This Row],[PROSJEKTTYPE]],Parametere[PROSJEKTTYPE],0),MATCH(Prosjektdetaljer[[#Headers],[ADMINISTRASJONSPERSONALE]],Parametere[#Headers],0))*INDEX(PROSJEKTPARAMETERE!$B$12:$H$12,1,MATCH(Prosjektdetaljer[[#Headers],[ADMINISTRASJONSPERSONALE]],Parametere[#Headers],0))*Prosjektdetaljer[[#This Row],[BEREGNET ARBEID]]","v":{"v":1200,"d":"kr 1,200"}},{"$f":"INDEX(Parametere[],MATCH(Prosjektdetaljer[[#This Row],[PROSJEKTTYPE]],Parametere[PROSJEKTTYPE],0),MATCH(Prosjektdetaljer[[#Headers],[KUNDEANSVARLIG]],Parametere[#Headers],0))*INDEX(PROSJEKTPARAMETERE!$B$12:$H$12,1,MATCH(Prosjektdetaljer[[#Headers],[KUNDEANSVARLIG]],Parametere[#Headers],0))*Prosjektdetaljer[[#This Row],[FAKTISK ARBEID]]","v":{"v":7920,"d":"kr 7,920"}},{"$f":"INDEX(Parametere[],MATCH(Prosjektdetaljer[[#This Row],[PROSJEKTTYPE]],Parametere[PROSJEKTTYPE],0),MATCH(Prosjektdetaljer[[#Headers],[PROSJEKTLEDER]],Parametere[#Headers],0))*INDEX(PROSJEKTPARAMETERE!$B$12:$H$12,1,MATCH(Prosjektdetaljer[[#Headers],[PROSJEKTLEDER]],Parametere[#Headers],0))*Prosjektdetaljer[[#This Row],[FAKTISK ARBEID]]","v":{"v":2640,"d":"kr 2,640"}},{"$f":"INDEX(Parametere[],MATCH(Prosjektdetaljer[[#This Row],[PROSJEKTTYPE]],Parametere[PROSJEKTTYPE],0),MATCH(Prosjektdetaljer[[#Headers],[STRATEGILEDER]],Parametere[#Headers],0))*INDEX(PROSJEKTPARAMETERE!$B$12:$H$12,1,MATCH(Prosjektdetaljer[[#Headers],[STRATEGILEDER]],Parametere[#Headers],0))*Prosjektdetaljer[[#This Row],[FAKTISK ARBEID]]","v":{"v":19800,"d":"kr 19,800"}},{"$f":"INDEX(Parametere[],MATCH(Prosjektdetaljer[[#This Row],[PROSJEKTTYPE]],Parametere[PROSJEKTTYPE],0),MATCH(Prosjektdetaljer[[#Headers],[UTFORMINGSSPESIALIST]],Parametere[#Headers],0))*INDEX(PROSJEKTPARAMETERE!$B$12:$H$12,1,MATCH(Prosjektdetaljer[[#Headers],[UTFORMINGSSPESIALIST]],Parametere[#Headers],0))*Prosjektdetaljer[[#This Row],[FAKTISK ARBEID]]","v":{"v":0,"d":"kr 0"}},{"$f":"INDEX(Parametere[],MATCH(Prosjektdetaljer[[#This Row],[PROSJEKTTYPE]],Parametere[PROSJEKTTYPE],0),MATCH(Prosjektdetaljer[[#Headers],[ARRANGEMENTSBEMANNING]],Parametere[#Headers],0))*INDEX(PROSJEKTPARAMETERE!$B$12:$H$12,1,MATCH(Prosjektdetaljer[[#Headers],[ARRANGEMENTSBEMANNING]],Parametere[#Headers],0))*Prosjektdetaljer[[#This Row],[FAKTISK ARBEID]]","v":{"v":0,"d":"kr 0"}},{"$f":"INDEX(Parametere[],MATCH(Prosjektdetaljer[[#This Row],[PROSJEKTTYPE]],Parametere[PROSJEKTTYPE],0),MATCH(Prosjektdetaljer[[#Headers],[ADMINISTRASJONSPERSONALE]],Parametere[#Headers],0))*INDEX(PROSJEKTPARAMETERE!$B$12:$H$12,1,MATCH(Prosjektdetaljer[[#Headers],[ADMINISTRASJONSPERSONALE]],Parametere[#Headers],0))*Prosjektdetaljer[[#This Row],[FAKTISK ARBEID]]","v":{"v":1320,"d":"kr 1,320"}}]
[null,"Prosjekt 2","Arrangementsplanlegging",{"$f":"DATE(YEAR(TODAY())+1,6,25)","v":"2023-06-25"},{"$f":"DATE(YEAR(TODAY())+1,7,27)","v":"2023-07-27"},{"$f":"DATE(YEAR(TODAY()),7,15)","v":"2022-07-15"},{"$f":"DATE(YEAR(TODAY())+1,8,25)","v":"2023-08-25"},400,390,{"$f":"DAYS360(Prosjektdetaljer[[#This Row],[BEREGNET START]],Prosjektdetaljer[[#This Row],[BEREGNET AVSLUTNING]],FALSE)","v":32},{"$f":"DAYS360(Prosjektdetaljer[[#This Row],[FAKTISK START]],Prosjektdetaljer[[#This Row],[FAKTISK AVSLUTNING]],FALSE)","v":400},{"$f":"INDEX(Parametere[],MATCH(Prosjektdetaljer[[#This Row],[PROSJEKTTYPE]],Parametere[PROSJEKTTYPE],0),MATCH(Prosjektdetaljer[[#Headers],[KUNDEANSVARLIG]],Parametere[#Headers],0))*INDEX(PROSJEKTPARAMETERE!$B$12:$H$12,1,MATCH(Prosjektdetaljer[[#Headers],[KUNDEANSVARLIG]],Parametere[#Headers],0))*Prosjektdetaljer[[#This Row],[BEREGNET ARBEID]]","v":{"v":14400,"d":"kr 14,400"}},{"$f":"INDEX(Parametere[],MATCH(Prosjektdetaljer[[#This Row],[PROSJEKTTYPE]],Parametere[PROSJEKTTYPE],0),MATCH(Prosjektdetaljer[[#Headers],[PROSJEKTLEDER]],Parametere[#Headers],0))*INDEX(PROSJEKTPARAMETERE!$B$12:$H$12,1,MATCH(Prosjektdetaljer[[#Headers],[PROSJEKTLEDER]],Parametere[#Headers],0))*Prosjektdetaljer[[#This Row],[BEREGNET ARBEID]]","v":{"v":24000,"d":"kr 24,000"}},{"$f":"INDEX(Parametere[],MATCH(Prosjektdetaljer[[#This Row],[PROSJEKTTYPE]],Parametere[PROSJEKTTYPE],0),MATCH(Prosjektdetaljer[[#Headers],[STRATEGILEDER]],Parametere[#Headers],0))*INDEX(PROSJEKTPARAMETERE!$B$12:$H$12,1,MATCH(Prosjektdetaljer[[#Headers],[STRATEGILEDER]],Parametere[#Headers],0))*Prosjektdetaljer[[#This Row],[BEREGNET ARBEID]]","v":{"v":6000,"d":"kr 6,000"}},{"$f":"INDEX(Parametere[],MATCH(Prosjektdetaljer[[#This Row],[PROSJEKTTYPE]],Parametere[PROSJEKTTYPE],0),MATCH(Prosjektdetaljer[[#Headers],[UTFORMINGSSPESIALIST]],Parametere[#Headers],0))*INDEX(PROSJEKTPARAMETERE!$B$12:$H$12,1,MATCH(Prosjektdetaljer[[#Headers],[UTFORMINGSSPESIALIST]],Parametere[#Headers],0))*Prosjektdetaljer[[#This Row],[BEREGNET ARBEID]]","v":{"v":4000,"d":"kr 4,000"}},{"$f":"INDEX(Parametere[],MATCH(Prosjektdetaljer[[#This Row],[PROSJEKTTYPE]],Parametere[PROSJEKTTYPE],0),MATCH(Prosjektdetaljer[[#Headers],[ARRANGEMENTSBEMANNING]],Parametere[#Headers],0))*INDEX(PROSJEKTPARAMETERE!$B$12:$H$12,1,MATCH(Prosjektdetaljer[[#Headers],[ARRANGEMENTSBEMANNING]],Parametere[#Headers],0))*Prosjektdetaljer[[#This Row],[BEREGNET ARBEID]]","v":{"v":0,"d":"kr 0"}},{"$f":"INDEX(Parametere[],MATCH(Prosjektdetaljer[[#This Row],[PROSJEKTTYPE]],Parametere[PROSJEKTTYPE],0),MATCH(Prosjektdetaljer[[#Headers],[ADMINISTRASJONSPERSONALE]],Parametere[#Headers],0))*INDEX(PROSJEKTPARAMETERE!$B$12:$H$12,1,MATCH(Prosjektdetaljer[[#Headers],[ADMINISTRASJONSPERSONALE]],Parametere[#Headers],0))*Prosjektdetaljer[[#This Row],[BEREGNET ARBEID]]","v":{"v":2400,"d":"kr 2,400"}},{"$f":"INDEX(Parametere[],MATCH(Prosjektdetaljer[[#This Row],[PROSJEKTTYPE]],Parametere[PROSJEKTTYPE],0),MATCH(Prosjektdetaljer[[#Headers],[KUNDEANSVARLIG]],Parametere[#Headers],0))*INDEX(PROSJEKTPARAMETERE!$B$12:$H$12,1,MATCH(Prosjektdetaljer[[#Headers],[KUNDEANSVARLIG]],Parametere[#Headers],0))*Prosjektdetaljer[[#This Row],[FAKTISK ARBEID]]","v":{"v":14040,"d":"kr 14,040"}},{"$f":"INDEX(Parametere[],MATCH(Prosjektdetaljer[[#This Row],[PROSJEKTTYPE]],Parametere[PROSJEKTTYPE],0),MATCH(Prosjektdetaljer[[#Headers],[PROSJEKTLEDER]],Parametere[#Headers],0))*INDEX(PROSJEKTPARAMETERE!$B$12:$H$12,1,MATCH(Prosjektdetaljer[[#Headers],[PROSJEKTLEDER]],Parametere[#Headers],0))*Prosjektdetaljer[[#This Row],[FAKTISK ARBEID]]","v":{"v":23400,"d":"kr 23,400"}},{"$f":"INDEX(Parametere[],MATCH(Prosjektdetaljer[[#This Row],[PROSJEKTTYPE]],Parametere[PROSJEKTTYPE],0),MATCH(Prosjektdetaljer[[#Headers],[STRATEGILEDER]],Parametere[#Headers],0))*INDEX(PROSJEKTPARAMETERE!$B$12:$H$12,1,MATCH(Prosjektdetaljer[[#Headers],[STRATEGILEDER]],Parametere[#Headers],0))*Prosjektdetaljer[[#This Row],[FAKTISK ARBEID]]","v":{"v":5850,"d":"kr 5,850"}},{"$f":"INDEX(Parametere[],MATCH(Prosjektdetaljer[[#This Row],[PROSJEKTTYPE]],Parametere[PROSJEKTTYPE],0),MATCH(Prosjektdetaljer[[#Headers],[UTFORMINGSSPESIALIST]],Parametere[#Headers],0))*INDEX(PROSJEKTPARAMETERE!$B$12:$H$12,1,MATCH(Prosjektdetaljer[[#Headers],[UTFORMINGSSPESIALIST]],Parametere[#Headers],0))*Prosjektdetaljer[[#This Row],[FAKTISK ARBEID]]","v":{"v":3900,"d":"kr 3,900"}},{"$f":"INDEX(Parametere[],MATCH(Prosjektdetaljer[[#This Row],[PROSJEKTTYPE]],Parametere[PROSJEKTTYPE],0),MATCH(Prosjektdetaljer[[#Headers],[ARRANGEMENTSBEMANNING]],Parametere[#Headers],0))*INDEX(PROSJEKTPARAMETERE!$B$12:$H$12,1,MATCH(Prosjektdetaljer[[#Headers],[ARRANGEMENTSBEMANNING]],Parametere[#Headers],0))*Prosjektdetaljer[[#This Row],[FAKTISK ARBEID]]","v":{"v":0,"d":"kr 0"}},{"$f":"INDEX(Parametere[],MATCH(Prosjektdetaljer[[#This Row],[PROSJEKTTYPE]],Parametere[PROSJEKTTYPE],0),MATCH(Prosjektdetaljer[[#Headers],[ADMINISTRASJONSPERSONALE]],Parametere[#Headers],0))*INDEX(PROSJEKTPARAMETERE!$B$12:$H$12,1,MATCH(Prosjektdetaljer[[#Headers],[ADMINISTRASJONSPERSONALE]],Parametere[#Headers],0))*Prosjektdetaljer[[#This Row],[FAKTISK ARBEID]]","v":{"v":2340,"d":"kr 2,340"}}]
{"$rows_left_out":5}
{"sheet":"PROSJEKTTOTALER","index":3,"n_rows":10,"n_cols":14,"rows_kept":10}
[null,{"$f":"PROSJEKTPARAMETERE!B1","v":"Firmanavn"}]
[null,"Prosjektsporing for arrangementsbehandling"]
[null,{"$f":"PROSJEKTPARAMETERE!B3","v":"Firmanavn Konfidensielt"}]
["Pivottabellen som starter i cellen til høyre, oppdateres automatisk.\nINFORMASJON\nHvis du vil oppdatere pivottabellen til høyre, markerer du den (en celle i pivottabellen) og velger Oppdater på fanen på PIVOTTABELLVERKTØY | ANALYSER-båndet. Eller trykk på SKIFT+F10 i en celle i pivottabellen og velg Oppdater.","PROSJEKTNAVN","BEREGNET KUNDEANSVARLIG","BEREGNET PROSJEKTLEDER","BEREGNET PROSJEKTLEDER ","BEREGNET UTFORMINGSSPESIALIST","BEREGNET ARRANGEMENTSBEMANNING","BEREGNET ADMINISTRASJONSPERSONALE","FAKTISK KUNDEANSVARLIG","FAKTISK PROSJEKTLEDER","FAKTISK PROSJEKTLEDER ","FAKTISK UTFORMINGSSPESIALIST","FAKTISK ARRANGEMENTSBEMANNING","FAKTISK ADMINISTRASJONSPERSONALE"]
[null,"Prosjekt 1",{"v":7200,"d":"kr 7,200.00"},{"v":2400,"d":"kr 2,400.00"},{"v":18000,"d":"kr 18,000.00"},{"v":0,"d":"kr 0.00"},{"v":0,"d":"kr 0.00"},{"v":1200,"d":"kr 1,200.00"},{"v":7920,"d":"kr 7,920.00"},{"v":2640,"d":"kr 2,640.00"},{"v":19800,"d":"kr 19,800.00"},{"v":0,"d":"kr 0.00"},{"v":0,"d":"kr 0.00"},{"v":1320,"d":"kr 1,320.00"}]
[null,"Prosjekt 2",{"v":14400,"d":"kr 14,400.00"},{"v":24000,"d":"kr 24,000.00"},{"v":6000,"d":"kr 6,000.00"},{"v":4000,"d":"kr 4,000.00"},{"v":0,"d":"kr 0.00"},{"v":2400,"d":"kr 2,400.00"},{"v":14040,"d":"kr 14,040.00"},{"v":23400,"d":"kr 23,400.00"},{"v":5850,"d":"kr 5,850.00"},{"v":3900,"d":"kr 3,900.00"},{"v":0,"d":"kr 0.00"},{"v":2340,"d":"kr 2,340.00"}]
{"$rows_left_out":4}