{"text_format":"3","workbook":"xlsx","n_sheets":6,"sheets":["Hjem","Personlige detaljer","Reise detaljer","Hotell- og aktivitets","Leiebil","Reserve detaljer"],"not_rendered":{"images":19,"defined_names":10},"read":"whole","date_system":"1900"}

{"sheet":"Hjem","index":0,"n_rows":34,"n_cols":22,"rows_kept":34,"merged":[[32,1,32,3],[32,6,32,8],[32,11,32,13],[32,16,32,18],[32,21,32,23],[33,1,33,3],[33,6,33,8],[33,11,33,13],[33,16,33,18],[33,21,33,23]]}
{"$rows_empty":32}
[null,{"$f":"PersonligOppføring/PersonligAntall","v":{"v":1,"d":"100%"}},{"$nulls":4},{"$f":"Reiseoppføring/Reiseantall","v":{"v":0.65,"d":"65%"}},{"$nulls":4},{"$f":"Hotelloppføring/Hotellantall","v":{"v":0.5384615384615384,"d":"54%"}},{"$nulls":4},{"$f":"IF(Leiebil!D4=\"Ja\",LeiebilOppføring/LeiebilAntall,1)","v":{"v":0.2857142857142857,"d":"29%"}},{"$nulls":4},{"$f":"ReserveOppføring/ReserveAntall","v":{"v":0.625,"d":"63%"}}]
[null,{"$f":"TEXT(B33,\"0 % \"\"fullført\"\"\")","v":"100 % fullført"},{"$nulls":4},{"$f":"TEXT(G33,\"0 % \"\"fullført\"\"\")","v":"65 % fullført"},{"$nulls":4},{"$f":"TEXT(L33,\"0 % \"\"fullført\"\"\")","v":"54 % fullført"},{"$nulls":4},{"$f":"TEXT(Q33,\"0 % \"\"fullført\"\"\")","v":"29 % fullført"},{"$nulls":4},{"$f":"TEXT(V33,\"0 % \"\"fullført\"\"\")","v":"63 % fullført"}]

{"sheet":"Personlige detaljer","index":1,"n_rows":11,"n_cols":5,"rows_kept":11,"merged":[[4,2,5,2],[4,3,5,3],[4,4,5,4],[7,2,8,2],[7,3,8,3],[7,4,8,4],[17,1,17,4]]}
[]
[]
[{"$f":"IF(COUNTA(B4:B8)<1,\"*\",\"\")","v":""},"Fulle navn og kallenavn",{"$f":"IF(E3=\"\",1,\"\")","v":""},"Hjemmeadresse","987 North Fifth Street Columbus, TN 01234"]
[null,"Michael Alexander"]
[null,"Michelle Alexander",{"$f":"IF(E5=\"\",1,\"\")","v":""},"Telefon, privat",3455550123]
[null,"Sean P. Alexander"]
[]
[null,null,{"$f":"IF((E8=0)+(E8=\"\"),1,\"\")","v":""},"Mobiltelefoner",3455550124]
[]
[]
[{"$f":"PersonligOppføring","v":3},{"$f":"IF(A11<>PersonligAntall,\"Mangler viktige detaljer\",\"Viktige detaljer fullført\")","v":"Viktige detaljer fullført"}]

{"sheet":"Reise detaljer","index":2,"n_rows":18,"n_cols":6,"rows_kept":18,"merged":[[23,1,23,5]]}
[]
[]
[null,"Avreisedetaljer",null,null,"Returdetaljer"]
[{"$f":"IF(C4=\"\",1,\"\")","v":""},"Dato",{"$f":"TODAY()+45","v":"2013-01-19"},{"$f":"IF(F4=\"\",1,\"\")","v":""},"Dato",{"$f":"TODAY()+51","v":"2013-01-25"}]
[{"$f":"IF(C5=\"\",1,\"\")","v":""},"Flyselskap","Blue Yonder Airlines","","Flyselskap","Blue Yonder Airlines"]
[{"$f":"IF(C6=\"\",1,\"\")","v":""},"Flight-nummer","WS192",1,"Flight-nummer"]
[{"$f":"IF(C7=\"\",1,\"\")","v":""},"Fra","Columbus","","Fra","Seattle"]
[{"$f":"IF(C8=\"\",1,\"\")","v":""},"Avreisetid","12:30:00",1,"Avreisetid"]
[null,"Avreiseterminal/-utgang",null,1,"Avreiseterminal/-utgang"]
[{"$f":"IF(C10=\"\",1,\"\")","v":""},"Til","Seattle",1,"Til"]
[{"$f":"IF(C11=\"\",1,\"\")","v":""},"Ankomsttid","12:32:00",1,"Ankomsttid"]
[null,"Lengde på flyvning","6 timer",null,"Lengde på flyvning"]
[{"$f":"IF(C13=\"\",1,\"\")","v":""},"Setenumre","A1, A2,A3",{"$f":"IF(F13=\"\",1,\"\")","v":1},"Setenumre"]
[{"$f":"IF(C14=\"\",1,\"\")","v":""},"Bekreftelsesnumre","Samme",{"$f":"IF(F14=\"\",1,\"\")","v":1},"Bekreftelsesnumre"]
[{"$f":"IF(C15=\"\",1,\"\")","v":""},"Måltid","Ingen begrensninger",null,"Måltid"]
[null,"Flyselskapets telefonnummer",1235550234,null,"Flyselskapets telefonnummer",1235550234]
[]
[{"$f":"Reiseoppføring","v":13},{"$f":"IF(A18<>Reiseantall,\"Mangler viktige detaljer\",\"Viktige detaljer fullført\")","v":"Mangler viktige detaljer"}]

{"sheet":"Hotell- og aktivitets","index":3,"n_rows":15,"n_cols":7,"rows_kept":15,"merged":[[21,1,21,6]]}
[]
[]
[null,"Detaljer om hotelloppphold/overnatting",{"$nulls":3},"Detaljer om ferieaktiviteter"]
[{"$f":"IF(C4=\"\",1,\"\")","v":""},"Reservasjonsdato",{"$f":"TODAY()+45","v":"2013-01-19"},null,null,"Aktivitet 1","Skitur"]
["","Hotellets navn","Alpine Ski House",null,{"$f":"IF(AND($G$4<>\"\",G5=\"\"),1,\"\")","v":1},"Datoer/klokkeslett"]
["","Hotellets adresse","789 Main Street",null,{"$f":"IF(AND($G$4<>\"\",G6=\"\"),1,\"\")","v":1},"Reservasjonsdato"]
["","Hotellets telefonnummer","Seattle",null,{"$f":"IF(AND($G$4<>\"\",G7=\"\"),1,\"\")","v":1},"Bekreftelsesnummer"]
["","Innsjekkingsdag/-tid",{"$f":"TODAY()+45.5","v":"2013-01-19T12:00:00"},null,null,"Aktivitet 2","Coho Vineyard & Winery"]
["","Utsjekkingsdag/-tid",{"$f":"TODAY()+50.5","v":"2013-01-24T12:00:00"},null,{"$f":"IF(AND($G$8<>\"\",G9=\"\"),1,\"\")","v":1},"Datoer/klokkeslett"]
["","Bekreftelsesnummer","CJ1234567",null,{"$f":"IF(AND($G$8<>\"\",G10=\"\"),1,\"\")","v":1},"Reservasjonsdato"]
[{"$nulls":4},{"$f":"IF(AND($G$8<>\"\",G11=\"\"),1,\"\")","v":1},"Bekreftelsesnummer"]
[{"$f":"Hotelloppføring","v":7},{"$f":"IF(A12<>Hotellantall,\"Mangler viktige detaljer\",\"Viktige detaljer fullført\")","v":"Mangler viktige detaljer"},{"$nulls":3},"Aktivitet 3"]
[{"$nulls":4},{"$f":"IF(AND($G$12<>\"\",G13=\"\"),1,\"\")","v":""},"Datoer/klokkeslett"]
[{"$nulls":4},{"$f":"IF(AND($G$12<>\"\",G14=\"\"),1,\"\")","v":""},"Reservasjonsdato"]
[{"$nulls":4},{"$f":"IF(AND($G$12<>\"\",G15=\"\"),1,\"\")","v":""},"Bekreftelsesnummer"]

{"sheet":"Leiebil","index":4,"n_rows":13,"n_cols":4,"rows_kept":13,"merged":[[18,0,18,4]]}
[]
[]
[null,null,"Informasjon om leiebil"]
[null,null,"Leie bil?","Ja"]
[null,{"$f":"IF(AND($D$4=\"Ja\",D5=\"\"),1,\"\")","v":""},"Reservasjonsdato",{"$f":"TODAY()+45","v":"2013-01-19"}]
[null,{"$f":"IF(AND($D$4=\"Ja\",D6=\"\"),1,\"\")","v":1},"Utleiefirma"]
[null,1,"Hentedag/-klokkeslett"]
[null,1,"Leveringsdag/-klokkeslett"]
[null,1,"Bekreftelsesnummer"]
[null,"","Biltype","Økonomi"]
[null,1,"Telefonnummer"]
[]
[null,{"$f":"LeiebilOppføring","v":2},{"$f":"IF(B13<>LeiebilAntall,\"Mangler viktige detaljer\",\"Viktige detaljer fullført\")","v":"Mangler viktige detaljer"}]

{"sheet":"Reserve detaljer","index":5,"n_rows":11,"n_cols":6,"rows_kept":11,"merged":[[3,4,4,4],[3,5,4,5],[3,6,4,6],[5,4,6,4],[5,5,6,5],[5,6,6,6],[7,5,8,5],[7,6,8,6],[16,1,16,6]]}
[]
[]
[null,"Forsikringsdetaljer",{"$nulls":3},"Kontaktdetaljer i nødstilfeller"]
[{"$f":"IF(C4=\"\",1,\"\")","v":""},"Forsikringsselskap","Forsikring for alle",null,{"$f":"IF(G4=\"\",1,\"\")","v":1},"Navn / relasjon / telefon"]
["","Telefonnummer",1235550567]
["","Dekningstype","1900-01-05",null,{"$f":"IF(G6=\"\",1,\"\")","v":1},"Navn / relasjon / telefon"]
["","Bekreftelsesnummer","1900-01-05"]
["","Kjøpsdato",{"$f":"TODAY()","v":"2012-12-05"},null,null,"Navn / relasjon / telefon"]
[1,"Dekningsdatoer"]
[]
[{"$f":"ReserveOppføring","v":5},{"$f":"IF(A11<>ReserveAntall,\"Mangler viktige detaljer\",\"Viktige detaljer fullført\")","v":"Mangler viktige detaljer"}]