{"text_format":"3","workbook":"xlsx","n_sheets":3,"sheets":["Opplæringslogg","Kursliste","Personalinfo"],"not_rendered":{"defined_names":13},"read":"whole","date_system":"1900"}

{"sheet":"Opplæringslogg","index":0,"n_rows":23,"n_cols":9,"rows_kept":23}
[]
[]
[null,null,"OPPLÆRINGSLOGG"]
{"$rows_empty":8}
[null,null,"KURSDATO","NAVN","KURS","INSTRUKTØR","GJENNOMFØRT","BESTÅTT/IKKE BESTÅTT","NOTATER"]
[null,null,"2012-06-01","Karen Berg","Innføring for ansatte",{"$f":"IF(tblOpplæringsLogg[[#This Row],[KURS]]=\"\",\"\",IFERROR(VLOOKUP(tblOpplæringsLogg[[#This Row],[KURS]],tblKursListe[],2,0),\"Ikke funnet\"))","v":"Thomas Jensen"},"Ja","Bestått","Utmerket instruktør."]
[null,null,"2012-06-02","Henrik Larsen","Innføring for ansatte",{"$f":"IF(tblOpplæringsLogg[[#This Row],[KURS]]=\"\",\"\",IFERROR(VLOOKUP(tblOpplæringsLogg[[#This Row],[KURS]],tblKursListe[],2,0),\"Ikke funnet\"))","v":"Thomas Jensen"},"Ja","Ikke bestått","Måtte dra tidlig, kunne ikke fullføre."]
[null,null,"2012-06-03","Karen Berg","Innføring for ansatte",{"$f":"IF(tblOpplæringsLogg[[#This Row],[KURS]]=\"\",\"\",IFERROR(VLOOKUP(tblOpplæringsLogg[[#This Row],[KURS]],tblKursListe[],2,0),\"Ikke funnet\"))","v":"Thomas Jensen"},"Ja","Bestått","Endelig tilbud dette kvartalet."]
[null,null,"2012-06-03","Henrik Larsen","Innføring for ansatte",{"$f":"IF(tblOpplæringsLogg[[#This Row],[KURS]]=\"\",\"\",IFERROR(VLOOKUP(tblOpplæringsLogg[[#This Row],[KURS]],tblKursListe[],2,0),\"Ikke funnet\"))","v":"Thomas Jensen"},"Ja","Bestått","Endelig tilbud dette kvartalet."]
[null,null,"2012-06-04","Henrik Larsen","Ansattoperasjoner",{"$f":"IF(tblOpplæringsLogg[[#This Row],[KURS]]=\"\",\"\",IFERROR(VLOOKUP(tblOpplæringsLogg[[#This Row],[KURS]],tblKursListe[],2,0),\"Ikke funnet\"))","v":"Anne Hansen"},"Ja","Bestått","Første tilbud for dette kvartalet"]
[null,null,"2012-06-04","Karen Berg","Ansattoperasjoner",{"$f":"IF(tblOpplæringsLogg[[#This Row],[KURS]]=\"\",\"\",IFERROR(VLOOKUP(tblOpplæringsLogg[[#This Row],[KURS]],tblKursListe[],2,0),\"Ikke funnet\"))","v":"Anne Hansen"},"Ja","Bestått","Første tilbud for dette kvartalet"]
[null,null,"2012-06-04","Karen Berg","Mellomliggende regnskapsføring",{"$f":"IF(tblOpplæringsLogg[[#This Row],[KURS]]=\"\",\"\",IFERROR(VLOOKUP(tblOpplæringsLogg[[#This Row],[KURS]],tblKursListe[],2,0),\"Ikke funnet\"))","v":"Anne Hansen"},"Ja","Bestått","Kun inviterte deltakere."]
[null,null,"2012-06-04","Karen Berg","Ansattoperasjoner",{"$f":"IF(tblOpplæringsLogg[[#This Row],[KURS]]=\"\",\"\",IFERROR(VLOOKUP(tblOpplæringsLogg[[#This Row],[KURS]],tblKursListe[],2,0),\"Ikke funnet\"))","v":"Anne Hansen"},"Ja","Bestått","Første tilbud for dette kvartalet"]
[null,null,"2012-06-05","Karen Berg","Mellomliggende regnskapsføring",{"$f":"IF(tblOpplæringsLogg[[#This Row],[KURS]]=\"\",\"\",IFERROR(VLOOKUP(tblOpplæringsLogg[[#This Row],[KURS]],tblKursListe[],2,0),\"Ikke funnet\"))","v":"Anne Hansen"},"Nei","Fremtidig","Ikke gjennomført ennå."]
[null,null,"2012-06-05","Henrik Larsen","Avansert regnskapsføring",{"$f":"IF(tblOpplæringsLogg[[#This Row],[KURS]]=\"\",\"\",IFERROR(VLOOKUP(tblOpplæringsLogg[[#This Row],[KURS]],tblKursListe[],2,0),\"Ikke funnet\"))","v":"Thomas Jensen"},"Nei","Fremtidig","Ikke gjennomført ennå."]
[{"$nulls":5},{"$f":"IF(tblOpplæringsLogg[[#This Row],[KURS]]=\"\",\"\",IFERROR(VLOOKUP(tblOpplæringsLogg[[#This Row],[KURS]],tblKursListe[],2,0),\"Ikke funnet\"))","v":""}]

{"sheet":"Kursliste","index":1,"n_rows":10,"n_cols":6,"rows_kept":10}
[]
[]
[null,null,"KURSLISTE"]
[]
[null,null,"TITTEL","INSTRUKTØR","BESKRIVELSE","TIMER"]
[null,null,"Innføring for ansatte","Thomas Jensen","En grunnleggende innføring for nye ansatte. Definerer avdelingens mål og forventninger samt tidsrammer og grenser.",2]
[null,null,"Ansattoperasjoner","Anne Hansen","Grunnleggende ansattoperasjoner, dekker håndboken for ansatte.",1]
[null,null,"Ansattoperasjoner","Thomas Jensen","Grunnleggende prosedyrer og retningslinjer for regnskapsføring",1.5]
[null,null,"Mellomliggende regnskapsføring","Anne Hansen","Mellomliggende prosedyrer og retningslinjer for regnskapsføring",2]
[null,null,"Avansert regnskapsføring","Thomas Jensen","Avanserte prosedyrer og retningslinjer for regnskapsføring",2]

{"sheet":"Personalinfo","index":2,"n_rows":9,"n_cols":5,"rows_kept":9}
[]
[]
[null,null,"PERSONALINFORMASJON"]
[]
[null,null,"NAVN","AVDELING 3","TITTEL"]
[null,null,"Karen Berg","Salg","Ledende regnskapsfører"]
[null,null,"Henrik Larsen","Regnskap","Regnskapsfører"]
[null,null,"Karen Berg","Regnskap","Regnskapsfører"]
[null,null,"Katrine Larssen","Regnskap","Regnskapsfører"]