{"text_format":"3","workbook":"xlsx","n_sheets":3,"sheets":["Start","Månedlig skolebudsjett","chart_calcs"],"not_rendered":{"charts":4,"defined_names":19},"read":"whole","date_system":"1900"}

{"sheet":"Start","index":0,"n_rows":8,"n_cols":2,"rows_kept":8}
[null,"OM DENNE MALEN"]
[null,"Bruk regnearket Månedlig skolebudsjett til å spore inntekter, utgifter og kontantstrøm."]
[null,"Skriv inn Månedlige inntekter og utgifter for å beregne Totale inntekter og utgifter."]
[null,"Kontantstrøm beregnes automatisk, og Kontantstrømdiagrammet oppdateres for deg."]
[null,"Velg glidebryteren for å få diagrammer for inntekter, utgifter og kontantstrøm for en måned og et år."]
[null,"Obs! "]
[null,"Flere instruksjoner er angitt i kolonne A i regnearket. Denne teksten er skjult med hensikt. Hvis du vil fjerne teksten, velger du kolonne A og deretter SLETT. Hvis du vil vise teksten, velger du kolonne A og endrer deretter skriftfarge."]
[null," "]

{"sheet":"Månedlig skolebudsjett","index":1,"n_rows":72,"n_cols":17,"rows_kept":72}
[null,"Månedlig skolebudsjett",{"$nulls":14},{"$f":"\"\"","v":""}]
[{"$nulls":16},""]
[{"$nulls":16},""]
[null,{"$f":"chart_calcs!$D$6","v":"januar Inntekt:"},null,null,{"$f":"chart_calcs!$D$7","v":"januar utgifter:"},{"$nulls":7},{"$f":"chart_calcs!$D$8","v":"januar kontantstrøm:"},{"$nulls":3},""]
[null,{"$f":"\" \"&chart_calcs!$F$6","v":" kr 1 225"},null,null,{"$f":"\" \"&chart_calcs!$F$7","v":" kr 1 056"},{"$nulls":7},{"$f":"\" \"&chart_calcs!$F$8","v":" kr 169"},{"$nulls":3},""]
[{"$nulls":16},""]
[{"$nulls":16},""]
[{"$nulls":16},""]
[{"$nulls":16},""]
[{"$nulls":16},""]
[{"$nulls":16},""]
[{"$nulls":16},""]
[{"$nulls":16},""]
[{"$nulls":16},""]
[{"$nulls":16},""]
[{"$nulls":16},""]
[{"$nulls":16},""]
[{"$nulls":16},""]
[{"$nulls":16},""]
[{"$nulls":16},""]
[]
[]
[]
[]
[null,"JAN"]
[{"$nulls":15},{"$f":"SelectedPeriod","v":"JAN "}]
[null,"Månedlig kontantbeholdning etter utgifter",{"$f":"FirstMonth","v":"JAN "},{"$f":"NextMonth","v":"FEB "},"MAR ","APR ","MAI ","JUN ","JUL ","AUG ","SEP ","OKT ","NOV ","DES ","ÅR  ","PROSENTVIS ØKNING "]
[null,"Kontantstrøm",{"$f":"C37-C72","v":169},69,192,199,204,{"v":-771,"d":"-771 "},124,154,{"v":-721,"d":"-721 "},109,34,{"v":-61,"d":"-61 "},{"$f":"SUM(C28:N28)","v":{"v":-299,"d":"-299 "}},{"$f":"INDEX($C28:$O28,,SelectedPeriodColumn)/INDEX($C$37:$O$37,,SelectedPeriodColumn)","v":{"v":0.13795918367346938,"d":"13.8%"}}]
[null,"Akkumulert kontantstrøm",{"$f":"SUM($C$28:C$28)","v":169},{"$f":"SUM($C$28:D$28)","v":238},{"$f":"SUM($C$28:E$28)","v":430},{"$f":"SUM($C$28:F$28)","v":629},{"$f":"SUM($C$28:G$28)","v":833},{"$f":"SUM($C$28:H$28)","v":62},{"$f":"SUM($C$28:I$28)","v":186},{"$f":"SUM($C$28:J$28)","v":340},{"$f":"SUM($C$28:K$28)","v":{"v":-381,"d":"-381 "}},{"$f":"SUM($C$28:L$28)","v":{"v":-272,"d":"-272 "}},{"$f":"SUM($C$28:M$28)","v":{"v":-238,"d":"-238 "}},{"$f":"SUM($C$28:N$28)","v":{"v":-299,"d":"-299 "}}]
[]
[null,"MÅNEDLIGE INNTEKTER",{"$f":"FirstMonth","v":"JAN "},{"$f":"NextMonth","v":"FEB "},"MAR ","APR ","MAI ","JUN ","JUL ","AUG ","SEP ","OKT ","NOV ","DES ","ÅR  ","PROSENTVIS ØKNING "]
[null,"Økonomisk støtte (tilskudd, stipend, lån) utbetalt til deg",0,0,750,750,750,750,750,750,750,750,750,750,{"$f":"SUM(C32:N32)","v":{"v":7500,"d":"7,500"}},{"$f":"INDEX($C32:$O32,,SelectedPeriodColumn)/INDEX($C$37:$O$37,,SelectedPeriodColumn)","v":{"v":0,"d":"0.0 %"}}]
[null,"Lønn etter skatt fra en jobb",450,450,450,450,450,450,450,450,550,350,350,350,{"v":5200,"d":"5,200"},{"$f":"INDEX($C33:$O33,,SelectedPeriodColumn)/INDEX($C$37:$O$37,,SelectedPeriodColumn)","v":{"v":0.3673469387755102,"d":"36.7 %"}}]
[null,"Økonomisk støtte fra familie",200,200,{"v":1000,"d":"1,000"},350,350,350,350,350,350,350,350,350,{"v":4550,"d":"4,550"},{"$f":"INDEX($C34:$O34,,SelectedPeriodColumn)/INDEX($C$37:$O$37,,SelectedPeriodColumn)","v":{"v":0.16326530612244897,"d":"16.3 %"}}]
[null,"Uttak fra sparing",500,350,150,0,0,0,0,0,0,0,0,0,{"v":1000,"d":"1,000"},{"$f":"INDEX($C35:$O35,,SelectedPeriodColumn)/INDEX($C$37:$O$37,,SelectedPeriodColumn)","v":{"v":0.40816326530612246,"d":"40.8 %"}}]
[null,"Annet(barnebidrag, offentlig hjelp, gaver og så videre.)",75,75,75,75,75,75,75,75,75,75,75,75,900,{"$f":"INDEX($C36:$O36,,SelectedPeriodColumn)/INDEX($C$37:$O$37,,SelectedPeriodColumn)","v":{"v":0.061224489795918366,"d":"6.1 %"}}]
[null,"TOTALE INNTEKTER",{"$f":"SUM(C32:C36)","v":{"v":1225,"d":"1,225"}},{"v":1075,"d":"1,075"},{"v":2425,"d":"2,425"},{"v":1625,"d":"1,625"},{"v":1625,"d":"1,625"},{"v":1625,"d":"1,625"},{"v":1625,"d":"1,625"},{"v":1625,"d":"1,625"},{"v":1725,"d":"1,725"},{"v":1525,"d":"1,525"},{"v":1525,"d":"1,525"},{"v":1525,"d":"1,525"},{"v":19150,"d":"19,150"},{"$f":"INDEX($C37:$O37,,SelectedPeriodColumn)/INDEX($C$37:$O$37,,SelectedPeriodColumn)","v":{"v":1,"d":"100.0%"}}]
[]
[null,"MÅNEDLIGE UTGIFTER",{"$f":"FirstMonth","v":"JAN "},{"$f":"NextMonth","v":"FEB "},"MAR ","APR ","MAI ","JUN ","JUL ","AUG ","SEP ","OKT ","NOV ","DES ","ÅR  ","PROSENTVIS ØKNING "]
[null,"Kost og losji",{"$f":"SUM(C41:C43)","v":565},565,565,565,565,565,565,565,565,565,565,565,{"$f":"SUM(C40:N40)","v":{"v":6780,"d":"6,780"}},{"$f":"INDEX($C40:$O40,,SelectedPeriodColumn)/INDEX($C$72:$O$72,,SelectedPeriodColumn)","v":{"v":0.5350378787878788,"d":"53.5 %"}}]
[null,null,315,315,315,315,315,315,315,315,315,315,315,315,{"$f":"SUM(C41:N41)","v":{"v":3780,"d":"3,780"}},{"$f":"INDEX($C41:$O41,,SelectedPeriodColumn)/INDEX($C$72:$O$72,,SelectedPeriodColumn)","v":{"v":0.29829545454545453,"d":"29.8 %"}}]
[null,null,200,200,200,200,200,200,200,200,200,200,200,200,{"$f":"SUM(C42:N42)","v":{"v":2400,"d":"2,400"}},{"$f":"INDEX($C42:$O42,,SelectedPeriodColumn)/INDEX($C$72:$O$72,,SelectedPeriodColumn)","v":{"v":0.1893939393939394,"d":"18.9 %"}}]
[null,null,50,50,50,50,50,50,50,50,50,50,50,50,{"$f":"SUM(C43:N43)","v":600},{"$f":"INDEX($C43:$O43,,SelectedPeriodColumn)/INDEX($C$72:$O$72,,SelectedPeriodColumn)","v":{"v":0.04734848484848485,"d":"4.7 %"}}]
[]
[null,"Skolepenger og gebyrer",{"$f":"SUM(C46:C47)","v":0},0,750,0,0,650,0,0,650,0,0,0,{"$f":"SUM(C45:N45)","v":{"v":2050,"d":"2,050"}},{"$f":"INDEX($C45:$O45,,SelectedPeriodColumn)/INDEX($C$72:$O$72,,SelectedPeriodColumn)","v":{"v":0,"d":"0.0 %"}}]
[null,null,0,0,500,0,0,500,0,0,500,0,0,0,{"$f":"SUM(C46:N46)","v":{"v":1500,"d":"1,500"}},{"$f":"INDEX($C46:$O46,,SelectedPeriodColumn)/INDEX($C$72:$O$72,,SelectedPeriodColumn)","v":{"v":0,"d":"0.0 %"}}]
[null,null,0,0,250,0,0,150,0,0,150,0,0,0,{"$f":"SUM(C47:N47)","v":550},{"$f":"INDEX($C47:$O47,,SelectedPeriodColumn)/INDEX($C$72:$O$72,,SelectedPeriodColumn)","v":{"v":0,"d":"0.0 %"}}]
[]
[null,"Bøker og utstyr",{"$f":"SUM(C50:C51)","v":0},0,325,20,20,325,10,10,400,15,15,15,{"$f":"SUM(C49:N49)","v":{"v":1155,"d":"1,155"}},{"$f":"INDEX($C49:$O49,,SelectedPeriodColumn)/INDEX($C$72:$O$72,,SelectedPeriodColumn)","v":{"v":0,"d":"0.0 %"}}]
[null,null,0,0,225,0,0,275,0,0,325,0,0,0,{"$f":"SUM(C50:N50)","v":825},{"$f":"INDEX($C50:$O50,,SelectedPeriodColumn)/INDEX($C$72:$O$72,,SelectedPeriodColumn)","v":{"v":0,"d":"0.0 %"}}]
[null,null,0,0,100,20,20,50,10,10,75,15,15,15,{"$f":"SUM(C51:N51)","v":330},{"$f":"INDEX($C51:$O51,,SelectedPeriodColumn)/INDEX($C$72:$O$72,,SelectedPeriodColumn)","v":{"v":0,"d":"0.0 %"}}]
[]
[null,"Transport",{"$f":"SUM(C54:C57)","v":224},174,174,219,174,174,274,219,174,174,224,269,{"$f":"SUM(C53:N53)","v":{"v":2473,"d":"2,473"}},{"$f":"INDEX($C53:$O53,,SelectedPeriodColumn)/INDEX($C$72:$O$72,,SelectedPeriodColumn)","v":{"v":0.21212121212121213,"d":"21.2 %"}}]
[null,null,30,30,30,75,30,30,30,75,30,30,30,75,{"$f":"SUM(C54:N54)","v":495},{"$f":"INDEX($C54:$O54,,SelectedPeriodColumn)/INDEX($C$72:$O$72,,SelectedPeriodColumn)","v":{"v":0.028409090909090908,"d":"2.8 %"}}]
[null,null,129,129,129,129,129,129,129,129,129,129,129,129,{"$f":"SUM(C55:N55)","v":{"v":1548,"d":"1,548"}},{"$f":"INDEX($C55:$O55,,SelectedPeriodColumn)/INDEX($C$72:$O$72,,SelectedPeriodColumn)","v":{"v":0.12215909090909091,"d":"12.2 %"}}]
[null,null,15,15,15,15,15,15,15,15,15,15,15,15,{"$f":"SUM(C56:N56)","v":180},{"$f":"INDEX($C56:$O56,,SelectedPeriodColumn)/INDEX($C$72:$O$72,,SelectedPeriodColumn)","v":{"v":0.014204545454545454,"d":"1.4 %"}}]
[null,null,50,0,0,0,0,0,100,0,0,0,50,50,{"$f":"SUM(C57:N57)","v":250},{"$f":"INDEX($C57:$O57,,SelectedPeriodColumn)/INDEX($C$72:$O$72,,SelectedPeriodColumn)","v":{"v":0.04734848484848485,"d":"4.7 %"}}]
[]
[null,"Vilkårlig",{"$f":"SUM(C60:C65)","v":69},69,169,369,419,444,419,419,394,394,419,469,{"$f":"SUM(C59:N59)","v":{"v":4053,"d":"4,053"}},{"$f":"INDEX($C59:$O59,,SelectedPeriodColumn)/INDEX($C$72:$O$72,,SelectedPeriodColumn)","v":{"v":0.06534090909090909,"d":"6.5 %"}}]
[null,null,0,0,0,50,100,100,100,100,75,75,100,100,800,{"$f":"INDEX($C60:$O60,,SelectedPeriodColumn)/INDEX($C$72:$O$72,,SelectedPeriodColumn)","v":{"v":0,"d":"0.0 %"}}]
[null,null,69,69,69,69,69,69,69,69,69,69,69,69,828,{"$f":"INDEX($C61:$O61,,SelectedPeriodColumn)/INDEX($C$72:$O$72,,SelectedPeriodColumn)","v":{"v":0.06534090909090909,"d":"6.5 %"}}]
[null,null,0,0,0,0,0,25,0,0,0,0,0,50,75,{"$f":"INDEX($C62:$O62,,SelectedPeriodColumn)/INDEX($C$72:$O$72,,SelectedPeriodColumn)","v":{"v":0,"d":"0.0 %"}}]
[null,null,0,0,100,100,100,100,100,100,100,100,100,100,{"v":1000,"d":"1,000"},{"$f":"INDEX($C63:$O63,,SelectedPeriodColumn)/INDEX($C$72:$O$72,,SelectedPeriodColumn)","v":{"v":0,"d":"0.0 %"}}]
[null,null,0,0,0,50,50,50,50,50,50,50,50,50,450,{"$f":"INDEX($C64:$O64,,SelectedPeriodColumn)/INDEX($C$72:$O$72,,SelectedPeriodColumn)","v":{"v":0,"d":"0.0 %"}}]
[null,null,0,0,0,100,100,100,100,100,100,100,100,100,900,{"$f":"INDEX($C65:$O65,,SelectedPeriodColumn)/INDEX($C$72:$O$72,,SelectedPeriodColumn)","v":{"v":0,"d":"0.0 %"}}]
[]
[null,"Andre utgifter",{"$f":"SUM(C68:C70)","v":198},{"$f":"SUM(D68:D70)","v":198},250,253,243,238,233,258,263,268,268,268,{"$f":"SUM(C67:N67)","v":{"v":2938,"d":"2,938 "}},{"$f":"INDEX($C67:$O67,,SelectedPeriodColumn)/INDEX($C$72:$O$72,,SelectedPeriodColumn)","v":{"v":0.1875,"d":"18.8 %"}}]
[null,null,123,123,123,123,123,123,123,123,123,123,123,123,{"$f":"SUM(C68:N68)","v":{"v":1476,"d":"1,476 "}},{"$f":"INDEX($C68:$O68,,SelectedPeriodColumn)/INDEX($C$72:$O$72,,SelectedPeriodColumn)","v":{"v":0.11647727272727272,"d":"11.6 %"}}]
[null,null,0,0,52,55,45,40,35,60,65,70,70,70,{"$f":"SUM(C69:N69)","v":{"v":562,"d":"562 "}},{"$f":"INDEX($C69:$O69,,SelectedPeriodColumn)/INDEX($C$72:$O$72,,SelectedPeriodColumn)","v":{"v":0,"d":"0.0 %"}}]
[null,null,75,75,75,75,75,75,75,75,75,75,75,75,{"$f":"SUM(C70:N70)","v":{"v":900,"d":"900 "}},{"$f":"INDEX($C70:$O70,,SelectedPeriodColumn)/INDEX($C$72:$O$72,,SelectedPeriodColumn)","v":{"v":0.07102272727272728,"d":"7.1 %"}}]
[]
[null,"TOTALE UTGIFTER",{"$f":"SUM(C40,C45,C49,C53,C59,C67)","v":{"v":1056,"d":"1,056"}},{"v":1006,"d":"1,006"},{"v":2233,"d":"2,233"},{"v":1426,"d":"1,426"},{"v":1421,"d":"1,421"},{"v":2396,"d":"2,396"},{"v":1501,"d":"1,501"},{"v":1471,"d":"1,471"},{"v":2446,"d":"2,446"},{"v":1416,"d":"1,416"},{"v":1491,"d":"1,491"},{"v":1586,"d":"1,586"},{"$f":"SUM(C72:N72)","v":{"v":19449,"d":"19,449"}},{"$f":"INDEX($C72:$O72,,SelectedPeriodColumn)/INDEX($C$72:$O$72,,SelectedPeriodColumn)","v":{"v":1,"d":"100.0 %"}}]

{"sheet":"chart_calcs","index":2,"n_rows":23,"n_cols":16,"rows_kept":23,"hidden":true}
["***Dette arket må være SKJULT***"]
[]
[{"$nulls":3},{"$f":"IFERROR(LOWER(TEXT(VALUE(SelectedPeriod&\" 1\"),\"mmmm\")),\"år\")","v":"januar"}]
[]
[{"$nulls":3},"Dynamiske diagramtitler"]
[{"$nulls":3},{"$f":"D3&\" Inntekt:\"","v":"januar Inntekt:"},null,{"$f":"TEXT(INDEX('Månedlig skolebudsjett'!$C$37:$O$37,,SelectedPeriodColumn),\"kr # ##0\")","v":"kr 1 225"}]
[{"$nulls":3},{"$f":"D3&\" utgifter:\"","v":"januar utgifter:"},null,{"$f":"TEXT(INDEX('Månedlig skolebudsjett'!$C$72:$O$72,,SelectedPeriodColumn),\"kr # ##0\")","v":"kr 1 056"}]
[{"$nulls":3},{"$f":"D3&\" kontantstrøm:\"","v":"januar kontantstrøm:"},{"$f":"INDEX('Månedlig skolebudsjett'!C28:O28,ScrollBarValue)","v":169},{"$f":"TEXT(E8,\"kr # ##0\")","v":"kr 169"}]
[]
[]
[]
[{"$nulls":3},{"$f":"LOWER('Månedlig skolebudsjett'!C27)","v":"jan "},{"$f":"LOWER('Månedlig skolebudsjett'!D27)","v":"feb "},{"$f":"LOWER('Månedlig skolebudsjett'!E27)","v":"mar "},{"$f":"LOWER('Månedlig skolebudsjett'!F27)","v":"apr "},{"$f":"LOWER('Månedlig skolebudsjett'!G27)","v":"mai "},{"$f":"LOWER('Månedlig skolebudsjett'!H27)","v":"jun "},{"$f":"LOWER('Månedlig skolebudsjett'!I27)","v":"jul "},{"$f":"LOWER('Månedlig skolebudsjett'!J27)","v":"aug "},{"$f":"LOWER('Månedlig skolebudsjett'!K27)","v":"sep "},{"$f":"LOWER('Månedlig skolebudsjett'!L27)","v":"okt "},{"$f":"LOWER('Månedlig skolebudsjett'!M27)","v":"nov "},{"$f":"LOWER('Månedlig skolebudsjett'!N27)","v":"des "},{"$f":"LOWER('Månedlig skolebudsjett'!O27)","v":"år  "}]
[null,null,"Rullefeltverdi: ",1]
[null,null,"Kontantstrømdiagram: ",{"$f":"IF(SelectedPeriod='Månedlig skolebudsjett'!C$31,IF('Månedlig skolebudsjett'!$C$28:$O$28>=0,'Månedlig skolebudsjett'!$C$28:$O$28,NA()),NA())","v":69},{"$f":"IF(SelectedPeriod='Månedlig skolebudsjett'!D$31,IF('Månedlig skolebudsjett'!$C$28:$O$28>=0,'Månedlig skolebudsjett'!$C$28:$O$28,NA()),NA())","v":{"$error":"#N/A"}},{"$f":"IF(SelectedPeriod='Månedlig skolebudsjett'!E$31,IF('Månedlig skolebudsjett'!$C$28:$O$28>=0,'Månedlig skolebudsjett'!$C$28:$O$28,NA()),NA())","v":{"$error":"#N/A"}},{"$f":"IF(SelectedPeriod='Månedlig skolebudsjett'!F$31,IF('Månedlig skolebudsjett'!$C$28:$O$28>=0,'Månedlig skolebudsjett'!$C$28:$O$28,NA()),NA())","v":{"$error":"#N/A"}},{"$f":"IF(SelectedPeriod='Månedlig skolebudsjett'!G$31,IF('Månedlig skolebudsjett'!$C$28:$O$28>=0,'Månedlig skolebudsjett'!$C$28:$O$28,NA()),NA())","v":{"$error":"#N/A"}},{"$f":"IF(SelectedPeriod='Månedlig skolebudsjett'!H$31,IF('Månedlig skolebudsjett'!$C$28:$O$28>=0,'Månedlig skolebudsjett'!$C$28:$O$28,NA()),NA())","v":{"$error":"#N/A"}},{"$f":"IF(SelectedPeriod='Månedlig skolebudsjett'!I$31,IF('Månedlig skolebudsjett'!$C$28:$O$28>=0,'Månedlig skolebudsjett'!$C$28:$O$28,NA()),NA())","v":{"$error":"#N/A"}},{"$f":"IF(SelectedPeriod='Månedlig skolebudsjett'!J$31,IF('Månedlig skolebudsjett'!$C$28:$O$28>=0,'Månedlig skolebudsjett'!$C$28:$O$28,NA()),NA())","v":{"$error":"#N/A"}},{"$f":"IF(SelectedPeriod='Månedlig skolebudsjett'!K$31,IF('Månedlig skolebudsjett'!$C$28:$O$28>=0,'Månedlig skolebudsjett'!$C$28:$O$28,NA()),NA())","v":{"$error":"#N/A"}},{"$f":"IF(SelectedPeriod='Månedlig skolebudsjett'!L$31,IF('Månedlig skolebudsjett'!$C$28:$O$28>=0,'Månedlig skolebudsjett'!$C$28:$O$28,NA()),NA())","v":{"$error":"#N/A"}},{"$f":"IF(SelectedPeriod='Månedlig skolebudsjett'!M$31,IF('Månedlig skolebudsjett'!$C$28:$O$28>=0,'Månedlig skolebudsjett'!$C$28:$O$28,NA()),NA())","v":{"$error":"#N/A"}},{"$f":"IF(SelectedPeriod='Månedlig skolebudsjett'!N$31,IF('Månedlig skolebudsjett'!$C$28:$O$28>=0,'Månedlig skolebudsjett'!$C$28:$O$28,NA()),NA())","v":{"$error":"#N/A"}},{"$f":"IF(SelectedPeriod='Månedlig skolebudsjett'!O$31,IF('Månedlig skolebudsjett'!$C$28:$O$28>=0,'Månedlig skolebudsjett'!$C$28:$O$28,NA()),NA())","v":{"$error":"#N/A"}}]
[null,null,"Akkumulert: ",{"$f":"IF(SelectedPeriod='Månedlig skolebudsjett'!C$31,IF('Månedlig skolebudsjett'!$C$28:$O$28<0,'Månedlig skolebudsjett'!$C$28:$O$28,NA()),NA())","v":{"$error":"#N/A"}},{"$f":"IF(SelectedPeriod='Månedlig skolebudsjett'!D$31,IF('Månedlig skolebudsjett'!$C$28:$O$28<0,'Månedlig skolebudsjett'!$C$28:$O$28,NA()),NA())","v":{"$error":"#N/A"}},{"$f":"IF(SelectedPeriod='Månedlig skolebudsjett'!E$31,IF('Månedlig skolebudsjett'!$C$28:$O$28<0,'Månedlig skolebudsjett'!$C$28:$O$28,NA()),NA())","v":{"$error":"#N/A"}},{"$f":"IF(SelectedPeriod='Månedlig skolebudsjett'!F$31,IF('Månedlig skolebudsjett'!$C$28:$O$28<0,'Månedlig skolebudsjett'!$C$28:$O$28,NA()),NA())","v":{"$error":"#N/A"}},{"$f":"IF(SelectedPeriod='Månedlig skolebudsjett'!G$31,IF('Månedlig skolebudsjett'!$C$28:$O$28<0,'Månedlig skolebudsjett'!$C$28:$O$28,NA()),NA())","v":{"$error":"#N/A"}},{"$f":"IF(SelectedPeriod='Månedlig skolebudsjett'!H$31,IF('Månedlig skolebudsjett'!$C$28:$O$28<0,'Månedlig skolebudsjett'!$C$28:$O$28,NA()),NA())","v":{"$error":"#N/A"}},{"$f":"IF(SelectedPeriod='Månedlig skolebudsjett'!I$31,IF('Månedlig skolebudsjett'!$C$28:$O$28<0,'Månedlig skolebudsjett'!$C$28:$O$28,NA()),NA())","v":{"$error":"#N/A"}},{"$f":"IF(SelectedPeriod='Månedlig skolebudsjett'!J$31,IF('Månedlig skolebudsjett'!$C$28:$O$28<0,'Månedlig skolebudsjett'!$C$28:$O$28,NA()),NA())","v":{"$error":"#N/A"}},{"$f":"IF(SelectedPeriod='Månedlig skolebudsjett'!K$31,IF('Månedlig skolebudsjett'!$C$28:$O$28<0,'Månedlig skolebudsjett'!$C$28:$O$28,NA()),NA())","v":{"$error":"#N/A"}},{"$f":"IF(SelectedPeriod='Månedlig skolebudsjett'!L$31,IF('Månedlig skolebudsjett'!$C$28:$O$28<0,'Månedlig skolebudsjett'!$C$28:$O$28,NA()),NA())","v":{"$error":"#N/A"}},{"$f":"IF(SelectedPeriod='Månedlig skolebudsjett'!M$31,IF('Månedlig skolebudsjett'!$C$28:$O$28<0,'Månedlig skolebudsjett'!$C$28:$O$28,NA()),NA())","v":{"$error":"#N/A"}},{"$f":"IF(SelectedPeriod='Månedlig skolebudsjett'!N$31,IF('Månedlig skolebudsjett'!$C$28:$O$28<0,'Månedlig skolebudsjett'!$C$28:$O$28,NA()),NA())","v":{"$error":"#N/A"}},{"$f":"IF(SelectedPeriod='Månedlig skolebudsjett'!O$31,IF('Månedlig skolebudsjett'!$C$28:$O$28<0,'Månedlig skolebudsjett'!$C$28:$O$28,NA()),NA())","v":{"$error":"#N/A"}}]
[]
[]
[null,null,"DIAGRAMDATA FOR INNTEKTER"]
[null,null,"Økonomisk støtte (tilskudd, stipend, lån) utbetalt til deg",{"$f":"'Månedlig skolebudsjett'!P32","v":{"v":0,"d":"0.0 %"}}]
[null,null,"Lønn etter skatt fra en jobb",{"$f":"'Månedlig skolebudsjett'!P33","v":{"v":0.3673469387755102,"d":"36.7 %"}}]
[null,null,"Økonomisk støtte fra familie",{"$f":"'Månedlig skolebudsjett'!P34","v":{"v":0.16326530612244897,"d":"16.3 %"}}]
[null,null,"Uttak fra sparing",{"$f":"'Månedlig skolebudsjett'!P35","v":{"v":0.40816326530612246,"d":"40.8 %"}}]
[null,null,"Annet(barnebidrag, offentlig hjelp, gaver og så videre.)",{"$f":"'Månedlig skolebudsjett'!P36","v":{"v":0.061224489795918366,"d":"6.1 %"}}]