{"text_format":"3","workbook":"xlsx","n_sheets":9,"sheets":["Sammendrag","Fag 1","Fag 2","Fag 3","Fag 4","Fag 5","Fag 6","Fag 7","Tabell over gjennomsn.karakter"],"not_rendered":{"defined_names":9},"read":"whole","date_system":"1900"}

{"sheet":"Sammendrag","index":0,"n_rows":12,"n_cols":7,"rows_kept":12,"merged":[[1,1,1,2]]}
[]
[null,"Navn på utdanningsinstitusjon",null,"  Navn:",null," Halvår/år:"]
[]
[null,"Fag","Poeng","Gjeldende prosent","Bokstavkarakter","Gjennomsnittskarakter","Vektet gjennomsnittskarakter"]
[null,"Fag 1",{"v":3,"d":"3.0"},{"$f":"'Fag 1'!D$36","v":{"v":0.865,"d":"86.50%"}},{"$f":"IF(D5<>\"\",HLOOKUP(D5,'Tabell over gjennomsn.karakter'!$C$5:$O$7,2),\"\")","v":"B"},{"v":3,"d":"3.00"},{"$f":"IF(F5<>\"\",F5*C5/(SUM($C$5:$C$11)), \"\")","v":{"v":0.5625,"d":"0.56"}}]
[null,"Fag 2",{"v":4,"d":"4.0"},{"$f":"'Fag 2'!D$36","v":""},{"$f":"IF(D6<>\"\",HLOOKUP(D6,'Tabell over gjennomsn.karakter'!$C$5:$O$7,2),\"\")","v":""},{"$f":"IF(D6<>\"\",HLOOKUP(D6,'Tabell over gjennomsn.karakter'!$C$5:$O$7,3),\"\")","v":""},{"$f":"IF(F6<>\"\",F6*C6/(SUM($C$5:$C$11)), \"\")","v":""}]
[null,"Fag 3",{"v":2,"d":"2.0"},{"$f":"'Fag 3'!D$36","v":""},{"$f":"IF(D7<>\"\",HLOOKUP(D7,'Tabell over gjennomsn.karakter'!$C$5:$O$7,2),\"\")","v":""},{"$f":"IF(D7<>\"\",HLOOKUP(D7,'Tabell over gjennomsn.karakter'!$C$5:$O$7,3),\"\")","v":""},""]
[null,"Fag 4",{"v":4,"d":"4.0"},{"$f":"'Fag 4'!D$36","v":""},{"$f":"IF(D8<>\"\",HLOOKUP(D8,'Tabell over gjennomsn.karakter'!$C$5:$O$7,2),\"\")","v":""},{"$f":"IF(D8<>\"\",HLOOKUP(D8,'Tabell over gjennomsn.karakter'!$C$5:$O$7,3),\"\")","v":""},""]
[null,"Fag 5",{"v":1,"d":"1.0"},{"$f":"'Fag 5'!D$36","v":""},{"$f":"IF(D9<>\"\",HLOOKUP(D9,'Tabell over gjennomsn.karakter'!$C$5:$O$7,2),\"\")","v":""},{"$f":"IF(D9<>\"\",HLOOKUP(D9,'Tabell over gjennomsn.karakter'!$C$5:$O$7,3),\"\")","v":""},""]
[null,"Fag 6",{"v":1,"d":"1.0"},{"$f":"'Fag 6'!D$36","v":""},{"$f":"IF(D10<>\"\",HLOOKUP(D10,'Tabell over gjennomsn.karakter'!$C$5:$O$7,2),\"\")","v":""},{"$f":"IF(D10<>\"\",HLOOKUP(D10,'Tabell over gjennomsn.karakter'!$C$5:$O$7,3),\"\")","v":""},""]
[null,"Fag 7",{"v":1,"d":"1.0"},{"$f":"'Fag 7'!D$36","v":""},{"$f":"IF(D11<>\"\",HLOOKUP(D11,'Tabell over gjennomsn.karakter'!$C$5:$O$7,2),\"\")","v":""},{"$f":"IF(D11<>\"\",HLOOKUP(D11,'Tabell over gjennomsn.karakter'!$C$5:$O$7,3),\"\")","v":""},""]
[null,"Totalt",{"$f":"SUM(C5:C11)","v":16},{"$f":"AVERAGE(D5:D11)","v":{"v":0.865,"d":"86.50%"}},{"$f":"IF(D12<>\"\",HLOOKUP(D12,'Tabell over gjennomsn.karakter'!$C$5:$O$7,2),\"\")","v":"B"},{"$f":"AVERAGE(F5:F11)","v":{"v":3,"d":"3.00"}},{"$f":"SUM(G5:G11)","v":{"v":0.5625,"d":"0.56"}}]

{"sheet":"Fag 1","index":1,"n_rows":38,"n_cols":8,"rows_kept":38,"merged":[[1,1,1,2]]}
[]
[null,{"$f":"Sammendrag!B5","v":"Fag 1"}]
[null,"Lærer:",null,null,"Prosent av totalt mulige poeng",null,null,{"$f":"IF(SUM($C$35:$H$35) <> 0,SUM($C$34:$H$34)/SUM($C$35:$H$35),\"\")","v":{"v":0.865,"d":"86.50%"}}]
[null,"E-post:",null,null,"Gjeldende karakter",null,null,{"$f":"SUM($C$34:$H$34)","v":{"v":0.17300000000000001,"d":"17.30%"}}]
[]
[null,"Oppgaver","Hjemmearbeid","Stiler","Prøver","Prosjekter","Tentamen","Eksamen"]
[null,"Vekting",{"v":0.1,"d":"10.0%"},{"v":0.1,"d":"10.0%"},{"v":0.15,"d":"15.0%"},{"v":0.15,"d":"15.0%"},{"v":0.2,"d":"20.0%"},{"v":0.3,"d":"30.0%"}]
[null,"Første hjemmearbeid",0.88]
[null,"Skriftlig oppgave om 2. verdenskrig",null,0.85]
{"$rows_empty":24}
[null,"Totalt antall poeng",{"$f":"IF(COUNT(C8:C33) <> 0,AVERAGE(C8:C33) *C7, \"\")","v":{"v":0.08800000000000001,"d":"0.0880"}},{"v":0.085,"d":"0.0850"},"","","",""]
[null,"Totalt mulige poeng",{"$f":"IF(COUNT(C8:C33)<>0,C7,\"\")","v":0.1},0.1,"","","",""]
[null,"Prosent av totalt mulige poeng",null,{"$f":"IF(SUM($C$35:$H$35) <> 0,SUM($C$34:$H$34)/SUM($C$35:$H$35),\"\")","v":{"v":0.865,"d":"86.50%"}}]
[null,"Slik skriver du inn karakterer:","Skriv inn poengene du fikk i forhold til det mulige antallet poeng (f.eks. 15/17)."]
[null,null,"Skriv inn prosenten du fikk (dvs. 85 %)."]

{"sheet":"Fag 2","index":2,"n_rows":38,"n_cols":8,"rows_kept":38,"merged":[[1,1,1,2]]}
[]
[null,{"$f":"Sammendrag!B6","v":"Fag 2"}]
[null,"Lærer:",null,null,"Prosent av totalt mulige poeng",null,null,{"$f":"IF(SUM($C$35:$H$35) <> 0,SUM($C$34:$H$34)/SUM($C$35:$H$35),\"\")","v":""}]
[null,"E-post:",null,null,"Gjeldende karakter",null,null,{"$f":"SUM($C$34:$H$34)","v":{"v":0,"d":"0.00%"}}]
[]
[null,"Oppgaver","Hjemmearbeid","Stiler","Prøver","Prosjekter","Tentamen","Eksamen"]
[null,"Vekting",{"v":0.1,"d":"10.0%"},{"v":0.1,"d":"10.0%"},{"v":0.15,"d":"15.0%"},{"v":0.15,"d":"15.0%"},{"v":0.2,"d":"20.0%"},{"v":0.3,"d":"30.0%"}]
{"$rows_empty":26}
[null,"Totalt antall poeng",{"$f":"IF(COUNT(C8:C33) <> 0,AVERAGE(C8:C33) *C7, \"\")","v":""},"","","","",""]
[null,"Totalt mulige poeng",{"$f":"IF(COUNT(C8:C33)<>0,C7,\"\")","v":""},"","","","",""]
[null,"Prosent av totalt mulige poeng",null,{"$f":"IF(SUM($C$35:$H$35) <> 0,SUM($C$34:$H$34)/SUM($C$35:$H$35),\"\")","v":""}]
[null,"Slik skriver du inn karakterer:","Skriv inn poengene du fikk i forhold til det mulige antallet poeng (f.eks. 15/17)."]
[null,null,"Skriv inn prosenten du fikk (dvs. 85 %)."]

{"sheet":"Fag 3","index":3,"n_rows":38,"n_cols":8,"rows_kept":38,"merged":[[1,1,1,2]]}
[]
[null,{"$f":"Sammendrag!B7","v":"Fag 3"}]
[null,"Lærer:",null,null,"Prosent av totalt mulige poeng",null,null,{"$f":"IF(SUM($C$35:$H$35) <> 0,SUM($C$34:$H$34)/SUM($C$35:$H$35),\"\")","v":""}]
[null,"E-post:",null,null,"Gjeldende karakter",null,null,{"$f":"SUM($C$34:$H$34)","v":{"v":0,"d":"0.00%"}}]
[]
[null,"Oppgaver","Hjemmearbeid","Stiler","Prøver","Prosjekter","Tentamen","Eksamen"]
[null,"Vekting",{"v":0.1,"d":"10.0%"},{"v":0.1,"d":"10.0%"},{"v":0.15,"d":"15.0%"},{"v":0.15,"d":"15.0%"},{"v":0.2,"d":"20.0%"},{"v":0.3,"d":"30.0%"}]
{"$rows_empty":26}
[null,"Totalt antall poeng",{"$f":"IF(COUNT(C8:C33) <> 0,AVERAGE(C8:C33) *C7, \"\")","v":""},"","","","",""]
[null,"Totalt mulige poeng",{"$f":"IF(COUNT(C8:C33)<>0,C7,\"\")","v":""},"","","","",""]
[null,"Prosent av totalt mulige poeng",null,{"$f":"IF(SUM($C$35:$H$35) <> 0,SUM($C$34:$H$34)/SUM($C$35:$H$35),\"\")","v":""}]
[null,"Slik skriver du inn karakterer:","Skriv inn poengene du fikk i forhold til det mulige antallet poeng (f.eks. 15/17)."]
[null,null,"Skriv inn prosenten du fikk (dvs. 85 %)."]

{"sheet":"Fag 4","index":4,"n_rows":38,"n_cols":8,"rows_kept":38,"merged":[[1,1,1,2]]}
[]
[null,{"$f":"Sammendrag!B8","v":"Fag 4"}]
[null,"Lærer:",null,null,"Prosent av totalt mulige poeng"]
[null,"E-post:",null,null,"Gjeldende karakter",null,null,{"$f":"SUM($C$34:$H$34)","v":{"v":0,"d":"0.00%"}}]
[]
[null,"Oppgaver","Hjemmearbeid","Stiler","Prøver","Prosjekter","Tentamen","Eksamen"]
[null,"Vekting",{"v":0.1,"d":"10.0%"},{"v":0.1,"d":"10.0%"},{"v":0.15,"d":"15.0%"},{"v":0.15,"d":"15.0%"},{"v":0.2,"d":"20.0%"},{"v":0.3,"d":"30.0%"}]
{"$rows_empty":26}
[null,"Totalt antall poeng",{"$f":"IF(COUNT(C8:C33) <> 0,AVERAGE(C8:C33) *C7, \"\")","v":""},"","","","",""]
[null,"Totalt mulige poeng",{"$f":"IF(COUNT(C8:C33)<>0,C7,\"\")","v":""},"","","","",""]
[null,"Prosent av totalt mulige poeng",null,{"$f":"IF(SUM($C$35:$H$35) <> 0,SUM($C$34:$H$34)/SUM($C$35:$H$35),\"\")","v":""}]
[null,"Slik skriver du inn karakterer:","Skriv inn poengene du fikk i forhold til det mulige antallet poeng (f.eks. 15/17)."]
[null,null,"Skriv inn prosenten du fikk (dvs. 85 %)."]

{"sheet":"Fag 5","index":5,"n_rows":38,"n_cols":8,"rows_kept":38,"merged":[[1,1,1,2]]}
[]
[null,{"$f":"Sammendrag!B9","v":"Fag 5"}]
[null,"Lærer:",null,null,"Prosent av totalt mulige poeng",null,null,{"$f":"IF(SUM($C$35:$H$35) <> 0,SUM($C$34:$H$34)/SUM($C$35:$H$35),\"\")","v":""}]
[null,"E-post:",null,null,"Gjeldende karakter",null,null,{"$f":"SUM($C$34:$H$34)","v":{"v":0,"d":"0.00%"}}]
[]
[null,"Oppgaver","Hjemmearbeid","Stiler","Prøver","Prosjekter","Tentamen","Eksamen"]
[null,"Vekting",{"v":0.1,"d":"10.0%"},{"v":0.1,"d":"10.0%"},{"v":0.15,"d":"15.0%"},{"v":0.15,"d":"15.0%"},{"v":0.2,"d":"20.0%"},{"v":0.3,"d":"30.0%"}]
{"$rows_empty":26}
[null,"Totalt antall poeng",{"$f":"IF(COUNT(C8:C33) <> 0,AVERAGE(C8:C33) *C7, \"\")","v":""},"","","","",""]
[null,"Totalt mulige poeng",{"$f":"IF(COUNT(C8:C33)<>0,C7,\"\")","v":""},"","","","",""]
[null,"Prosent av totalt mulige poeng",null,{"$f":"IF(SUM($C$35:$H$35) <> 0,SUM($C$34:$H$34)/SUM($C$35:$H$35),\"\")","v":""}]
[null,"Slik skriver du inn karakterer:","Skriv inn poengene du fikk i forhold til det mulige antallet poeng (f.eks. 15/17)."]
[null,null,"Skriv inn prosenten du fikk (dvs. 85 %)."]

{"sheet":"Fag 6","index":6,"n_rows":38,"n_cols":8,"rows_kept":38,"merged":[[1,1,1,2]]}
[]
[null,{"$f":"Sammendrag!B10","v":"Fag 6"}]
[null,"Lærer:",null,null,"Prosent av totalt mulige poeng",null,null,{"$f":"IF(SUM($C$35:$H$35) <> 0,SUM($C$34:$H$34)/SUM($C$35:$H$35),\"\")","v":""}]
[null,"E-post:",null,null,"Gjeldende karakter",null,null,{"$f":"SUM($C$34:$H$34)","v":{"v":0,"d":"0.00%"}}]
[]
[null,"Oppgaver","Hjemmearbeid","Stiler","Prøver","Prosjekter","Tentamen","Eksamen"]
[null,"Vekting",{"v":0.1,"d":"10.0%"},{"v":0.1,"d":"10.0%"},{"v":0.15,"d":"15.0%"},{"v":0.15,"d":"15.0%"},{"v":0.2,"d":"20.0%"},{"v":0.3,"d":"30.0%"}]
{"$rows_empty":26}
[null,"Totalt antall poeng",{"$f":"IF(COUNT(C8:C33) <> 0,AVERAGE(C8:C33) *C7, \"\")","v":""},"","","","",""]
[null,"Totalt mulige poeng",{"$f":"IF(COUNT(C8:C33)<>0,C7,\"\")","v":""},"","","","",""]
[null,"Prosent av totalt mulige poeng",null,{"$f":"IF(SUM($C$35:$H$35) <> 0,SUM($C$34:$H$34)/SUM($C$35:$H$35),\"\")","v":""},{"$f":"IF(SUM($C$35:$H$35) <> 0,SUM($C$34:$H$34)/SUM($C$35:$H$35),\"\")","v":""}]
[null,"Slik skriver du inn karakterer:","Skriv inn poengene du fikk i forhold til det mulige antallet poeng (f.eks. 15/17)."]
[null,null,"Skriv inn prosenten du fikk (dvs. 85 %)."]

{"sheet":"Fag 7","index":7,"n_rows":38,"n_cols":8,"rows_kept":38,"merged":[[1,1,1,2]]}
[]
[null,{"$f":"Sammendrag!B11","v":"Fag 7"}]
[null,"Lærer:",null,null,"Prosent av totalt mulige poeng",null,null,{"$f":"IF(SUM($C$35:$H$35) <> 0,SUM($C$34:$H$34)/SUM($C$35:$H$35),\"\")","v":""}]
[null,"E-post:",null,null,"Gjeldende karakter",null,null,{"$f":"SUM($C$34:$H$34)","v":{"v":0,"d":"0.00%"}}]
[]
[null,"Oppgaver","Hjemmearbeid","Stiler","Prøver","Prosjekter","Tentamen","Eksamen"]
[null,"Vekting",{"v":0.1,"d":"10.0%"},{"v":0.1,"d":"10.0%"},{"v":0.15,"d":"15.0%"},{"v":0.15,"d":"15.0%"},{"v":0.2,"d":"20.0%"},{"v":0.3,"d":"30.0%"}]
{"$rows_empty":26}
[null,"Totalt antall poeng",{"$f":"IF(COUNT(C8:C33) <> 0,AVERAGE(C8:C33) *C7, \"\")","v":""},"","","","",""]
[null,"Totalt mulige poeng",{"$f":"IF(COUNT(C8:C33)<>0,C7,\"\")","v":""},"","","","",""]
[null,"Prosent av totalt mulige poeng",null,{"$f":"IF(SUM($C$35:$H$35) <> 0,SUM($C$34:$H$34)/SUM($C$35:$H$35),\"\")","v":""}]
[null,"Slik skriver du inn karakterer:","Skriv inn poengene du fikk i forhold til det mulige antallet poeng (f.eks. 15/17)."]
[null,null,"Skriv inn prosenten du fikk (dvs. 85 %)."]

{"sheet":"Tabell over gjennomsn.karakter","index":8,"n_rows":7,"n_cols":15,"rows_kept":7}
[]
[]
[]
[null,"Tabell for karakterer og gjennomsnittskarakterer"]
[null,"Gjennomsnitt",{"v":0,"d":"0%"},{"v":0.6,"d":"60%"},{"v":0.63,"d":"63%"},{"v":0.67,"d":"67%"},{"v":0.7,"d":"70%"},{"v":0.73,"d":"73%"},{"v":0.77,"d":"77%"},{"v":0.8,"d":"80%"},{"v":0.83,"d":"83%"},{"v":0.87,"d":"87%"},{"v":0.9,"d":"90%"},{"v":0.93,"d":"93%"},{"v":0.97,"d":"97%"}]
[null,"Bokstavkarakter","F","D-","D","D+","C-","C","C+","B-","B","B+","A-","A","A+"]
[null,"Gjennomsnittskarakter",{"v":0,"d":"0.00"},0.67,{"v":1,"d":"1.00"},1.33,1.67,{"v":2,"d":"2.00"},2.33,2.67,{"v":3,"d":"3.00"},3.33,3.67,{"v":4,"d":"4.00"},{"v":4,"d":"4.00"}]