{"text_format":"3","workbook":"xlsx","n_sheets":4,"sheets":["Sākums","PROJEKTA PARAMETRI","INFORMĀCIJA PAR PROJEKTU","PROJEKTA KOPSUMMAS"],"not_rendered":{"charts":2,"defined_names":3,"pivot_tables":1},"read":"whole","date_system":"1900"}

{"sheet":"Sākums","index":0,"n_rows":8,"n_cols":2,"rows_kept":8}
[null,"PAR ŠO VEIDNI"]
[]
[null,"Izmantojiet šo darbgrāmatu, lai sekotu līdzi projekta parametri, detalizētai informācija par projektu un projekta kopsummas, veicot Projektu plānošana juridiskajiem uzņēmumiem."]
[null,"Ievadiet uzņēmuma nosaukums darblapā Projekta parametri un tas tiks automātiski atjaunināts citās darblapās."]
[null,"Ievadiet informāciju darblapā Projekta parametri, lai atjauninātu stabiņu diagrammu, un darblapā Detalizēta informācija par projektu. Rakurstabula projekta kopsummas darblapā tiek automātiski atjaunināta."]
[null,"Piezīme.  "]
{"$rows_left_out":3}
{"sheet":"PROJEKTA PARAMETRI","index":1,"n_rows":19,"n_cols":9,"rows_kept":19}
["Šajā darblapā izveidojiet projekta parametri. Šūnā pa labi ievadiet uzņēmuma nosaukums. Šīs kolonnas šūnās ir noderīgi norādījumi.","Uzņēmuma nosaukums"]
["Šīs darblapas nosaukums ir šūnā pa labi.","Projektu plānošana juridiskajiem uzņēmumiem"]
["Konfidencialitātes ziņojums ir šūnā pa labi.",{"$f":"B1&\" , konfidenciāli\"","v":"Uzņēmuma nosaukums , konfidenciāli"}]
["Šūnā pa labi ir padoms.","Ieēnotās šūnas ir aprēķinātas jūsu vietā. Nav nepieciešams tajās neko ievadīt."]
["Ievadiet detalizētu informāciju parametru tabulā, sākot no šūnas pa labi. Nākamais norādījums ir šūnā A12.","PROJEKTA VEIDS","VISPĀRĪGS PARTNERIS","UZŅĒMUMA JURISTS","AIZSARDZĪBAS ADVOKĀTS","INTELEKTUĀLĀ ĪPAŠUMA JURISTS","BANKROTA JURISTS","ADMINISTRATĪVIE DARBINIEKI","Kopsumma"]
[null,"Uzņēmuma iekļaušana",{"v":0.1,"d":"10%"},{"v":0.4,"d":"40%"},{"v":0,"d":"0%"},{"v":0,"d":"0%"},{"v":0,"d":"0%"},{"v":0.5,"d":"50%"},{"$f":"SUM(Parametri[[#This Row],[VISPĀRĪGS PARTNERIS]:[ADMINISTRATĪVIE DARBINIEKI]])","v":{"v":1,"d":"100%"}}]
{"$rows_left_out":14}
{"sheet":"INFORMĀCIJA PAR PROJEKTU","index":2,"n_rows":10,"n_cols":25,"rows_kept":10,"merged":[[1,24,8,28]]}
["Šajā darblapā izveidojiet detalizētu informācija par projektu. Šūnā pa labi tiek automātiski atjaunināts uzņēmuma nosaukums. Šīs kolonnas šūnās ir noderīgi norādījumi. Bultiņa uz leju, lai sāktu darbu.",{"$f":"'PROJEKTA PARAMETRI'!B1","v":"Uzņēmuma nosaukums"}]
["Šūnā pa labi ir šīs darblapas virsraksts un informatīvais padoms ir šūnā Y2.",{"$f":"'PROJEKTA PARAMETRI'!B2","v":"Projektu plānošana juridiskajiem uzņēmumiem"},{"$nulls":22},"INFORMĀCIJA.\nLai pievienotu rindu, atlasiet pašu pēdējo tabulas šūnu labajā pusē (nevis kopsummas rindu) un nospiediet tabulēšanas taustiņu, vai arī tabulā nospiediet taustiņu SHIFT un pēc tam nospiediet taustiņu F10, kur vēlaties ievietot rindu, un atlasiet Ievietot | Tabulas rindas Augstāk/Tabulas rinda zemāk.\nNodrošiniet, lai visas neizmantotās rindas būtu izdzēstas, jo projekta kopsummas rakurstabula izmanto visas tabulas šūnas un pretējā gadījumā rezultāti būtu kļūdaini."]
["Konfidencialitātes ziņojums ir šūnā pa labi.",{"$f":"'PROJEKTA PARAMETRI'!B3","v":"Uzņēmuma nosaukums , konfidenciāli"}]
["Ievadiet informāciju tabulā Detalizēta informācija, sākot no šūnas pa labi. Projekta veids detalizētas informācijas tabulas labajā pusē tiek automātiski atjaunināti no tabulas Parametri darblapā Projekta parametri.","PROJEKTA NOSAUKUMS","PROJEKTA VEIDS","PLĀNOTAIS SĀKUMS","PLĀNOTĀS BEIGAS","FAKTISKAIS SĀKUMS","FAKTISKĀS BEIGAS","PLĀNOTAIS DARBS","FAKTISKAIS DARBS","PLĀNOTAIS ILGUMS","FAKTISKAIS ILGUMS","VISPĀRĪGS PARTNERIS","UZŅĒMUMA JURISTS","AIZSARDZĪBAS ADVOKĀTS","INTELEKTUĀLĀ ĪPAŠUMA JURISTS","BANKROTA JURISTS","ADMINISTRATĪVIE DARBINIEKI","VISPĀRĪGS PARTNERIS 2","UZŅĒMUMA JURISTS 2","AIZSARDZĪBAS ADVOKĀTS 2","INTELEKTUĀLĀ ĪPAŠUMA JURISTS 2","BANKROTA JURISTS 2","ADMINISTRATĪVIE DARBINIEKI 2"]
[null,"1. projekts","Uzņēmuma iekļaušana",{"$f":"TODAY()","v":"2019-02-20"},{"$f":"TODAY()+60","v":"2019-04-21"},{"$f":"TODAY()+10","v":"2019-03-02"},{"$f":"TODAY()+65","v":"2019-04-26"},200,220,{"$f":"DAYS360(Informācija[[#This Row],[PLĀNOTAIS SĀKUMS]],Informācija[[#This Row],[PLĀNOTĀS BEIGAS]],FALSE)","v":61},{"$f":"DAYS360(Informācija[[#This Row],[FAKTISKAIS SĀKUMS]],Informācija[[#This Row],[FAKTISKĀS BEIGAS]],FALSE)","v":54},{"$f":"INDEX(Parametri[],MATCH(Informācija[[#This Row],[PROJEKTA VEIDS]],Parametri[PROJEKTA VEIDS],0),MATCH(Informācija[[#Headers],[VISPĀRĪGS PARTNERIS]],Parametri[#Headers],0))*INDEX('PROJEKTA PARAMETRI'!$B$12:$H$12,1,MATCH(Informācija[[#Headers],[VISPĀRĪGS PARTNERIS]],Parametri[#Headers],0))*Informācija[[#This Row],[PLĀNOTAIS DARBS]]","v":{"v":7000,"d":"7,000 EUR"}},{"$f":"INDEX(Parametri[],MATCH(Informācija[[#This Row],[PROJEKTA VEIDS]],Parametri[PROJEKTA VEIDS],0),MATCH(Informācija[[#Headers],[UZŅĒMUMA JURISTS]],Parametri[#Headers],0))*INDEX('PROJEKTA PARAMETRI'!$B$12:$H$12,1,MATCH(Informācija[[#Headers],[UZŅĒMUMA JURISTS]],Parametri[#Headers],0))*Informācija[[#This Row],[PLĀNOTAIS DARBS]]","v":{"v":20000,"d":"20,000 EUR"}},{"$f":"INDEX(Parametri[],MATCH(Informācija[[#This Row],[PROJEKTA VEIDS]],Parametri[PROJEKTA VEIDS],0),MATCH(Informācija[[#Headers],[AIZSARDZĪBAS ADVOKĀTS]],Parametri[#Headers],0))*INDEX('PROJEKTA PARAMETRI'!$B$12:$H$12,1,MATCH(Informācija[[#Headers],[AIZSARDZĪBAS ADVOKĀTS]],Parametri[#Headers],0))*Informācija[[#This Row],[PLĀNOTAIS DARBS]]","v":{"v":0,"d":"0 EUR"}},{"$f":"INDEX(Parametri[],MATCH(Informācija[[#This Row],[PROJEKTA VEIDS]],Parametri[PROJEKTA VEIDS],0),MATCH(Informācija[[#Headers],[INTELEKTUĀLĀ ĪPAŠUMA JURISTS]],Parametri[#Headers],0))*INDEX('PROJEKTA PARAMETRI'!$B$12:$H$12,1,MATCH(Informācija[[#Headers],[INTELEKTUĀLĀ ĪPAŠUMA JURISTS]],Parametri[#Headers],0))*Informācija[[#This Row],[PLĀNOTAIS DARBS]]","v":{"v":0,"d":"0 EUR"}},{"$f":"INDEX(Parametri[],MATCH(Informācija[[#This Row],[PROJEKTA VEIDS]],Parametri[PROJEKTA VEIDS],0),MATCH(Informācija[[#Headers],[BANKROTA JURISTS]],Parametri[#Headers],0))*INDEX('PROJEKTA PARAMETRI'!$B$12:$H$12,1,MATCH(Informācija[[#Headers],[BANKROTA JURISTS]],Parametri[#Headers],0))*Informācija[[#This Row],[PLĀNOTAIS DARBS]]","v":{"v":0,"d":"0 EUR"}},{"$f":"INDEX(Parametri[],MATCH(Informācija[[#This Row],[PROJEKTA VEIDS]],Parametri[PROJEKTA VEIDS],0),MATCH(Informācija[[#Headers],[ADMINISTRATĪVIE DARBINIEKI]],Parametri[#Headers],0))*INDEX('PROJEKTA PARAMETRI'!$B$12:$H$12,1,MATCH(Informācija[[#Headers],[ADMINISTRATĪVIE DARBINIEKI]],Parametri[#Headers],0))*Informācija[[#This Row],[PLĀNOTAIS DARBS]]","v":{"v":12500,"d":"12,500 EUR"}},{"$f":"INDEX(Parametri[],MATCH(Informācija[[#This Row],[PROJEKTA VEIDS]],Parametri[PROJEKTA VEIDS],0),MATCH(Informācija[[#Headers],[VISPĀRĪGS PARTNERIS]],Parametri[#Headers],0))*INDEX('PROJEKTA PARAMETRI'!$B$12:$H$12,1,MATCH(Informācija[[#Headers],[VISPĀRĪGS PARTNERIS]],Parametri[#Headers],0))*Informācija[[#This Row],[FAKTISKAIS DARBS]]","v":{"v":7700,"d":"7,700 EUR"}},{"$f":"INDEX(Parametri[],MATCH(Informācija[[#This Row],[PROJEKTA VEIDS]],Parametri[PROJEKTA VEIDS],0),MATCH(Informācija[[#Headers],[UZŅĒMUMA JURISTS]],Parametri[#Headers],0))*INDEX('PROJEKTA PARAMETRI'!$B$12:$H$12,1,MATCH(Informācija[[#Headers],[UZŅĒMUMA JURISTS]],Parametri[#Headers],0))*Informācija[[#This Row],[FAKTISKAIS DARBS]]","v":{"v":22000,"d":"22,000 EUR"}},{"$f":"INDEX(Parametri[],MATCH(Informācija[[#This Row],[PROJEKTA VEIDS]],Parametri[PROJEKTA VEIDS],0),MATCH(Informācija[[#Headers],[AIZSARDZĪBAS ADVOKĀTS]],Parametri[#Headers],0))*INDEX('PROJEKTA PARAMETRI'!$B$12:$H$12,1,MATCH(Informācija[[#Headers],[AIZSARDZĪBAS ADVOKĀTS]],Parametri[#Headers],0))*Informācija[[#This Row],[FAKTISKAIS DARBS]]","v":{"v":0,"d":"0 EUR"}},{"$f":"INDEX(Parametri[],MATCH(Informācija[[#This Row],[PROJEKTA VEIDS]],Parametri[PROJEKTA VEIDS],0),MATCH(Informācija[[#Headers],[INTELEKTUĀLĀ ĪPAŠUMA JURISTS]],Parametri[#Headers],0))*INDEX('PROJEKTA PARAMETRI'!$B$12:$H$12,1,MATCH(Informācija[[#Headers],[INTELEKTUĀLĀ ĪPAŠUMA JURISTS]],Parametri[#Headers],0))*Informācija[[#This Row],[FAKTISKAIS DARBS]]","v":{"v":0,"d":"0 EUR"}},{"$f":"INDEX(Parametri[],MATCH(Informācija[[#This Row],[PROJEKTA VEIDS]],Parametri[PROJEKTA VEIDS],0),MATCH(Informācija[[#Headers],[BANKROTA JURISTS]],Parametri[#Headers],0))*INDEX('PROJEKTA PARAMETRI'!$B$12:$H$12,1,MATCH(Informācija[[#Headers],[BANKROTA JURISTS]],Parametri[#Headers],0))*Informācija[[#This Row],[FAKTISKAIS DARBS]]","v":{"v":0,"d":"0 EUR"}},{"$f":"INDEX(Parametri[],MATCH(Informācija[[#This Row],[PROJEKTA VEIDS]],Parametri[PROJEKTA VEIDS],0),MATCH(Informācija[[#Headers],[ADMINISTRATĪVIE DARBINIEKI]],Parametri[#Headers],0))*INDEX('PROJEKTA PARAMETRI'!$B$12:$H$12,1,MATCH(Informācija[[#Headers],[ADMINISTRATĪVIE DARBINIEKI]],Parametri[#Headers],0))*Informācija[[#This Row],[FAKTISKAIS DARBS]]","v":{"v":13750,"d":"13,750 EUR"}}]
[null,"2. projekts","Uzņēmuma iegūšana",{"$f":"TODAY()+30","v":"2019-03-22"},{"$f":"TODAY()+100","v":"2019-05-31"},{"$f":"TODAY()+40","v":"2019-04-01"},{"$f":"TODAY()+110","v":"2019-06-10"},400,390,{"$f":"DAYS360(Informācija[[#This Row],[PLĀNOTAIS SĀKUMS]],Informācija[[#This Row],[PLĀNOTĀS BEIGAS]],FALSE)","v":69},{"$f":"DAYS360(Informācija[[#This Row],[FAKTISKAIS SĀKUMS]],Informācija[[#This Row],[FAKTISKĀS BEIGAS]],FALSE)","v":69},{"$f":"INDEX(Parametri[],MATCH(Informācija[[#This Row],[PROJEKTA VEIDS]],Parametri[PROJEKTA VEIDS],0),MATCH(Informācija[[#Headers],[VISPĀRĪGS PARTNERIS]],Parametri[#Headers],0))*INDEX('PROJEKTA PARAMETRI'!$B$12:$H$12,1,MATCH(Informācija[[#Headers],[VISPĀRĪGS PARTNERIS]],Parametri[#Headers],0))*Informācija[[#This Row],[PLĀNOTAIS DARBS]]","v":{"v":14000,"d":"14,000 EUR"}},{"$f":"INDEX(Parametri[],MATCH(Informācija[[#This Row],[PROJEKTA VEIDS]],Parametri[PROJEKTA VEIDS],0),MATCH(Informācija[[#Headers],[UZŅĒMUMA JURISTS]],Parametri[#Headers],0))*INDEX('PROJEKTA PARAMETRI'!$B$12:$H$12,1,MATCH(Informācija[[#Headers],[UZŅĒMUMA JURISTS]],Parametri[#Headers],0))*Informācija[[#This Row],[PLĀNOTAIS DARBS]]","v":{"v":40000,"d":"40,000 EUR"}},{"$f":"INDEX(Parametri[],MATCH(Informācija[[#This Row],[PROJEKTA VEIDS]],Parametri[PROJEKTA VEIDS],0),MATCH(Informācija[[#Headers],[AIZSARDZĪBAS ADVOKĀTS]],Parametri[#Headers],0))*INDEX('PROJEKTA PARAMETRI'!$B$12:$H$12,1,MATCH(Informācija[[#Headers],[AIZSARDZĪBAS ADVOKĀTS]],Parametri[#Headers],0))*Informācija[[#This Row],[PLĀNOTAIS DARBS]]","v":{"v":0,"d":"0 EUR"}},{"$f":"INDEX(Parametri[],MATCH(Informācija[[#This Row],[PROJEKTA VEIDS]],Parametri[PROJEKTA VEIDS],0),MATCH(Informācija[[#Headers],[INTELEKTUĀLĀ ĪPAŠUMA JURISTS]],Parametri[#Headers],0))*INDEX('PROJEKTA PARAMETRI'!$B$12:$H$12,1,MATCH(Informācija[[#Headers],[INTELEKTUĀLĀ ĪPAŠUMA JURISTS]],Parametri[#Headers],0))*Informācija[[#This Row],[PLĀNOTAIS DARBS]]","v":{"v":11000,"d":"11,000 EUR"}},{"$f":"INDEX(Parametri[],MATCH(Informācija[[#This Row],[PROJEKTA VEIDS]],Parametri[PROJEKTA VEIDS],0),MATCH(Informācija[[#Headers],[BANKROTA JURISTS]],Parametri[#Headers],0))*INDEX('PROJEKTA PARAMETRI'!$B$12:$H$12,1,MATCH(Informācija[[#Headers],[BANKROTA JURISTS]],Parametri[#Headers],0))*Informācija[[#This Row],[PLĀNOTAIS DARBS]]","v":{"v":0,"d":"0 EUR"}},{"$f":"INDEX(Parametri[],MATCH(Informācija[[#This Row],[PROJEKTA VEIDS]],Parametri[PROJEKTA VEIDS],0),MATCH(Informācija[[#Headers],[ADMINISTRATĪVIE DARBINIEKI]],Parametri[#Headers],0))*INDEX('PROJEKTA PARAMETRI'!$B$12:$H$12,1,MATCH(Informācija[[#Headers],[ADMINISTRATĪVIE DARBINIEKI]],Parametri[#Headers],0))*Informācija[[#This Row],[PLĀNOTAIS DARBS]]","v":{"v":20000,"d":"20,000 EUR"}},{"$f":"INDEX(Parametri[],MATCH(Informācija[[#This Row],[PROJEKTA VEIDS]],Parametri[PROJEKTA VEIDS],0),MATCH(Informācija[[#Headers],[VISPĀRĪGS PARTNERIS]],Parametri[#Headers],0))*INDEX('PROJEKTA PARAMETRI'!$B$12:$H$12,1,MATCH(Informācija[[#Headers],[VISPĀRĪGS PARTNERIS]],Parametri[#Headers],0))*Informācija[[#This Row],[FAKTISKAIS DARBS]]","v":{"v":13650,"d":"13,650 EUR"}},{"$f":"INDEX(Parametri[],MATCH(Informācija[[#This Row],[PROJEKTA VEIDS]],Parametri[PROJEKTA VEIDS],0),MATCH(Informācija[[#Headers],[UZŅĒMUMA JURISTS]],Parametri[#Headers],0))*INDEX('PROJEKTA PARAMETRI'!$B$12:$H$12,1,MATCH(Informācija[[#Headers],[UZŅĒMUMA JURISTS]],Parametri[#Headers],0))*Informācija[[#This Row],[FAKTISKAIS DARBS]]","v":{"v":39000,"d":"39,000 EUR"}},{"$f":"INDEX(Parametri[],MATCH(Informācija[[#This Row],[PROJEKTA VEIDS]],Parametri[PROJEKTA VEIDS],0),MATCH(Informācija[[#Headers],[AIZSARDZĪBAS ADVOKĀTS]],Parametri[#Headers],0))*INDEX('PROJEKTA PARAMETRI'!$B$12:$H$12,1,MATCH(Informācija[[#Headers],[AIZSARDZĪBAS ADVOKĀTS]],Parametri[#Headers],0))*Informācija[[#This Row],[FAKTISKAIS DARBS]]","v":{"v":0,"d":"0 EUR"}},{"$f":"INDEX(Parametri[],MATCH(Informācija[[#This Row],[PROJEKTA VEIDS]],Parametri[PROJEKTA VEIDS],0),MATCH(Informācija[[#Headers],[INTELEKTUĀLĀ ĪPAŠUMA JURISTS]],Parametri[#Headers],0))*INDEX('PROJEKTA PARAMETRI'!$B$12:$H$12,1,MATCH(Informācija[[#Headers],[INTELEKTUĀLĀ ĪPAŠUMA JURISTS]],Parametri[#Headers],0))*Informācija[[#This Row],[FAKTISKAIS DARBS]]","v":{"v":10725,"d":"10,725 EUR"}},{"$f":"INDEX(Parametri[],MATCH(Informācija[[#This Row],[PROJEKTA VEIDS]],Parametri[PROJEKTA VEIDS],0),MATCH(Informācija[[#Headers],[BANKROTA JURISTS]],Parametri[#Headers],0))*INDEX('PROJEKTA PARAMETRI'!$B$12:$H$12,1,MATCH(Informācija[[#Headers],[BANKROTA JURISTS]],Parametri[#Headers],0))*Informācija[[#This Row],[FAKTISKAIS DARBS]]","v":{"v":0,"d":"0 EUR"}},{"$f":"INDEX(Parametri[],MATCH(Informācija[[#This Row],[PROJEKTA VEIDS]],Parametri[PROJEKTA VEIDS],0),MATCH(Informācija[[#Headers],[ADMINISTRATĪVIE DARBINIEKI]],Parametri[#Headers],0))*INDEX('PROJEKTA PARAMETRI'!$B$12:$H$12,1,MATCH(Informācija[[#Headers],[ADMINISTRATĪVIE DARBINIEKI]],Parametri[#Headers],0))*Informācija[[#This Row],[FAKTISKAIS DARBS]]","v":{"v":19500,"d":"19,500 EUR"}}]
{"$rows_left_out":5}
{"sheet":"PROJEKTA KOPSUMMAS","index":3,"n_rows":11,"n_cols":16,"rows_kept":11,"merged":[[3,2,3,7],[3,8,3,13],[3,15,14,19]]}
["Šajā darblapā iegūstiet projekta kopsummas. Šūnā pa labi tiek automātiski atjaunināts uzņēmuma nosaukums Šīs kolonnas šūnās ir noderīgi norādījumi. Bultiņa uz leju, lai sāktu darbu.",{"$f":"'PROJEKTA PARAMETRI'!B1","v":"Uzņēmuma nosaukums"}]
["Šīs darblapas nosaukums ir šūnā pa labi.",{"$f":"'PROJEKTA PARAMETRI'!B2","v":"Projektu plānošana juridiskajiem uzņēmumiem"}]
["Konfidencialitātes ziņojums ir šūnā pa labi.",{"$f":"'PROJEKTA PARAMETRI'!B3","v":"Uzņēmuma nosaukums , konfidenciāli"}]
["Etiķete Plānotie ir šūnā C4, etiķete Faktiskie ir šūnā I4 un informatīvais padoms ir šūnā P4.",null,"PROGNOZĒTIE",{"$nulls":5},"FAKTISKIE",{"$nulls":6},"INFORMĀCIJA. \nŠī rakurstabula netiks atsvaidzināta automātiski.  Lai to atsvaidzinātu rakurstabulu labajā pusē, atlasiet to (jebkuru šūnu rakurstabulā) un lentes cilnē RAKURSTABULU RĪKI | ANALĪZE atlasiet Atsvaidzināt.  Vai arī nospiediet taustiņu kombināciju SHIFT+F10, atlasot rakurstabulu, un atlasiet Atsvaidzināt."]
["Rakurstabula, kas sākas šūnā pa labi, tiek atjaunināta automātiski.","PROJEKTA NOSAUKUMS","VISPĀRĪGS PARTNERIS  ","UZŅĒMUMS","AIZSARDZĪBAS ADVOKĀTS  ","INTELEKTUĀLAIS ĪPAŠUMS","BANKROTS","ADMINISTRATĪVIE DARBINIEKI  ","VISPĀRĪGS PARTNERIS ","UZŅĒMUMS ","AIZSARDZĪBAS ADVOKĀTS ","BANKROTS ","INTELEKTUĀLAIS ĪPAŠUMS ","ADMINISTRATĪVIE DARBINIEKI "]
[null,"1. projekts",{"v":7000,"d":"7,000.00 EUR"},{"v":20000,"d":"20,000.00 EUR"},{"v":0,"d":"0.00 EUR"},{"v":0,"d":"0.00 EUR"},{"v":0,"d":"0.00 EUR"},{"v":12500,"d":"12,500.00 EUR"},{"v":7700,"d":"7,700.00 EUR"},{"v":22000,"d":"22,000.00 EUR"},{"v":0,"d":"0.00 EUR"},{"v":0,"d":"0.00 EUR"},{"v":0,"d":"0.00 EUR"},{"v":13750,"d":"13,750.00 EUR"}]
{"$rows_left_out":5}