{"text_format":"3","workbook":"xlsx","n_sheets":4,"sheets":["PRADŽIA","PROJEKTO PARAMETRAI","PROJEKTO INFORMACIJA","PROJEKTO SUMOS"],"not_rendered":{"charts":2,"defined_names":3,"pivot_tables":1},"read":"whole","date_system":"1900"}

{"sheet":"PRADŽIA","index":0,"n_rows":7,"n_cols":2,"rows_kept":7}
[null,"APIE ŠĮ ŠABLONĄ"]
[null,"Šioje renginio planavimo stebėjimo darbaknygėje sekite projekto parametrus, projekto informaciją ir projekto bendrąsias sumas."]
[null,"Įveskite informaciją apie projekto parametrų darbalapį, kad atnaujintumėte stulpelių diagramas ir projekto informacijos darbalapį. Projekto bendrųjų sumų darbalapyje automatiškai atnaujinama projekto PivotTable."]
[null,"Įveskite įmonės pavadinimą darbalapyje Parametrai ir jis bus automatiškai atnaujintas kituose darbalapiuose."]
[null,"Pastaba.  "]
[null,"Papildomos instrukcijos pateikiamos kiekvieno darbalapio A stulpelyje RENGINIO PLANAVIMO STEBĖJIMO PIREMONĖS darbaknygėje. Šis tekstas buvo specialiai paslėptas. Norėdami pašalinti tekstą, pasirinkite A stulpelį, tada pasirinkite Naikinti. Norėdami nebeslėpti teksto, pasirinkite A stulpelį, tada pakeiskite šrifto spalvą."]
{"$rows_left_out":2}
{"sheet":"PROJEKTO PARAMETRAI","index":1,"n_rows":19,"n_cols":9,"rows_kept":19,"merged":[[23,1,42,3]]}
[null,"Įmonės pavadinimas"]
[null,"Renginio valdymo projekto stebėjimo priemonė"]
[null,{"$f":"B1&\" Konfidencialu\"","v":"Įmonės pavadinimas Konfidencialu"}]
[null,"Paryškintuose langeliuose esančios reikšmės apskaičiuojamos už jus. Jums nereikia nieko į juos įvesti."]
[null,"PROJEKTO TIPAS","PASKYROS VADOVAS","PROJEKTO VADOVAS","STRATEGIJOS VADOVAS","DIZAINO SPECIALISTĖ","RENGINIO DARBUOTOJAI","ADMINISTRACIJOS DARBUOTOJAI","Suma"]
[null,"Renginio strategijos plėtojimas",{"v":0.2,"d":"20%"},{"v":0.1,"d":"10%"},{"v":0.6,"d":"60%"},{"v":0,"d":"0%"},{"v":0,"d":"0%"},{"v":0.1,"d":"10%"},{"$f":"SUM(Parametrai[[#This Row],[PASKYROS VADOVAS]:[ADMINISTRACIJOS DARBUOTOJAI]])","v":{"v":1,"d":"100%"}}]
{"$rows_left_out":14}
{"sheet":"PROJEKTO INFORMACIJA","index":2,"n_rows":10,"n_cols":23,"rows_kept":10}
[null,{"$f":"'PROJEKTO PARAMETRAI'!B1","v":"Įmonės pavadinimas"}]
[null,"Renginio valdymo projekto stebėjimo priemonė"]
[null,{"$f":"'PROJEKTO PARAMETRAI'!B3","v":"Įmonės pavadinimas Konfidencialu"}]
["Įveskite informaciją lentelėje Projekto informacija nuo langelio dešinėje.\nINFORMACIJA\nNorėdami įtraukti eilutę lentelėje dešinėje, pasirinkite apatiniame dešiniajame kampe esantį langelį (ne sumos eilutę) ir paspauskite Tab arba paspauskite SHIFT + F10 ten, kur norite įterpti eilutę, tada spustelėkite Įterpti | Lentelės eilutės aukščiau/žemiau.\nĮsitikinkite, kad panaikintos visos nenaudojamas eilutės, nes PROJEKTO SUMŲ PivotTable naudos visus lentelės langelius, nes kitu atveju bus pateikti klaidingi rezultatai.","PROJEKTO PAVADINIMAS","PROJEKTO TIPAS","NUMATOMA PRADŽIA","NUMATOMA PABAIGA","FAKTINĖ PRADŽIA","FAKTINĖ PABAIGA","NUMATYTOS DARBO VALANDOS","FAKTINĖS DARBO VALANDOS","NUMATOMA TRUKMĖ","FAKTINĖ TRUKMĖ","PASKYROS VADOVAS","PROJEKTO VADOVAS","STRATEGIJOS VADOVAS","DIZAINO SPECIALISTĖ","RENGINIO DARBUOTOJAI","ADMINISTRACIJOS DARBUOTOJAI","PASKYROS VADOVAS ","PROJEKTO VADOVAS ","STRATEGIJOS VADOVAS ","DIZAINO SPECIALISTĖ ","RENGINIO DARBUOTOJAI ","ADMINISTRACIJOS DARBUOTOJAI "]
[null,"1 projektas","Renginio strategijos plėtojimas",{"$f":"DATE(YEAR(TODAY()),6,9)","v":"2022-06-09"},{"$f":" DATE(YEAR(TODAY()),8,7)","v":"2022-08-07"},{"$f":"DATE(YEAR(TODAY()),6,29)","v":"2022-06-29"},{"$f":"DATE(YEAR(TODAY()),9,3)","v":"2022-09-03"},200,220,{"$f":"DAYS360(ProjektoInformacija[[#This Row],[NUMATOMA PRADŽIA]],ProjektoInformacija[[#This Row],[NUMATOMA PABAIGA]],FALSE)","v":58},{"$f":"DAYS360(ProjektoInformacija[[#This Row],[FAKTINĖ PRADŽIA]],ProjektoInformacija[[#This Row],[FAKTINĖ PABAIGA]],FALSE)","v":64},{"$f":"INDEX(Parametrai[],MATCH(ProjektoInformacija[[#This Row],[PROJEKTO TIPAS]],Parametrai[PROJEKTO TIPAS],0),MATCH(ProjektoInformacija[[#Headers],[PASKYROS VADOVAS]],Parametrai[#Headers],0))*INDEX('PROJEKTO PARAMETRAI'!$B$12:$H$12,1,MATCH(ProjektoInformacija[[#Headers],[PASKYROS VADOVAS]],Parametrai[#Headers],0))*ProjektoInformacija[[#This Row],[NUMATYTOS DARBO VALANDOS]]","v":{"v":7200,"d":"7,200 EUR"}},{"$f":"INDEX(Parametrai[],MATCH(ProjektoInformacija[[#This Row],[PROJEKTO TIPAS]],Parametrai[PROJEKTO TIPAS],0),MATCH(ProjektoInformacija[[#Headers],[PROJEKTO VADOVAS]],Parametrai[#Headers],0))*INDEX('PROJEKTO PARAMETRAI'!$B$12:$H$12,1,MATCH(ProjektoInformacija[[#Headers],[PROJEKTO VADOVAS]],Parametrai[#Headers],0))*ProjektoInformacija[[#This Row],[NUMATYTOS DARBO VALANDOS]]","v":{"v":2400,"d":"2,400 EUR"}},{"$f":"INDEX(Parametrai[],MATCH(ProjektoInformacija[[#This Row],[PROJEKTO TIPAS]],Parametrai[PROJEKTO TIPAS],0),MATCH(ProjektoInformacija[[#Headers],[STRATEGIJOS VADOVAS]],Parametrai[#Headers],0))*INDEX('PROJEKTO PARAMETRAI'!$B$12:$H$12,1,MATCH(ProjektoInformacija[[#Headers],[STRATEGIJOS VADOVAS]],Parametrai[#Headers],0))*ProjektoInformacija[[#This Row],[NUMATYTOS DARBO VALANDOS]]","v":{"v":18000,"d":"18,000 EUR"}},{"$f":"INDEX(Parametrai[],MATCH(ProjektoInformacija[[#This Row],[PROJEKTO TIPAS]],Parametrai[PROJEKTO TIPAS],0),MATCH(ProjektoInformacija[[#Headers],[DIZAINO SPECIALISTĖ]],Parametrai[#Headers],0))*INDEX('PROJEKTO PARAMETRAI'!$B$12:$H$12,1,MATCH(ProjektoInformacija[[#Headers],[DIZAINO SPECIALISTĖ]],Parametrai[#Headers],0))*ProjektoInformacija[[#This Row],[NUMATYTOS DARBO VALANDOS]]","v":{"v":0,"d":"0 EUR"}},{"$f":"INDEX(Parametrai[],MATCH(ProjektoInformacija[[#This Row],[PROJEKTO TIPAS]],Parametrai[PROJEKTO TIPAS],0),MATCH(ProjektoInformacija[[#Headers],[RENGINIO DARBUOTOJAI]],Parametrai[#Headers],0))*INDEX('PROJEKTO PARAMETRAI'!$B$12:$H$12,1,MATCH(ProjektoInformacija[[#Headers],[RENGINIO DARBUOTOJAI]],Parametrai[#Headers],0))*ProjektoInformacija[[#This Row],[NUMATYTOS DARBO VALANDOS]]","v":{"v":0,"d":"0 EUR"}},{"$f":"INDEX(Parametrai[],MATCH(ProjektoInformacija[[#This Row],[PROJEKTO TIPAS]],Parametrai[PROJEKTO TIPAS],0),MATCH(ProjektoInformacija[[#Headers],[ADMINISTRACIJOS DARBUOTOJAI]],Parametrai[#Headers],0))*INDEX('PROJEKTO PARAMETRAI'!$B$12:$H$12,1,MATCH(ProjektoInformacija[[#Headers],[ADMINISTRACIJOS DARBUOTOJAI]],Parametrai[#Headers],0))*ProjektoInformacija[[#This Row],[NUMATYTOS DARBO VALANDOS]]","v":{"v":1200,"d":"1,200 EUR"}},{"$f":"INDEX(Parametrai[],MATCH(ProjektoInformacija[[#This Row],[PROJEKTO TIPAS]],Parametrai[PROJEKTO TIPAS],0),MATCH(ProjektoInformacija[[#Headers],[PASKYROS VADOVAS]],Parametrai[#Headers],0))*INDEX('PROJEKTO PARAMETRAI'!$B$12:$H$12,1,MATCH(ProjektoInformacija[[#Headers],[PASKYROS VADOVAS]],Parametrai[#Headers],0))*ProjektoInformacija[[#This Row],[FAKTINĖS DARBO VALANDOS]]","v":{"v":7920,"d":"7,920 EUR"}},{"$f":"INDEX(Parametrai[],MATCH(ProjektoInformacija[[#This Row],[PROJEKTO TIPAS]],Parametrai[PROJEKTO TIPAS],0),MATCH(ProjektoInformacija[[#Headers],[PROJEKTO VADOVAS]],Parametrai[#Headers],0))*INDEX('PROJEKTO PARAMETRAI'!$B$12:$H$12,1,MATCH(ProjektoInformacija[[#Headers],[PROJEKTO VADOVAS]],Parametrai[#Headers],0))*ProjektoInformacija[[#This Row],[FAKTINĖS DARBO VALANDOS]]","v":{"v":2640,"d":"2,640 EUR"}},{"$f":"INDEX(Parametrai[],MATCH(ProjektoInformacija[[#This Row],[PROJEKTO TIPAS]],Parametrai[PROJEKTO TIPAS],0),MATCH(ProjektoInformacija[[#Headers],[STRATEGIJOS VADOVAS]],Parametrai[#Headers],0))*INDEX('PROJEKTO PARAMETRAI'!$B$12:$H$12,1,MATCH(ProjektoInformacija[[#Headers],[STRATEGIJOS VADOVAS]],Parametrai[#Headers],0))*ProjektoInformacija[[#This Row],[FAKTINĖS DARBO VALANDOS]]","v":{"v":19800,"d":"19,800 EUR"}},{"$f":"INDEX(Parametrai[],MATCH(ProjektoInformacija[[#This Row],[PROJEKTO TIPAS]],Parametrai[PROJEKTO TIPAS],0),MATCH(ProjektoInformacija[[#Headers],[DIZAINO SPECIALISTĖ]],Parametrai[#Headers],0))*INDEX('PROJEKTO PARAMETRAI'!$B$12:$H$12,1,MATCH(ProjektoInformacija[[#Headers],[DIZAINO SPECIALISTĖ]],Parametrai[#Headers],0))*ProjektoInformacija[[#This Row],[FAKTINĖS DARBO VALANDOS]]","v":{"v":0,"d":"0 EUR"}},{"$f":"INDEX(Parametrai[],MATCH(ProjektoInformacija[[#This Row],[PROJEKTO TIPAS]],Parametrai[PROJEKTO TIPAS],0),MATCH(ProjektoInformacija[[#Headers],[RENGINIO DARBUOTOJAI]],Parametrai[#Headers],0))*INDEX('PROJEKTO PARAMETRAI'!$B$12:$H$12,1,MATCH(ProjektoInformacija[[#Headers],[RENGINIO DARBUOTOJAI]],Parametrai[#Headers],0))*ProjektoInformacija[[#This Row],[FAKTINĖS DARBO VALANDOS]]","v":{"v":0,"d":"0 EUR"}},{"$f":"INDEX(Parametrai[],MATCH(ProjektoInformacija[[#This Row],[PROJEKTO TIPAS]],Parametrai[PROJEKTO TIPAS],0),MATCH(ProjektoInformacija[[#Headers],[ADMINISTRACIJOS DARBUOTOJAI]],Parametrai[#Headers],0))*INDEX('PROJEKTO PARAMETRAI'!$B$12:$H$12,1,MATCH(ProjektoInformacija[[#Headers],[ADMINISTRACIJOS DARBUOTOJAI]],Parametrai[#Headers],0))*ProjektoInformacija[[#This Row],[FAKTINĖS DARBO VALANDOS]]","v":{"v":1320,"d":"1,320 EUR"}}]
[null,"2 projektas","Renginio planavimas",{"$f":"DATE(YEAR(TODAY())+1,6,25)","v":"2023-06-25"},{"$f":"DATE(YEAR(TODAY())+1,7,27)","v":"2023-07-27"},{"$f":"DATE(YEAR(TODAY()),7,15)","v":"2022-07-15"},{"$f":"DATE(YEAR(TODAY())+1,8,25)","v":"2023-08-25"},400,390,{"$f":"DAYS360(ProjektoInformacija[[#This Row],[NUMATOMA PRADŽIA]],ProjektoInformacija[[#This Row],[NUMATOMA PABAIGA]],FALSE)","v":32},{"$f":"DAYS360(ProjektoInformacija[[#This Row],[FAKTINĖ PRADŽIA]],ProjektoInformacija[[#This Row],[FAKTINĖ PABAIGA]],FALSE)","v":400},{"$f":"INDEX(Parametrai[],MATCH(ProjektoInformacija[[#This Row],[PROJEKTO TIPAS]],Parametrai[PROJEKTO TIPAS],0),MATCH(ProjektoInformacija[[#Headers],[PASKYROS VADOVAS]],Parametrai[#Headers],0))*INDEX('PROJEKTO PARAMETRAI'!$B$12:$H$12,1,MATCH(ProjektoInformacija[[#Headers],[PASKYROS VADOVAS]],Parametrai[#Headers],0))*ProjektoInformacija[[#This Row],[NUMATYTOS DARBO VALANDOS]]","v":{"v":14400,"d":"14,400 EUR"}},{"$f":"INDEX(Parametrai[],MATCH(ProjektoInformacija[[#This Row],[PROJEKTO TIPAS]],Parametrai[PROJEKTO TIPAS],0),MATCH(ProjektoInformacija[[#Headers],[PROJEKTO VADOVAS]],Parametrai[#Headers],0))*INDEX('PROJEKTO PARAMETRAI'!$B$12:$H$12,1,MATCH(ProjektoInformacija[[#Headers],[PROJEKTO VADOVAS]],Parametrai[#Headers],0))*ProjektoInformacija[[#This Row],[NUMATYTOS DARBO VALANDOS]]","v":{"v":24000,"d":"24,000 EUR"}},{"$f":"INDEX(Parametrai[],MATCH(ProjektoInformacija[[#This Row],[PROJEKTO TIPAS]],Parametrai[PROJEKTO TIPAS],0),MATCH(ProjektoInformacija[[#Headers],[STRATEGIJOS VADOVAS]],Parametrai[#Headers],0))*INDEX('PROJEKTO PARAMETRAI'!$B$12:$H$12,1,MATCH(ProjektoInformacija[[#Headers],[STRATEGIJOS VADOVAS]],Parametrai[#Headers],0))*ProjektoInformacija[[#This Row],[NUMATYTOS DARBO VALANDOS]]","v":{"v":6000,"d":"6,000 EUR"}},{"$f":"INDEX(Parametrai[],MATCH(ProjektoInformacija[[#This Row],[PROJEKTO TIPAS]],Parametrai[PROJEKTO TIPAS],0),MATCH(ProjektoInformacija[[#Headers],[DIZAINO SPECIALISTĖ]],Parametrai[#Headers],0))*INDEX('PROJEKTO PARAMETRAI'!$B$12:$H$12,1,MATCH(ProjektoInformacija[[#Headers],[DIZAINO SPECIALISTĖ]],Parametrai[#Headers],0))*ProjektoInformacija[[#This Row],[NUMATYTOS DARBO VALANDOS]]","v":{"v":4000,"d":"4,000 EUR"}},{"$f":"INDEX(Parametrai[],MATCH(ProjektoInformacija[[#This Row],[PROJEKTO TIPAS]],Parametrai[PROJEKTO TIPAS],0),MATCH(ProjektoInformacija[[#Headers],[RENGINIO DARBUOTOJAI]],Parametrai[#Headers],0))*INDEX('PROJEKTO PARAMETRAI'!$B$12:$H$12,1,MATCH(ProjektoInformacija[[#Headers],[RENGINIO DARBUOTOJAI]],Parametrai[#Headers],0))*ProjektoInformacija[[#This Row],[NUMATYTOS DARBO VALANDOS]]","v":{"v":0,"d":"0 EUR"}},{"$f":"INDEX(Parametrai[],MATCH(ProjektoInformacija[[#This Row],[PROJEKTO TIPAS]],Parametrai[PROJEKTO TIPAS],0),MATCH(ProjektoInformacija[[#Headers],[ADMINISTRACIJOS DARBUOTOJAI]],Parametrai[#Headers],0))*INDEX('PROJEKTO PARAMETRAI'!$B$12:$H$12,1,MATCH(ProjektoInformacija[[#Headers],[ADMINISTRACIJOS DARBUOTOJAI]],Parametrai[#Headers],0))*ProjektoInformacija[[#This Row],[NUMATYTOS DARBO VALANDOS]]","v":{"v":2400,"d":"2,400 EUR"}},{"$f":"INDEX(Parametrai[],MATCH(ProjektoInformacija[[#This Row],[PROJEKTO TIPAS]],Parametrai[PROJEKTO TIPAS],0),MATCH(ProjektoInformacija[[#Headers],[PASKYROS VADOVAS]],Parametrai[#Headers],0))*INDEX('PROJEKTO PARAMETRAI'!$B$12:$H$12,1,MATCH(ProjektoInformacija[[#Headers],[PASKYROS VADOVAS]],Parametrai[#Headers],0))*ProjektoInformacija[[#This Row],[FAKTINĖS DARBO VALANDOS]]","v":{"v":14040,"d":"14,040 EUR"}},{"$f":"INDEX(Parametrai[],MATCH(ProjektoInformacija[[#This Row],[PROJEKTO TIPAS]],Parametrai[PROJEKTO TIPAS],0),MATCH(ProjektoInformacija[[#Headers],[PROJEKTO VADOVAS]],Parametrai[#Headers],0))*INDEX('PROJEKTO PARAMETRAI'!$B$12:$H$12,1,MATCH(ProjektoInformacija[[#Headers],[PROJEKTO VADOVAS]],Parametrai[#Headers],0))*ProjektoInformacija[[#This Row],[FAKTINĖS DARBO VALANDOS]]","v":{"v":23400,"d":"23,400 EUR"}},{"$f":"INDEX(Parametrai[],MATCH(ProjektoInformacija[[#This Row],[PROJEKTO TIPAS]],Parametrai[PROJEKTO TIPAS],0),MATCH(ProjektoInformacija[[#Headers],[STRATEGIJOS VADOVAS]],Parametrai[#Headers],0))*INDEX('PROJEKTO PARAMETRAI'!$B$12:$H$12,1,MATCH(ProjektoInformacija[[#Headers],[STRATEGIJOS VADOVAS]],Parametrai[#Headers],0))*ProjektoInformacija[[#This Row],[FAKTINĖS DARBO VALANDOS]]","v":{"v":5850,"d":"5,850 EUR"}},{"$f":"INDEX(Parametrai[],MATCH(ProjektoInformacija[[#This Row],[PROJEKTO TIPAS]],Parametrai[PROJEKTO TIPAS],0),MATCH(ProjektoInformacija[[#Headers],[DIZAINO SPECIALISTĖ]],Parametrai[#Headers],0))*INDEX('PROJEKTO PARAMETRAI'!$B$12:$H$12,1,MATCH(ProjektoInformacija[[#Headers],[DIZAINO SPECIALISTĖ]],Parametrai[#Headers],0))*ProjektoInformacija[[#This Row],[FAKTINĖS DARBO VALANDOS]]","v":{"v":3900,"d":"3,900 EUR"}},{"$f":"INDEX(Parametrai[],MATCH(ProjektoInformacija[[#This Row],[PROJEKTO TIPAS]],Parametrai[PROJEKTO TIPAS],0),MATCH(ProjektoInformacija[[#Headers],[RENGINIO DARBUOTOJAI]],Parametrai[#Headers],0))*INDEX('PROJEKTO PARAMETRAI'!$B$12:$H$12,1,MATCH(ProjektoInformacija[[#Headers],[RENGINIO DARBUOTOJAI]],Parametrai[#Headers],0))*ProjektoInformacija[[#This Row],[FAKTINĖS DARBO VALANDOS]]","v":{"v":0,"d":"0 EUR"}},{"$f":"INDEX(Parametrai[],MATCH(ProjektoInformacija[[#This Row],[PROJEKTO TIPAS]],Parametrai[PROJEKTO TIPAS],0),MATCH(ProjektoInformacija[[#Headers],[ADMINISTRACIJOS DARBUOTOJAI]],Parametrai[#Headers],0))*INDEX('PROJEKTO PARAMETRAI'!$B$12:$H$12,1,MATCH(ProjektoInformacija[[#Headers],[ADMINISTRACIJOS DARBUOTOJAI]],Parametrai[#Headers],0))*ProjektoInformacija[[#This Row],[FAKTINĖS DARBO VALANDOS]]","v":{"v":2340,"d":"2,340 EUR"}}]
{"$rows_left_out":5}
{"sheet":"PROJEKTO SUMOS","index":3,"n_rows":10,"n_cols":14,"rows_kept":10}
[null,{"$f":"'PROJEKTO PARAMETRAI'!B1","v":"Įmonės pavadinimas"}]
[null,"Renginio valdymo projekto stebėjimo priemonė"]
[null,{"$f":"'PROJEKTO PARAMETRAI'!B3","v":"Įmonės pavadinimas Konfidencialu"}]
["PivotTable atnaujinama automatiškai, pradedant nuo langelio dešinėje.\nINFORMACIJA\nNorėdami atnaujinti „PivotTable“ dešinėje pažymėkite ją (bet kurį „PivotTable“ langelį), tada juostelės skirtuke „PIVOTTABLE“ ĮRANKIAI | ANALIZĖ pasirinkite Atnaujinti. Arba paspauskite SHIFT + F10 pažymėję bet kurį „PivotTable“ langelį ir pasirinkite Atnaujinti.","PROJEKTO PAVADINIMAS","PASKYROS VADOVO NUMATOMA SUMA","PROJEKTO VADOVO NUMATOMA SUMA","STRATEGIJOS VADOVO NUMATOMA SUMA","DIZAINO SPECIALISTĖS NUMATOMA SUMA","RENGINIO DARBUOTOJŲ NUMATOMA SUMA","ADMINISTRAVIMO DARBUOTOJŲ NUMATOMA SUMA","PASKYROS VADOVO FAKTINĖ SUMA","PROJEKTO VADOVO FAKTINĖ SUMA","STRATEGIJOS VADOVO FAKTINĖ SUMA","DIZAINO SPECIALISTĖS FAKTINĖ SUMA","RENGINIO DARBUOTOJŲ FAKTINĖ SUMA","ADMINISTRAVIMO DARBUOTOJŲ FAKTINĖ SUMA"]
[null,"1 projektas",{"v":7200,"d":"7,200.00 EUR"},{"v":2400,"d":"2,400.00 EUR"},{"v":18000,"d":"18,000.00 EUR"},{"v":0,"d":"0.00 EUR"},{"v":0,"d":"0.00 EUR"},{"v":1200,"d":"1,200.00 EUR"},{"v":7920,"d":"7,920.00 EUR"},{"v":2640,"d":"2,640.00 EUR"},{"v":19800,"d":"19,800.00 EUR"},{"v":0,"d":"0.00 EUR"},{"v":0,"d":"0.00 EUR"},{"v":1320,"d":"1,320.00 EUR"}]
[null,"2 projektas",{"v":14400,"d":"14,400.00 EUR"},{"v":24000,"d":"24,000.00 EUR"},{"v":6000,"d":"6,000.00 EUR"},{"v":4000,"d":"4,000.00 EUR"},{"v":0,"d":"0.00 EUR"},{"v":2400,"d":"2,400.00 EUR"},{"v":14040,"d":"14,040.00 EUR"},{"v":23400,"d":"23,400.00 EUR"},{"v":5850,"d":"5,850.00 EUR"},{"v":3900,"d":"3,900.00 EUR"},{"v":0,"d":"0.00 EUR"},{"v":2340,"d":"2,340.00 EUR"}]
{"$rows_left_out":4}