{"text_format":"3","workbook":"xlsx","n_sheets":9,"sheets":["Santrauka","Dalykas 1","Dalykas 2","Dalykas 3","Dalykas 4","Dalykas 5","Dalykas 6","Dalykas 7","PV lentelė"],"not_rendered":{"defined_names":9},"read":"whole","date_system":"1900"}

{"sheet":"Santrauka","index":0,"n_rows":12,"n_cols":7,"rows_kept":12,"merged":[[1,1,1,2]]}
[]
[null,"Mokyklos pavadinimas",null,"  Jūsų vardas ir pavardė:",null," Semestras/Metai:"]
[]
[null,"Dalykai","Kreditai","Dabartinė procentinė išraiška","Pažymio raidė","PV","Pasvertas PV"]
[null,"Dalykas 1",{"v":3,"d":"03"},{"$f":"'Dalykas 1'!D$36","v":{"v":0.8661764705882354,"d":"86.62%"}},{"$f":"IF(D5<>\"\",HLOOKUP(D5,'PV lentelė'!$C$5:$O$7,2),\"\")","v":"B"},{"$f":"IF(D5<>\"\",HLOOKUP(D5,'PV lentelė'!$C$5:$O$7,3),\"\")","v":{"v":3,"d":"3.00"}},{"$f":"IF(F5<>\"\",F5*C5/(SUM($C$5:$C$11)), \"\")","v":{"v":0.5625,"d":"0.56"}}]
[null,"Dalykas 2",{"v":4,"d":"04"},{"$f":"'Dalykas 2'!D$36","v":""},{"$f":"IF(D6<>\"\",HLOOKUP(D6,'PV lentelė'!$C$5:$O$7,2),\"\")","v":""},{"$f":"IF(D6<>\"\",HLOOKUP(D6,'PV lentelė'!$C$5:$O$7,3),\"\")","v":""},""]
[null,"Dalykas 3",{"v":2,"d":"02"},{"$f":"'Dalykas 3'!D$36","v":""},{"$f":"IF(D7<>\"\",HLOOKUP(D7,'PV lentelė'!$C$5:$O$7,2),\"\")","v":""},{"$f":"IF(D7<>\"\",HLOOKUP(D7,'PV lentelė'!$C$5:$O$7,3),\"\")","v":""},""]
[null,"Dalykas 4",{"v":4,"d":"04"},{"$f":"'Dalykas 4'!D$36","v":""},{"$f":"IF(D8<>\"\",HLOOKUP(D8,'PV lentelė'!$C$5:$O$7,2),\"\")","v":""},{"$f":"IF(D8<>\"\",HLOOKUP(D8,'PV lentelė'!$C$5:$O$7,3),\"\")","v":""},""]
[null,"Dalykas 5",{"v":1,"d":"01"},{"$f":"'Dalykas 5'!D$36","v":""},{"$f":"IF(D9<>\"\",HLOOKUP(D9,'PV lentelė'!$C$5:$O$7,2),\"\")","v":""},{"$f":"IF(D9<>\"\",HLOOKUP(D9,'PV lentelė'!$C$5:$O$7,3),\"\")","v":""},""]
[null,"Dalykas 6",{"v":1,"d":"01"},{"$f":"'Dalykas 6'!D$36","v":""},{"$f":"IF(D10<>\"\",HLOOKUP(D10,'PV lentelė'!$C$5:$O$7,2),\"\")","v":""},{"$f":"IF(D10<>\"\",HLOOKUP(D10,'PV lentelė'!$C$5:$O$7,3),\"\")","v":""},""]
[null,"Dalykas 7",{"v":1,"d":"01"},{"$f":"'Dalykas 7'!D$36","v":""},{"$f":"IF(D11<>\"\",HLOOKUP(D11,'PV lentelė'!$C$5:$O$7,2),\"\")","v":""},{"$f":"IF(D11<>\"\",HLOOKUP(D11,'PV lentelė'!$C$5:$O$7,3),\"\")","v":""},""]
[null,"Sumos",{"$f":"SUM(C5:C11)","v":16},{"$f":"AVERAGE(D5:D11)","v":{"v":0.8661764705882354,"d":"86.62%"}},{"$f":"IF(D12<>\"\",HLOOKUP(D12,'PV lentelė'!$C$5:$O$7,2),\"\")","v":"B"},{"$f":"AVERAGE(F5:F11)","v":{"v":3,"d":"3.00"}},{"$f":"SUM(G5:G11)","v":{"v":0.5625,"d":"0.56"}}]

{"sheet":"Dalykas 1","index":1,"n_rows":38,"n_cols":8,"rows_kept":38,"merged":[[1,1,1,2]]}
[]
[null,{"$f":"Santrauka!B5","v":"Dalykas 1"}]
[null,"Dėstytojas:",null,null,"Galimų taškų procentinė išraiška",null,null,{"$f":"IF(SUM($C$35:$H$35) <> 0,SUM($C$34:$H$34)/SUM($C$35:$H$35),\"\")","v":{"v":0.8661764705882354,"d":"86.62%"}}]
[null,"El. paštas:",null,null,"Dabartinis pažymys",null,null,{"$f":"SUM($C$34:$H$34)","v":{"v":0.1732352941176471,"d":"17.32%"}}]
[]
[null,"Užduotys","Namų darbai","Rašiniai","Patikrinimai raštu","Projektai","Semestro vidurio egzaminas","Baigiamasis egzaminas"]
[null,"Svoris",{"v":0.1,"d":"10.0%"},{"v":0.1,"d":"10.0%"},{"v":0.15,"d":"15.0%"},{"v":0.15,"d":"15.0%"},{"v":0.2,"d":"20.0%"},{"v":0.3,"d":"30.0%"}]
[null,"Pirmas namų darbas",{"v":0.882352941176471,"d":"0.88"}]
[null,"Darbas raštu apie Antrąjį pasaulinį karą",null,0.85]
{"$rows_empty":24}
[null,"Iš viso taškų",{"$f":"IF(COUNT(C8:C33) <> 0,AVERAGE(C8:C33) *C7, \"\")","v":{"v":0.0882352941176471,"d":"0.0882"}},{"v":0.085,"d":"0.0850"},"","","",""]
[null,"Maksimali įmanoma taškų suma",{"$f":"IF(COUNT(C8:C33)<>0,C7,\"\")","v":0.1},0.1,"","","",""]
[null,"Galimų taškų procentinė išraiška",null,{"$f":"IF(SUM($C$35:$H$35) <> 0,SUM($C$34:$H$34)/SUM($C$35:$H$35),\"\")","v":{"v":0.8661764705882354,"d":"86.62%"}}]
[null,"Įvesti pažymius:","Įveskite gautus taškus virš maksimalaus taškų skaičiaus (pvz., 15/17)."]
[null,null,"Įveskite procentinę gauto pažymio išraišką (pvz., 85%)."]

{"sheet":"Dalykas 2","index":2,"n_rows":38,"n_cols":8,"rows_kept":38,"merged":[[1,1,1,2]]}
[]
[null,{"$f":"Santrauka!B6","v":"Dalykas 2"}]
[null,"Dėstytojas:",null,null,"Galimų taškų procentinė išraiška",null,null,{"$f":"IF(SUM($C$35:$H$35) <> 0,SUM($C$34:$H$34)/SUM($C$35:$H$35),\"\")","v":""}]
[null,"El. paštas:",null,null,"Dabartinis pažymys",null,null,{"$f":"SUM($C$34:$H$34)","v":{"v":0,"d":"0.00%"}}]
[]
[null,"Užduotys","Namų darbai","Rašiniai","Patikrinimai raštu","Projektai","Semestro vidurio egzaminas","Baigiamasis egzaminas"]
[null,"Svoris",{"v":0.1,"d":"10.0%"},{"v":0.1,"d":"10.0%"},{"v":0.15,"d":"15.0%"},{"v":0.15,"d":"15.0%"},{"v":0.2,"d":"20.0%"},{"v":0.3,"d":"30.0%"}]
{"$rows_empty":26}
[null,"Iš viso taškų",{"$f":"IF(COUNT(C8:C33) <> 0,AVERAGE(C8:C33) *C7, \"\")","v":""},"","","","",""]
[null,"Maksimali įmanoma taškų suma",{"$f":"IF(COUNT(C8:C33)<>0,C7,\"\")","v":""},"","","","",""]
[null,"Galimų taškų procentinė išraiška",null,{"$f":"IF(SUM($C$35:$H$35) <> 0,SUM($C$34:$H$34)/SUM($C$35:$H$35),\"\")","v":""}]
[null,"Įvesti pažymius:","Įveskite gautus taškus virš maksimalaus taškų skaičiaus (pvz., 15/17)."]
[null,null,"Įveskite procentinę gauto pažymio išraišką (pvz., 85%)."]

{"sheet":"Dalykas 3","index":3,"n_rows":38,"n_cols":8,"rows_kept":38,"merged":[[1,1,1,2]]}
[]
[null,{"$f":"Santrauka!B7","v":"Dalykas 3"}]
[null,"Dėstytojas:",null,null,"Galimų taškų procentinė išraiška",null,null,{"$f":"IF(SUM($C$35:$H$35) <> 0,SUM($C$34:$H$34)/SUM($C$35:$H$35),\"\")","v":""}]
[null,"El. paštas:",null,null,"Dabartinis pažymys",null,null,{"$f":"SUM($C$34:$H$34)","v":{"v":0,"d":"0.00%"}}]
[]
[null,"Užduotys","Namų darbai","Rašiniai","Patikrinimai raštu","Projektai","Semestro vidurio egzaminas","Baigiamasis egzaminas"]
[null,"Svoris",{"v":0.1,"d":"10.0%"},{"v":0.1,"d":"10.0%"},{"v":0.15,"d":"15.0%"},{"v":0.15,"d":"15.0%"},{"v":0.2,"d":"20.0%"},{"v":0.3,"d":"30.0%"}]
{"$rows_empty":26}
[null,"Iš viso taškų",{"$f":"IF(COUNT(C8:C33) <> 0,AVERAGE(C8:C33) *C7, \"\")","v":""},"","","","",""]
[null,"Maksimali įmanoma taškų suma",{"$f":"IF(COUNT(C8:C33)<>0,C7,\"\")","v":""},"","","","",""]
[null,"Galimų taškų procentinė išraiška",null,{"$f":"IF(SUM($C$35:$H$35) <> 0,SUM($C$34:$H$34)/SUM($C$35:$H$35),\"\")","v":""}]
[null,"Įvesti pažymius:","Įveskite gautus taškus virš maksimalaus taškų skaičiaus (pvz., 15/17)."]
[null,null,"Įveskite procentinę gauto pažymio išraišką (pvz., 85%)."]

{"sheet":"Dalykas 4","index":4,"n_rows":38,"n_cols":8,"rows_kept":38,"merged":[[1,1,1,2]]}
[]
[null,{"$f":"Santrauka!B8","v":"Dalykas 4"}]
[null,"Dėstytojas:",null,null,"Galimų taškų procentinė išraiška"]
[null,"El. paštas:",null,null,"Dabartinis pažymys",null,null,{"$f":"SUM($C$34:$H$34)","v":{"v":0,"d":"0.00%"}}]
[]
[null,"Užduotys","Namų darbai","Rašiniai","Patikrinimai raštu","Projektai","Semestro vidurio egzaminas","Baigiamasis egzaminas"]
[null,"Svoris",{"v":0.1,"d":"10.0%"},{"v":0.1,"d":"10.0%"},{"v":0.15,"d":"15.0%"},{"v":0.15,"d":"15.0%"},{"v":0.2,"d":"20.0%"},{"v":0.3,"d":"30.0%"}]
{"$rows_empty":26}
[null,"Iš viso taškų",{"$f":"IF(COUNT(C8:C33) <> 0,AVERAGE(C8:C33) *C7, \"\")","v":""},"","","","",""]
[null,"Maksimali įmanoma taškų suma",{"$f":"IF(COUNT(C8:C33)<>0,C7,\"\")","v":""},"","","","",""]
[null,"Galimų taškų procentinė išraiška",null,{"$f":"IF(SUM($C$35:$H$35) <> 0,SUM($C$34:$H$34)/SUM($C$35:$H$35),\"\")","v":""}]
[null,"Įvesti pažymius:","Įveskite gautus taškus virš maksimalaus taškų skaičiaus (pvz., 15/17)."]
[null,null,"Įveskite procentinę gauto pažymio išraišką (pvz., 85%)."]

{"sheet":"Dalykas 5","index":5,"n_rows":38,"n_cols":8,"rows_kept":38,"merged":[[1,1,1,2]]}
[]
[null,{"$f":"Santrauka!B9","v":"Dalykas 5"}]
[null,"Dėstytojas:",null,null,"Galimų taškų procentinė išraiška",null,null,{"$f":"IF(SUM($C$35:$H$35) <> 0,SUM($C$34:$H$34)/SUM($C$35:$H$35),\"\")","v":""}]
[null,"El. paštas:",null,null,"Dabartinis pažymys",null,null,{"$f":"SUM($C$34:$H$34)","v":{"v":0,"d":"0.00%"}}]
[]
[null,"Užduotys","Namų darbai","Rašiniai","Patikrinimai raštu","Projektai","Semestro vidurio egzaminas","Baigiamasis egzaminas"]
[null,"Svoris",{"v":0.1,"d":"10.0%"},{"v":0.1,"d":"10.0%"},{"v":0.15,"d":"15.0%"},{"v":0.15,"d":"15.0%"},{"v":0.2,"d":"20.0%"},{"v":0.3,"d":"30.0%"}]
{"$rows_empty":26}
[null,"Iš viso taškų",{"$f":"IF(COUNT(C8:C33) <> 0,AVERAGE(C8:C33) *C7, \"\")","v":""},"","","","",""]
[null,"Maksimali įmanoma taškų suma",{"$f":"IF(COUNT(C8:C33)<>0,C7,\"\")","v":""},"","","","",""]
[null,"Galimų taškų procentinė išraiška",null,{"$f":"IF(SUM($C$35:$H$35) <> 0,SUM($C$34:$H$34)/SUM($C$35:$H$35),\"\")","v":""}]
[null,"Įvesti pažymius:","Įveskite gautus taškus virš maksimalaus taškų skaičiaus (pvz., 15/17)."]
[null,null,"Įveskite procentinę gauto pažymio išraišką (pvz., 85%)."]

{"sheet":"Dalykas 6","index":6,"n_rows":38,"n_cols":8,"rows_kept":38,"merged":[[1,1,1,2]]}
[]
[null,{"$f":"Santrauka!B10","v":"Dalykas 6"}]
[null,"Dėstytojas:",null,null,"Galimų taškų procentinė išraiška",null,null,{"$f":"IF(SUM($C$35:$H$35) <> 0,SUM($C$34:$H$34)/SUM($C$35:$H$35),\"\")","v":""}]
[null,"El. paštas:",null,null,"Dabartinis pažymys",null,null,{"$f":"SUM($C$34:$H$34)","v":{"v":0,"d":"0.00%"}}]
[]
[null,"Užduotys","Namų darbai","Rašiniai","Patikrinimai raštu","Projektai","Semestro vidurio egzaminas","Baigiamasis egzaminas"]
[null,"Svoris",{"v":0.1,"d":"10.0%"},{"v":0.1,"d":"10.0%"},{"v":0.15,"d":"15.0%"},{"v":0.15,"d":"15.0%"},{"v":0.2,"d":"20.0%"},{"v":0.3,"d":"30.0%"}]
{"$rows_empty":26}
[null,"Iš viso taškų",{"$f":"IF(COUNT(C8:C33) <> 0,AVERAGE(C8:C33) *C7, \"\")","v":""},"","","","",""]
[null,"Maksimali įmanoma taškų suma",{"$f":"IF(COUNT(C8:C33)<>0,C7,\"\")","v":""},"","","","",""]
[null,"Galimų taškų procentinė išraiška",null,{"$f":"IF(SUM($C$35:$H$35) <> 0,SUM($C$34:$H$34)/SUM($C$35:$H$35),\"\")","v":""},{"$f":"IF(SUM($C$35:$H$35) <> 0,SUM($C$34:$H$34)/SUM($C$35:$H$35),\"\")","v":""}]
[null,"Įvesti pažymius:","Įveskite gautus taškus virš maksimalaus taškų skaičiaus (pvz., 15/17)."]
[null,null,"Įveskite procentinę gauto pažymio išraišką (pvz., 85%)."]

{"sheet":"Dalykas 7","index":7,"n_rows":38,"n_cols":8,"rows_kept":38,"merged":[[1,1,1,2]]}
[]
[null,{"$f":"Santrauka!B11","v":"Dalykas 7"}]
[null,"Dėstytojas:",null,null,"Galimų taškų procentinė išraiška",null,null,{"$f":"IF(SUM($C$35:$H$35) <> 0,SUM($C$34:$H$34)/SUM($C$35:$H$35),\"\")","v":""}]
[null,"El. paštas:",null,null,"Dabartinis pažymys",null,null,{"$f":"SUM($C$34:$H$34)","v":{"v":0,"d":"0.00%"}}]
[]
[null,"Užduotys","Namų darbai","Rašiniai","Patikrinimai raštu","Projektai","Semestro vidurio egzaminas","Baigiamasis egzaminas"]
[null,"Svoris",{"v":0.1,"d":"10.0%"},{"v":0.1,"d":"10.0%"},{"v":0.15,"d":"15.0%"},{"v":0.15,"d":"15.0%"},{"v":0.2,"d":"20.0%"},{"v":0.3,"d":"30.0%"}]
{"$rows_empty":26}
[null,"Iš viso taškų",{"$f":"IF(COUNT(C8:C33) <> 0,AVERAGE(C8:C33) *C7, \"\")","v":""},"","","","",""]
[null,"Maksimali įmanoma taškų suma",{"$f":"IF(COUNT(C8:C33)<>0,C7,\"\")","v":""},"","","","",""]
[null,"Galimų taškų procentinė išraiška",null,{"$f":"IF(SUM($C$35:$H$35) <> 0,SUM($C$34:$H$34)/SUM($C$35:$H$35),\"\")","v":""}]
[null,"Įvesti pažymius:","Įveskite gautus taškus virš maksimalaus taškų skaičiaus (pvz., 15/17)."]
[null,null,"Įveskite procentinę gauto pažymio išraišką (pvz., 85%)."]

{"sheet":"PV lentelė","index":8,"n_rows":7,"n_cols":15,"rows_kept":7}
[]
[]
[]
[null,"Pažymių & PV lentelė"]
[null,"Vidurkis",{"v":0,"d":"0%"},{"v":0.6,"d":"60%"},{"v":0.63,"d":"63%"},{"v":0.67,"d":"67%"},{"v":0.7,"d":"70%"},{"v":0.73,"d":"73%"},{"v":0.77,"d":"77%"},{"v":0.8,"d":"80%"},{"v":0.83,"d":"83%"},{"v":0.87,"d":"87%"},{"v":0.9,"d":"90%"},{"v":0.93,"d":"93%"},{"v":0.97,"d":"97%"}]
[null,"Pažymio raidė","F","D-","D","D+","C-","C","C+","B-","B","B+","A-","A","A+"]
[null,"PV",{"v":0,"d":"0.00"},0.67,{"v":1,"d":"1.00"},1.33,1.67,{"v":2,"d":"2.00"},2.33,2.67,{"v":3,"d":"3.00"},3.33,3.67,{"v":4,"d":"4.00"},{"v":4,"d":"4.00"}]