{"text_format":"3","workbook":"xlsx","n_sheets":2,"sheets":["Darbuotojų grafikas","Savaitės_dienos_peržvalga"],"not_rendered":{"defined_names":27},"read":"whole","date_system":"1900"}

{"sheet":"Darbuotojų grafikas","index":0,"n_rows":36,"n_cols":26,"rows_kept":36,"merged":[[0,1,2,4],[0,5,2,9],[0,10,2,14],[0,15,3,23],[0,24,3,24],[3,1,3,3],[3,5,3,9],[3,10,3,14],[4,1,6,3],[4,4,6,6],[5,14,7,14],[5,22,7,22],[5,23,7,23],[5,24,7,24],[21,1,21,6],[22,1,23,3],[22,4,23,6],[23,14,24,14],[23,22,24,22],[23,23,24,23],[23,24,24,24],[32,1,32,6],[32,24,33,24],[32,25,33,25],[33,1,33,6],[34,1,34,6],[35,1,35,3],[35,4,35,5],[35,6,35,7],[35,8,35,14],[35,15,35,16],[35,17,35,23]]}
[null,"DARBUOTOJŲ GRAFIKAS",{"$nulls":3},"Darbuotojo vardas",{"$nulls":9},"Jei reikalingas leidimas dėl viršvalandžių, \nlangelyje dešinėje pasirinkite Taip"]
[]
[]
[null,"Atlyginimo laikotarpio pabaigos data",null,null,{"$f":"V7","v":"2025-06-14"},"Darbuotojo numeris"]
[null,"ĮPRASTOS VALANDOS:",null,null,"Data:"]
[{"$nulls":14},"Iš viso\n1 savaitė\nĮprastos",{"$nulls":7},"Iš viso\n2 savaitė\nĮprastos","Iš viso\nĮprastos\nValandos","Mokėjimo kodas\ntik atlyginimo\ntikslais"]
[{"$nulls":7},"2025-06-01",{"$f":"Pirma_diena+1","v":"2025-06-02"},{"$f":"Pirma_diena+2","v":"2025-06-03"},{"$f":"Pirma_diena+3","v":"2025-06-04"},{"$f":"Pirma_diena+4","v":"2025-06-05"},{"$f":"Pirma_diena+5","v":"2025-06-06"},{"$f":"Pirma_diena+6","v":"2025-06-07"},null,{"$f":"Pirma_diena+7","v":"2025-06-08"},{"$f":"Pirma_diena+8","v":"2025-06-09"},{"$f":"Pirma_diena+9","v":"2025-06-10"},{"$f":"Pirma_diena+10","v":"2025-06-11"},{"$f":"Pirma_diena+11","v":"2025-06-12"},{"$f":"Pirma_diena+12","v":"2025-06-13"},{"$f":"Pirma_diena+13","v":"2025-06-14"}]
[null,"Užduotis","Vieta","Darbo užsakymo Nr.","Darbo aprašas","Pareigos","Įgaliojimo Nr.",{"$f":"VLOOKUP(WEEKDAY(Pirma_diena),Savaitės_dienos_peržvalga!$B$2:$C$8,2)","v":"Sk"},{"$f":"VLOOKUP(WEEKDAY(I7),Savaitės_dienos_peržvalga!$B$2:$C$8,2)","v":"Pr"},{"$f":"VLOOKUP(WEEKDAY(J7),Savaitės_dienos_peržvalga!$B$2:$C$8,2)","v":"An"},{"$f":"VLOOKUP(WEEKDAY(K7),Savaitės_dienos_peržvalga!$B$2:$C$8,2)","v":"Tr"},{"$f":"VLOOKUP(WEEKDAY(L7),Savaitės_dienos_peržvalga!$B$2:$C$8,2)","v":"Kt"},{"$f":"VLOOKUP(WEEKDAY(M7),Savaitės_dienos_peržvalga!$B$2:$C$8,2)","v":"Pn"},{"$f":"VLOOKUP(WEEKDAY(N7),Savaitės_dienos_peržvalga!$B$2:$C$8,2)","v":"Št"},null,{"$f":"VLOOKUP(WEEKDAY(P7),Savaitės_dienos_peržvalga!$B$2:$C$8,2)","v":"Sk"},{"$f":"VLOOKUP(WEEKDAY(Q7),Savaitės_dienos_peržvalga!$B$2:$C$8,2)","v":"Pr"},{"$f":"VLOOKUP(WEEKDAY(R7),Savaitės_dienos_peržvalga!$B$2:$C$8,2)","v":"An"},{"$f":"VLOOKUP(WEEKDAY(S7),Savaitės_dienos_peržvalga!$B$2:$C$8,2)","v":"Tr"},{"$f":"VLOOKUP(WEEKDAY(T7),Savaitės_dienos_peržvalga!$B$2:$C$8,2)","v":"Kt"},{"$f":"VLOOKUP(WEEKDAY(U7),Savaitės_dienos_peržvalga!$B$2:$C$8,2)","v":"Pn"},{"$f":"VLOOKUP(WEEKDAY(V7),Savaitės_dienos_peržvalga!$B$2:$C$8,2)","v":"Št"}]
[{"$nulls":14},{"$f":"SUM(H9:N9)","v":{"v":0,"d":"0.00"}},{"$nulls":7},{"$f":"SUM(P9:V9)","v":{"v":0,"d":"0.00"}},{"$f":"O9+W9","v":{"v":0,"d":"0.00"}}]
[{"$nulls":14},{"v":0,"d":"0.00"},{"$nulls":7},{"v":0,"d":"0.00"},{"v":0,"d":"0.00"}]
[{"$nulls":14},{"v":0,"d":"0.00"},{"$nulls":7},{"v":0,"d":"0.00"},{"v":0,"d":"0.00"}]
[{"$nulls":14},{"v":0,"d":"0.00"},{"$nulls":7},{"v":0,"d":"0.00"},{"v":0,"d":"0.00"}]
[{"$nulls":14},{"v":0,"d":"0.00"},{"$nulls":7},{"v":0,"d":"0.00"},{"v":0,"d":"0.00"}]
[{"$nulls":14},{"v":0,"d":"0.00"},{"$nulls":7},{"v":0,"d":"0.00"},{"v":0,"d":"0.00"}]
[{"$nulls":14},{"v":0,"d":"0.00"},{"$nulls":7},{"v":0,"d":"0.00"},{"v":0,"d":"0.00"}]
[{"$nulls":14},{"$f":"SUM(H16:N16)","v":{"v":0,"d":"0.00"}},{"$nulls":7},{"$f":"SUM(P16:V16)","v":{"v":0,"d":"0.00"}},{"$f":"O16+W16","v":{"v":0,"d":"0.00"}}]
[{"$nulls":14},{"v":0,"d":"0.00"},{"$nulls":7},{"v":0,"d":"0.00"},{"v":0,"d":"0.00"}]
[{"$nulls":14},{"v":0,"d":"0.00"},{"$nulls":7},{"v":0,"d":"0.00"},{"v":0,"d":"0.00"}]
[{"$nulls":14},{"v":0,"d":"0.00"},{"$nulls":7},{"v":0,"d":"0.00"},{"v":0,"d":"0.00"}]
[{"$nulls":14},{"v":0,"d":"0.00"},{"$nulls":7},{"v":0,"d":"0.00"},{"v":0,"d":"0.00"}]
[{"$nulls":14},{"v":0,"d":"0.00"},{"$nulls":7},{"v":0,"d":"0.00"},{"v":0,"d":"0.00"}]
[null,"Įprastų valandų suma   ",{"$nulls":5},{"$f":"SUM(H9:H21)","v":{"v":0,"d":"0.00"}},{"v":0,"d":"0.00"},{"v":0,"d":"0.00"},{"v":0,"d":"0.00"},{"v":0,"d":"0.00"},{"v":0,"d":"0.00"},{"v":0,"d":"0.00"},{"v":0,"d":"0.00"},{"v":0,"d":"0.00"},{"$f":"SUM(Q9:Q21)","v":{"v":0,"d":"0.00"}},{"v":0,"d":"0.00"},{"v":0,"d":"0.00"},{"v":0,"d":"0.00"},{"v":0,"d":"0.00"},{"v":0,"d":"0.00"},{"$f":"SUM(W9:W21)","v":{"v":0,"d":"0.00"}},{"$f":"SUM(X9:X21)","v":{"v":0,"d":"0.00"}}]
[null,"VIRŠVALANDŽIAI:",null,null,"Data:"]
[{"$nulls":7},{"$f":"Pirma_diena","v":"2025-06-01"},{"$f":"Pirma_diena+1","v":"2025-06-02"},{"$f":"Pirma_diena+2","v":"2025-06-03"},{"$f":"Pirma_diena+3","v":"2025-06-04"},{"$f":"Pirma_diena+4","v":"2025-06-05"},{"$f":"Pirma_diena+5","v":"2025-06-06"},{"$f":"Pirma_diena+6","v":"2025-06-07"},"1 savaitės viršvalandžiai",{"$f":"Pirma_diena+7","v":"2025-06-08"},{"$f":"Pirma_diena+8","v":"2025-06-09"},{"$f":"Pirma_diena+9","v":"2025-06-10"},{"$f":"Pirma_diena+10","v":"2025-06-11"},{"$f":"Pirma_diena+11","v":"2025-06-12"},{"$f":"Pirma_diena+12","v":"2025-06-13"},{"$f":"Pirma_diena+13","v":"2025-06-14"},"2 savaitės viršvalandžiai","Bendra viršvalandžių suma","Viršvalandžiai\nKodas"]
[null,"Užduotis","Vieta","Darbo užsakymo Nr.","Darbo aprašas","Pareigos","Įgaliojimo Nr.",{"$f":"VLOOKUP(WEEKDAY(Pirma_diena),Savaitės_dienos_peržvalga!$B$2:$C$8,2)","v":"Sk"},{"$f":"VLOOKUP(WEEKDAY(I24),Savaitės_dienos_peržvalga!$B$2:$C$8,2)","v":"Pr"},{"$f":"VLOOKUP(WEEKDAY(J24),Savaitės_dienos_peržvalga!$B$2:$C$8,2)","v":"An"},{"$f":"VLOOKUP(WEEKDAY(K24),Savaitės_dienos_peržvalga!$B$2:$C$8,2)","v":"Tr"},{"$f":"VLOOKUP(WEEKDAY(L24),Savaitės_dienos_peržvalga!$B$2:$C$8,2)","v":"Kt"},{"$f":"VLOOKUP(WEEKDAY(M24),Savaitės_dienos_peržvalga!$B$2:$C$8,2)","v":"Pn"},{"$f":"VLOOKUP(WEEKDAY(N24),Savaitės_dienos_peržvalga!$B$2:$C$8,2)","v":"Št"},null,{"$f":"VLOOKUP(WEEKDAY(P24),Savaitės_dienos_peržvalga!$B$2:$C$8,2)","v":"Sk"},{"$f":"VLOOKUP(WEEKDAY(Q24),Savaitės_dienos_peržvalga!$B$2:$C$8,2)","v":"Pr"},{"$f":"VLOOKUP(WEEKDAY(R24),Savaitės_dienos_peržvalga!$B$2:$C$8,2)","v":"An"},{"$f":"VLOOKUP(WEEKDAY(S24),Savaitės_dienos_peržvalga!$B$2:$C$8,2)","v":"Tr"},{"$f":"VLOOKUP(WEEKDAY(T24),Savaitės_dienos_peržvalga!$B$2:$C$8,2)","v":"Kt"},{"$f":"VLOOKUP(WEEKDAY(U24),Savaitės_dienos_peržvalga!$B$2:$C$8,2)","v":"Pn"},{"$f":"VLOOKUP(WEEKDAY(V24),Savaitės_dienos_peržvalga!$B$2:$C$8,2)","v":"Št"}]
[{"$nulls":14},{"$f":"SUM(H26:N26)","v":{"v":0,"d":"0.00"}},{"$nulls":7},{"$f":"SUM(P26:V26)","v":{"v":0,"d":"0.00"}},{"$f":"O26+W26","v":{"v":0,"d":"0.00"}}]
[{"$nulls":14},{"v":0,"d":"0.00"},{"$nulls":7},{"v":0,"d":"0.00"},{"v":0,"d":"0.00"}]
[{"$nulls":14},{"v":0,"d":"0.00"},{"$nulls":7},{"v":0,"d":"0.00"},{"v":0,"d":"0.00"}]
[{"$nulls":14},{"v":0,"d":"0.00"},{"$nulls":7},{"v":0,"d":"0.00"},{"v":0,"d":"0.00"}]
[{"$nulls":14},{"v":0,"d":"0.00"},{"$nulls":7},{"v":0,"d":"0.00"},{"v":0,"d":"0.00"}]
[{"$nulls":14},{"v":0,"d":"0.00"},{"$nulls":7},{"v":0,"d":"0.00"},{"v":0,"d":"0.00"}]
[{"$nulls":14},{"v":0,"d":"0.00"},{"$nulls":7},{"v":0,"d":"0.00"},{"v":0,"d":"0.00"}]
[null,"Dirbtų viršvalandžių suma     ",{"$nulls":5},{"$f":"SUM(H26:H32)","v":{"v":0,"d":"0.00"}},{"v":0,"d":"0.00"},{"v":0,"d":"0.00"},{"v":0,"d":"0.00"},{"v":0,"d":"0.00"},{"v":0,"d":"0.00"},{"v":0,"d":"0.00"},{"$f":"SUM(O26:O32)","v":{"v":0,"d":"0.00"}},{"v":0,"d":"0.00"},{"v":0,"d":"0.00"},{"v":0,"d":"0.00"},{"v":0,"d":"0.00"},{"v":0,"d":"0.00"},{"v":0,"d":"0.00"},{"v":0,"d":"0.00"},{"v":0,"d":"0.00"},{"$f":"SUM(X26:X32)","v":{"v":0,"d":"0.00"}},"Bendras dirbtų\nvalandų skaičius","Bendras apmokėtų\nvalandų skaičius"]
[null,"Apmokėjimas už viršvalandžius     ",{"$nulls":12},{"$f":"IF(SUM(H34:N34)<=O33,SUM(H34:N34),O33)","v":{"v":0,"d":"0.00"}},{"$nulls":7},{"$f":"IF(SUM(P34:V34)<=W33,SUM(P34:V34),W33)","v":{"v":0,"d":"0.00"}},{"$f":"IF(SUM(Q34:W34)<=X33,SUM(Q34:W34),X33)","v":{"v":0,"d":"0.00"}}]
[null,"Sumokėta už viršvalandžius     ",{"$nulls":5},{"$f":"IF(H33>=H34,H33-H34,H33)","v":{"v":0,"d":"0.00"}},{"$f":"IF(I33>=I34,I33-I34,I33)","v":{"v":0,"d":"0.00"}},{"v":0,"d":"0.00"},{"v":0,"d":"0.00"},{"v":0,"d":"0.00"},{"v":0,"d":"0.00"},{"v":0,"d":"0.00"},{"v":0,"d":"0.00"},{"v":0,"d":"0.00"},{"v":0,"d":"0.00"},{"v":0,"d":"0.00"},{"v":0,"d":"0.00"},{"v":0,"d":"0.00"},{"v":0,"d":"0.00"},{"v":0,"d":"0.00"},{"$f":"IF(W33>=W34,W33-W34,W33)","v":{"v":0,"d":"0.00"}},{"$f":"IF(X33>=X34,X33-X34,X33)","v":{"v":0,"d":"0.00"}},{"$f":"$X$22+$X$33","v":{"v":0,"d":"0.00"}},{"$f":"X22+X35","v":{"v":0,"d":"0.00"}}]
[null,"Darbuotojas ",{"$nulls":4},"Prižiūrėtojas: ",{"$nulls":8},"Prižiūrėtojas: "]

{"sheet":"Savaitės_dienos_peržvalga","index":1,"n_rows":8,"n_cols":3,"rows_kept":8}
[null,"Savaitės diena\nSveikasis skaičius","Savaitės diena\nInicialai"]
[null,1,"Sk"]
[null,2,"Pr"]
[null,3,"An"]
[null,4,"Tr"]
[null,5,"Kt"]
[null,6,"Pn"]
[null,7,"Št"]