{"text_format":"3","workbook":"xlsx","n_sheets":4,"sheets":["시작","프로젝트 매개 변수","프로젝트 세부 정보","프로젝트 합계"],"not_rendered":{"charts":2,"defined_names":3,"pivot_tables":1},"read":"whole","date_system":"1900"}

{"sheet":"시작","index":0,"n_rows":7,"n_cols":2,"rows_kept":7}
[null,"이 서식 파일 정보"]
[null,"이 이벤트 계획 관리 통합 문서에서 프로젝트 매개 변수, 프로젝트 세부 정보 및 프로젝트 전체를 추적합니다."]
[null,"세로 막대형 차트를 업데이트 하려면 프로젝트 매개 변수 워크시트에 정보를 입력하고 프로젝트 세부 정보 워크시트에도 정보를 입력합니다. 프로젝트의 전체 워크시트에서 피벗 테이블은 자동으로 업데이트됩니다."]
[null,"매개 변수 워크시트에 회사 이름을 입력하면 다른 워크시트에서 자동으로 업데이트됩니다."]
[null,"참고:  "]
[null,"추가적인 지침은 이벤트 계획 관리 통합 문서의 각 워크시트 A열에 있습니다. 이 텍스트는 일부러 숨겨 놓았습니다. 텍스트를 제거하려면 A열을 선택한 다음 [삭제]를 선택합니다. 텍스트를 표시하려면 A열을 선택한 다음 글꼴 색상을 변경합니다."]
[null,"워크시트에 있는 표에 대해 자세히 알아보려면 표 안에서 SHIFT 키를 누른 채 F10 키를 누르고 [표] 옵션을 선택한 다음, [대체 텍스트]를 선택합니다."]

{"sheet":"프로젝트 매개 변수","index":1,"n_rows":19,"n_cols":9,"rows_kept":19,"merged":[[23,1,42,3]]}
[null,"회사 이름"]
[null,"이벤트 관리 프로젝트 관리표"]
[null,{"$f":"B1&\" 기밀\"","v":"회사 이름 기밀"}]
[null,"음영 처리된 셀은 자동으로 계산됩니다. 회식 셀에는 데이터를 입력할 필요가 없습니다."]
[null,"프로젝트 유형","계정 관리자","프로젝트 관리자","전략 관리자","디자인 전문가","이벤트 인력","관리 인력","합계"]
[null,"이벤트 전략 개발",{"v":0.2,"d":"20%"},{"v":0.1,"d":"10%"},{"v":0.6,"d":"60%"},{"v":0,"d":"0%"},{"v":0,"d":"0%"},{"v":0.1,"d":"10%"},{"$f":"SUM(매개_변수[[#This Row],[계정 관리자]:[관리 인력]])","v":{"v":1,"d":"100%"}}]
[null,"이벤트 계획",{"v":0.2,"d":"20%"},{"v":0.5,"d":"50%"},{"v":0.1,"d":"10%"},{"v":0.1,"d":"10%"},{"v":0,"d":"0%"},{"v":0.1,"d":"10%"},{"$f":"SUM(매개_변수[[#This Row],[계정 관리자]:[관리 인력]])","v":{"v":0.9999999999999999,"d":"100%"}}]
[null,"이벤트 디자인",{"v":0.2,"d":"20%"},{"v":0.2,"d":"20%"},{"v":0,"d":"0%"},{"v":0.5,"d":"50%"},{"v":0,"d":"0%"},{"v":0.1,"d":"10%"},{"$f":"SUM(매개_변수[[#This Row],[계정 관리자]:[관리 인력]])","v":{"v":1,"d":"100%"}}]
[null,"이벤트 세부 계획",{"v":0.2,"d":"20%"},{"v":0.6,"d":"60%"},{"v":0,"d":"0%"},{"v":0,"d":"0%"},{"v":0.1,"d":"10%"},{"v":0.1,"d":"10%"},{"$f":"SUM(매개_변수[[#This Row],[계정 관리자]:[관리 인력]])","v":{"v":1,"d":"100%"}}]
[null,"이벤트 인력 관리",{"v":0.2,"d":"20%"},{"v":0.1,"d":"10%"},{"v":0,"d":"0%"},{"v":0,"d":"0%"},{"v":0.6,"d":"60%"},{"v":0.1,"d":"10%"},{"$f":"SUM(매개_변수[[#This Row],[계정 관리자]:[관리 인력]])","v":{"v":1,"d":"100%"}}]
{"$rows_left_out":10}
{"sheet":"프로젝트 세부 정보","index":2,"n_rows":10,"n_cols":23,"rows_kept":10}
[null,{"$f":"'프로젝트 매개 변수'!B1","v":"회사 이름"}]
[null,"이벤트 관리 프로젝트 관리표"]
[null,{"$f":"'프로젝트 매개 변수'!B3","v":"회사 이름 기밀"}]
["오른쪽 셀에서 시작되는 프로젝트 세부 정보 테이블에 정보를 입력 합니다.\n정보\n오른쪽에 테이블에 행을 추가하려면 표 안의 가장 오른쪽 아래 셀(합계 행 아님)을 선택하고 행을 삽입하고 싶은 위치에서 Tab 키를 누르거나 SHIFT + F10을 눌르고 삽입 | 표 행 위/아래를 선택합니다.\n프로젝트 전체 피벗테이블이 표의 모든 셀을 사용할 것이므로 사용하지 않는 행은 모두 지우십시오. 그렇지 않으면 오류 있는 결과가 발생할 수 있습니다.","프로젝트 이름","프로젝트 유형","예상 시작","예상 완료","실제 시작","실제 완료","예상 작업","실제 작업","예상 기간","실제 기간","계정 관리자","프로젝트 관리자","전략 관리자","디자인 전문가","이벤트 인력","관리 인력","계정 관리자 ","프로젝트 관리자 ","전략 관리자 ","디자인 전문가 ","이벤트 인력 ","관리 인력 "]
[null,"프로젝트 1","이벤트 전략 개발",{"$f":"DATE(YEAR(TODAY()),6,9)","v":"2022-06-09"},{"$f":" DATE(YEAR(TODAY()),8,7)","v":"2022-08-07"},{"$f":"DATE(YEAR(TODAY()),6,29)","v":"2022-06-29"},{"$f":"DATE(YEAR(TODAY()),9,3)","v":"2022-09-03"},200,220,{"$f":"DAYS360(ProjectDetails[[#This Row],[예상 시작]],ProjectDetails[[#This Row],[예상 완료]],FALSE)","v":58},{"$f":"DAYS360(ProjectDetails[[#This Row],[실제 시작]],ProjectDetails[[#This Row],[실제 완료]],FALSE)","v":64},{"$f":"INDEX(매개_변수[],MATCH(ProjectDetails[[#This Row],[프로젝트 유형]],매개_변수[프로젝트 유형],0),MATCH(ProjectDetails[[#Headers],[계정 관리자]],매개_변수[#Headers],0))*INDEX('프로젝트 매개 변수'!$B$12:$H$12,1,MATCH(ProjectDetails[[#Headers],[계정 관리자]],매개_변수[#Headers],0))*ProjectDetails[[#This Row],[예상 작업]]","v":{"v":7200,"d":"₩7,200"}},{"$f":"INDEX(매개_변수[],MATCH(ProjectDetails[[#This Row],[프로젝트 유형]],매개_변수[프로젝트 유형],0),MATCH(ProjectDetails[[#Headers],[프로젝트 관리자]],매개_변수[#Headers],0))*INDEX('프로젝트 매개 변수'!$B$12:$H$12,1,MATCH(ProjectDetails[[#Headers],[프로젝트 관리자]],매개_변수[#Headers],0))*ProjectDetails[[#This Row],[예상 작업]]","v":{"v":2400,"d":"₩2,400"}},{"$f":"INDEX(매개_변수[],MATCH(ProjectDetails[[#This Row],[프로젝트 유형]],매개_변수[프로젝트 유형],0),MATCH(ProjectDetails[[#Headers],[전략 관리자]],매개_변수[#Headers],0))*INDEX('프로젝트 매개 변수'!$B$12:$H$12,1,MATCH(ProjectDetails[[#Headers],[전략 관리자]],매개_변수[#Headers],0))*ProjectDetails[[#This Row],[예상 작업]]","v":{"v":18000,"d":"₩18,000"}},{"$f":"INDEX(매개_변수[],MATCH(ProjectDetails[[#This Row],[프로젝트 유형]],매개_변수[프로젝트 유형],0),MATCH(ProjectDetails[[#Headers],[디자인 전문가]],매개_변수[#Headers],0))*INDEX('프로젝트 매개 변수'!$B$12:$H$12,1,MATCH(ProjectDetails[[#Headers],[디자인 전문가]],매개_변수[#Headers],0))*ProjectDetails[[#This Row],[예상 작업]]","v":{"v":0,"d":"₩0"}},{"$f":"INDEX(매개_변수[],MATCH(ProjectDetails[[#This Row],[프로젝트 유형]],매개_변수[프로젝트 유형],0),MATCH(ProjectDetails[[#Headers],[이벤트 인력]],매개_변수[#Headers],0))*INDEX('프로젝트 매개 변수'!$B$12:$H$12,1,MATCH(ProjectDetails[[#Headers],[이벤트 인력]],매개_변수[#Headers],0))*ProjectDetails[[#This Row],[예상 작업]]","v":{"v":0,"d":"₩0"}},{"$f":"INDEX(매개_변수[],MATCH(ProjectDetails[[#This Row],[프로젝트 유형]],매개_변수[프로젝트 유형],0),MATCH(ProjectDetails[[#Headers],[관리 인력]],매개_변수[#Headers],0))*INDEX('프로젝트 매개 변수'!$B$12:$H$12,1,MATCH(ProjectDetails[[#Headers],[관리 인력]],매개_변수[#Headers],0))*ProjectDetails[[#This Row],[예상 작업]]","v":{"v":1200,"d":"₩1,200"}},{"$f":"INDEX(매개_변수[],MATCH(ProjectDetails[[#This Row],[프로젝트 유형]],매개_변수[프로젝트 유형],0),MATCH(ProjectDetails[[#Headers],[계정 관리자]],매개_변수[#Headers],0))*INDEX('프로젝트 매개 변수'!$B$12:$H$12,1,MATCH(ProjectDetails[[#Headers],[계정 관리자]],매개_변수[#Headers],0))*ProjectDetails[[#This Row],[실제 작업]]","v":{"v":7920,"d":"₩7,920"}},{"$f":"INDEX(매개_변수[],MATCH(ProjectDetails[[#This Row],[프로젝트 유형]],매개_변수[프로젝트 유형],0),MATCH(ProjectDetails[[#Headers],[프로젝트 관리자]],매개_변수[#Headers],0))*INDEX('프로젝트 매개 변수'!$B$12:$H$12,1,MATCH(ProjectDetails[[#Headers],[프로젝트 관리자]],매개_변수[#Headers],0))*ProjectDetails[[#This Row],[실제 작업]]","v":{"v":2640,"d":"₩2,640"}},{"$f":"INDEX(매개_변수[],MATCH(ProjectDetails[[#This Row],[프로젝트 유형]],매개_변수[프로젝트 유형],0),MATCH(ProjectDetails[[#Headers],[전략 관리자]],매개_변수[#Headers],0))*INDEX('프로젝트 매개 변수'!$B$12:$H$12,1,MATCH(ProjectDetails[[#Headers],[전략 관리자]],매개_변수[#Headers],0))*ProjectDetails[[#This Row],[실제 작업]]","v":{"v":19800,"d":"₩19,800"}},{"$f":"INDEX(매개_변수[],MATCH(ProjectDetails[[#This Row],[프로젝트 유형]],매개_변수[프로젝트 유형],0),MATCH(ProjectDetails[[#Headers],[디자인 전문가]],매개_변수[#Headers],0))*INDEX('프로젝트 매개 변수'!$B$12:$H$12,1,MATCH(ProjectDetails[[#Headers],[디자인 전문가]],매개_변수[#Headers],0))*ProjectDetails[[#This Row],[실제 작업]]","v":{"v":0,"d":"₩0"}},{"$f":"INDEX(매개_변수[],MATCH(ProjectDetails[[#This Row],[프로젝트 유형]],매개_변수[프로젝트 유형],0),MATCH(ProjectDetails[[#Headers],[이벤트 인력]],매개_변수[#Headers],0))*INDEX('프로젝트 매개 변수'!$B$12:$H$12,1,MATCH(ProjectDetails[[#Headers],[이벤트 인력]],매개_변수[#Headers],0))*ProjectDetails[[#This Row],[실제 작업]]","v":{"v":0,"d":"₩0"}},{"$f":"INDEX(매개_변수[],MATCH(ProjectDetails[[#This Row],[프로젝트 유형]],매개_변수[프로젝트 유형],0),MATCH(ProjectDetails[[#Headers],[관리 인력]],매개_변수[#Headers],0))*INDEX('프로젝트 매개 변수'!$B$12:$H$12,1,MATCH(ProjectDetails[[#Headers],[관리 인력]],매개_변수[#Headers],0))*ProjectDetails[[#This Row],[실제 작업]]","v":{"v":1320,"d":"₩1,320"}}]
[null,"프로젝트 2","이벤트 계획",{"$f":"DATE(YEAR(TODAY())+1,6,25)","v":"2023-06-25"},{"$f":"DATE(YEAR(TODAY())+1,7,27)","v":"2023-07-27"},{"$f":"DATE(YEAR(TODAY()),7,15)","v":"2022-07-15"},{"$f":"DATE(YEAR(TODAY())+1,8,25)","v":"2023-08-25"},400,390,{"$f":"DAYS360(ProjectDetails[[#This Row],[예상 시작]],ProjectDetails[[#This Row],[예상 완료]],FALSE)","v":32},{"$f":"DAYS360(ProjectDetails[[#This Row],[실제 시작]],ProjectDetails[[#This Row],[실제 완료]],FALSE)","v":400},{"$f":"INDEX(매개_변수[],MATCH(ProjectDetails[[#This Row],[프로젝트 유형]],매개_변수[프로젝트 유형],0),MATCH(ProjectDetails[[#Headers],[계정 관리자]],매개_변수[#Headers],0))*INDEX('프로젝트 매개 변수'!$B$12:$H$12,1,MATCH(ProjectDetails[[#Headers],[계정 관리자]],매개_변수[#Headers],0))*ProjectDetails[[#This Row],[예상 작업]]","v":{"v":14400,"d":"₩14,400"}},{"$f":"INDEX(매개_변수[],MATCH(ProjectDetails[[#This Row],[프로젝트 유형]],매개_변수[프로젝트 유형],0),MATCH(ProjectDetails[[#Headers],[프로젝트 관리자]],매개_변수[#Headers],0))*INDEX('프로젝트 매개 변수'!$B$12:$H$12,1,MATCH(ProjectDetails[[#Headers],[프로젝트 관리자]],매개_변수[#Headers],0))*ProjectDetails[[#This Row],[예상 작업]]","v":{"v":24000,"d":"₩24,000"}},{"$f":"INDEX(매개_변수[],MATCH(ProjectDetails[[#This Row],[프로젝트 유형]],매개_변수[프로젝트 유형],0),MATCH(ProjectDetails[[#Headers],[전략 관리자]],매개_변수[#Headers],0))*INDEX('프로젝트 매개 변수'!$B$12:$H$12,1,MATCH(ProjectDetails[[#Headers],[전략 관리자]],매개_변수[#Headers],0))*ProjectDetails[[#This Row],[예상 작업]]","v":{"v":6000,"d":"₩6,000"}},{"$f":"INDEX(매개_변수[],MATCH(ProjectDetails[[#This Row],[프로젝트 유형]],매개_변수[프로젝트 유형],0),MATCH(ProjectDetails[[#Headers],[디자인 전문가]],매개_변수[#Headers],0))*INDEX('프로젝트 매개 변수'!$B$12:$H$12,1,MATCH(ProjectDetails[[#Headers],[디자인 전문가]],매개_변수[#Headers],0))*ProjectDetails[[#This Row],[예상 작업]]","v":{"v":4000,"d":"₩4,000"}},{"$f":"INDEX(매개_변수[],MATCH(ProjectDetails[[#This Row],[프로젝트 유형]],매개_변수[프로젝트 유형],0),MATCH(ProjectDetails[[#Headers],[이벤트 인력]],매개_변수[#Headers],0))*INDEX('프로젝트 매개 변수'!$B$12:$H$12,1,MATCH(ProjectDetails[[#Headers],[이벤트 인력]],매개_변수[#Headers],0))*ProjectDetails[[#This Row],[예상 작업]]","v":{"v":0,"d":"₩0"}},{"$f":"INDEX(매개_변수[],MATCH(ProjectDetails[[#This Row],[프로젝트 유형]],매개_변수[프로젝트 유형],0),MATCH(ProjectDetails[[#Headers],[관리 인력]],매개_변수[#Headers],0))*INDEX('프로젝트 매개 변수'!$B$12:$H$12,1,MATCH(ProjectDetails[[#Headers],[관리 인력]],매개_변수[#Headers],0))*ProjectDetails[[#This Row],[예상 작업]]","v":{"v":2400,"d":"₩2,400"}},{"$f":"INDEX(매개_변수[],MATCH(ProjectDetails[[#This Row],[프로젝트 유형]],매개_변수[프로젝트 유형],0),MATCH(ProjectDetails[[#Headers],[계정 관리자]],매개_변수[#Headers],0))*INDEX('프로젝트 매개 변수'!$B$12:$H$12,1,MATCH(ProjectDetails[[#Headers],[계정 관리자]],매개_변수[#Headers],0))*ProjectDetails[[#This Row],[실제 작업]]","v":{"v":14040,"d":"₩14,040"}},{"$f":"INDEX(매개_변수[],MATCH(ProjectDetails[[#This Row],[프로젝트 유형]],매개_변수[프로젝트 유형],0),MATCH(ProjectDetails[[#Headers],[프로젝트 관리자]],매개_변수[#Headers],0))*INDEX('프로젝트 매개 변수'!$B$12:$H$12,1,MATCH(ProjectDetails[[#Headers],[프로젝트 관리자]],매개_변수[#Headers],0))*ProjectDetails[[#This Row],[실제 작업]]","v":{"v":23400,"d":"₩23,400"}},{"$f":"INDEX(매개_변수[],MATCH(ProjectDetails[[#This Row],[프로젝트 유형]],매개_변수[프로젝트 유형],0),MATCH(ProjectDetails[[#Headers],[전략 관리자]],매개_변수[#Headers],0))*INDEX('프로젝트 매개 변수'!$B$12:$H$12,1,MATCH(ProjectDetails[[#Headers],[전략 관리자]],매개_변수[#Headers],0))*ProjectDetails[[#This Row],[실제 작업]]","v":{"v":5850,"d":"₩5,850"}},{"$f":"INDEX(매개_변수[],MATCH(ProjectDetails[[#This Row],[프로젝트 유형]],매개_변수[프로젝트 유형],0),MATCH(ProjectDetails[[#Headers],[디자인 전문가]],매개_변수[#Headers],0))*INDEX('프로젝트 매개 변수'!$B$12:$H$12,1,MATCH(ProjectDetails[[#Headers],[디자인 전문가]],매개_변수[#Headers],0))*ProjectDetails[[#This Row],[실제 작업]]","v":{"v":3900,"d":"₩3,900"}},{"$f":"INDEX(매개_변수[],MATCH(ProjectDetails[[#This Row],[프로젝트 유형]],매개_변수[프로젝트 유형],0),MATCH(ProjectDetails[[#Headers],[이벤트 인력]],매개_변수[#Headers],0))*INDEX('프로젝트 매개 변수'!$B$12:$H$12,1,MATCH(ProjectDetails[[#Headers],[이벤트 인력]],매개_변수[#Headers],0))*ProjectDetails[[#This Row],[실제 작업]]","v":{"v":0,"d":"₩0"}},{"$f":"INDEX(매개_변수[],MATCH(ProjectDetails[[#This Row],[프로젝트 유형]],매개_변수[프로젝트 유형],0),MATCH(ProjectDetails[[#Headers],[관리 인력]],매개_변수[#Headers],0))*INDEX('프로젝트 매개 변수'!$B$12:$H$12,1,MATCH(ProjectDetails[[#Headers],[관리 인력]],매개_변수[#Headers],0))*ProjectDetails[[#This Row],[실제 작업]]","v":{"v":2340,"d":"₩2,340"}}]
[null,"프로젝트 3","이벤트 디자인",{"$f":"DATE(YEAR(TODAY())+2,7,12)","v":"2024-07-12"},{"$f":"DATE(YEAR(TODAY())+2,9,19)","v":"2024-09-19"},"2025-08-07","2025-10-10",500,500,{"$f":"DAYS360(ProjectDetails[[#This Row],[예상 시작]],ProjectDetails[[#This Row],[예상 완료]],FALSE)","v":67},{"$f":"DAYS360(ProjectDetails[[#This Row],[실제 시작]],ProjectDetails[[#This Row],[실제 완료]],FALSE)","v":63},{"$f":"INDEX(매개_변수[],MATCH(ProjectDetails[[#This Row],[프로젝트 유형]],매개_변수[프로젝트 유형],0),MATCH(ProjectDetails[[#Headers],[계정 관리자]],매개_변수[#Headers],0))*INDEX('프로젝트 매개 변수'!$B$12:$H$12,1,MATCH(ProjectDetails[[#Headers],[계정 관리자]],매개_변수[#Headers],0))*ProjectDetails[[#This Row],[예상 작업]]","v":{"v":18000,"d":"₩18,000"}},{"$f":"INDEX(매개_변수[],MATCH(ProjectDetails[[#This Row],[프로젝트 유형]],매개_변수[프로젝트 유형],0),MATCH(ProjectDetails[[#Headers],[프로젝트 관리자]],매개_변수[#Headers],0))*INDEX('프로젝트 매개 변수'!$B$12:$H$12,1,MATCH(ProjectDetails[[#Headers],[프로젝트 관리자]],매개_변수[#Headers],0))*ProjectDetails[[#This Row],[예상 작업]]","v":{"v":12000,"d":"₩12,000"}},{"$f":"INDEX(매개_변수[],MATCH(ProjectDetails[[#This Row],[프로젝트 유형]],매개_변수[프로젝트 유형],0),MATCH(ProjectDetails[[#Headers],[전략 관리자]],매개_변수[#Headers],0))*INDEX('프로젝트 매개 변수'!$B$12:$H$12,1,MATCH(ProjectDetails[[#Headers],[전략 관리자]],매개_변수[#Headers],0))*ProjectDetails[[#This Row],[예상 작업]]","v":{"v":0,"d":"₩0"}},{"$f":"INDEX(매개_변수[],MATCH(ProjectDetails[[#This Row],[프로젝트 유형]],매개_변수[프로젝트 유형],0),MATCH(ProjectDetails[[#Headers],[디자인 전문가]],매개_변수[#Headers],0))*INDEX('프로젝트 매개 변수'!$B$12:$H$12,1,MATCH(ProjectDetails[[#Headers],[디자인 전문가]],매개_변수[#Headers],0))*ProjectDetails[[#This Row],[예상 작업]]","v":{"v":25000,"d":"₩25,000"}},{"$f":"INDEX(매개_변수[],MATCH(ProjectDetails[[#This Row],[프로젝트 유형]],매개_변수[프로젝트 유형],0),MATCH(ProjectDetails[[#Headers],[이벤트 인력]],매개_변수[#Headers],0))*INDEX('프로젝트 매개 변수'!$B$12:$H$12,1,MATCH(ProjectDetails[[#Headers],[이벤트 인력]],매개_변수[#Headers],0))*ProjectDetails[[#This Row],[예상 작업]]","v":{"v":0,"d":"₩0"}},{"$f":"INDEX(매개_변수[],MATCH(ProjectDetails[[#This Row],[프로젝트 유형]],매개_변수[프로젝트 유형],0),MATCH(ProjectDetails[[#Headers],[관리 인력]],매개_변수[#Headers],0))*INDEX('프로젝트 매개 변수'!$B$12:$H$12,1,MATCH(ProjectDetails[[#Headers],[관리 인력]],매개_변수[#Headers],0))*ProjectDetails[[#This Row],[예상 작업]]","v":{"v":3000,"d":"₩3,000"}},{"$f":"INDEX(매개_변수[],MATCH(ProjectDetails[[#This Row],[프로젝트 유형]],매개_변수[프로젝트 유형],0),MATCH(ProjectDetails[[#Headers],[계정 관리자]],매개_변수[#Headers],0))*INDEX('프로젝트 매개 변수'!$B$12:$H$12,1,MATCH(ProjectDetails[[#Headers],[계정 관리자]],매개_변수[#Headers],0))*ProjectDetails[[#This Row],[실제 작업]]","v":{"v":18000,"d":"₩18,000"}},{"$f":"INDEX(매개_변수[],MATCH(ProjectDetails[[#This Row],[프로젝트 유형]],매개_변수[프로젝트 유형],0),MATCH(ProjectDetails[[#Headers],[프로젝트 관리자]],매개_변수[#Headers],0))*INDEX('프로젝트 매개 변수'!$B$12:$H$12,1,MATCH(ProjectDetails[[#Headers],[프로젝트 관리자]],매개_변수[#Headers],0))*ProjectDetails[[#This Row],[실제 작업]]","v":{"v":12000,"d":"₩12,000"}},{"$f":"INDEX(매개_변수[],MATCH(ProjectDetails[[#This Row],[프로젝트 유형]],매개_변수[프로젝트 유형],0),MATCH(ProjectDetails[[#Headers],[전략 관리자]],매개_변수[#Headers],0))*INDEX('프로젝트 매개 변수'!$B$12:$H$12,1,MATCH(ProjectDetails[[#Headers],[전략 관리자]],매개_변수[#Headers],0))*ProjectDetails[[#This Row],[실제 작업]]","v":{"v":0,"d":"₩0"}},{"$f":"INDEX(매개_변수[],MATCH(ProjectDetails[[#This Row],[프로젝트 유형]],매개_변수[프로젝트 유형],0),MATCH(ProjectDetails[[#Headers],[디자인 전문가]],매개_변수[#Headers],0))*INDEX('프로젝트 매개 변수'!$B$12:$H$12,1,MATCH(ProjectDetails[[#Headers],[디자인 전문가]],매개_변수[#Headers],0))*ProjectDetails[[#This Row],[실제 작업]]","v":{"v":25000,"d":"₩25,000"}},{"$f":"INDEX(매개_변수[],MATCH(ProjectDetails[[#This Row],[프로젝트 유형]],매개_변수[프로젝트 유형],0),MATCH(ProjectDetails[[#Headers],[이벤트 인력]],매개_변수[#Headers],0))*INDEX('프로젝트 매개 변수'!$B$12:$H$12,1,MATCH(ProjectDetails[[#Headers],[이벤트 인력]],매개_변수[#Headers],0))*ProjectDetails[[#This Row],[실제 작업]]","v":{"v":0,"d":"₩0"}},{"$f":"INDEX(매개_변수[],MATCH(ProjectDetails[[#This Row],[프로젝트 유형]],매개_변수[프로젝트 유형],0),MATCH(ProjectDetails[[#Headers],[관리 인력]],매개_변수[#Headers],0))*INDEX('프로젝트 매개 변수'!$B$12:$H$12,1,MATCH(ProjectDetails[[#Headers],[관리 인력]],매개_변수[#Headers],0))*ProjectDetails[[#This Row],[실제 작업]]","v":{"v":3000,"d":"₩3,000"}}]
[null,"프로젝트 4","이벤트 세부 계획",{"$f":"DATE(YEAR(TODAY())+3,7,30)","v":"2025-07-30"},{"$f":"DATE(YEAR(TODAY())+3,9,28)","v":"2025-09-28"},{"$f":"DATE(YEAR(TODAY())+3,9,14)","v":"2025-09-14"},{"$f":"DATE(YEAR(TODAY())+3,11,13)","v":"2025-11-13"},150,145,{"$f":"DAYS360(ProjectDetails[[#This Row],[예상 시작]],ProjectDetails[[#This Row],[예상 완료]],FALSE)","v":58},{"$f":"DAYS360(ProjectDetails[[#This Row],[실제 시작]],ProjectDetails[[#This Row],[실제 완료]],FALSE)","v":59},{"$f":"INDEX(매개_변수[],MATCH(ProjectDetails[[#This Row],[프로젝트 유형]],매개_변수[프로젝트 유형],0),MATCH(ProjectDetails[[#Headers],[계정 관리자]],매개_변수[#Headers],0))*INDEX('프로젝트 매개 변수'!$B$12:$H$12,1,MATCH(ProjectDetails[[#Headers],[계정 관리자]],매개_변수[#Headers],0))*ProjectDetails[[#This Row],[예상 작업]]","v":{"v":5400,"d":"₩5,400"}},{"$f":"INDEX(매개_변수[],MATCH(ProjectDetails[[#This Row],[프로젝트 유형]],매개_변수[프로젝트 유형],0),MATCH(ProjectDetails[[#Headers],[프로젝트 관리자]],매개_변수[#Headers],0))*INDEX('프로젝트 매개 변수'!$B$12:$H$12,1,MATCH(ProjectDetails[[#Headers],[프로젝트 관리자]],매개_변수[#Headers],0))*ProjectDetails[[#This Row],[예상 작업]]","v":{"v":10800,"d":"₩10,800"}},{"$f":"INDEX(매개_변수[],MATCH(ProjectDetails[[#This Row],[프로젝트 유형]],매개_변수[프로젝트 유형],0),MATCH(ProjectDetails[[#Headers],[전략 관리자]],매개_변수[#Headers],0))*INDEX('프로젝트 매개 변수'!$B$12:$H$12,1,MATCH(ProjectDetails[[#Headers],[전략 관리자]],매개_변수[#Headers],0))*ProjectDetails[[#This Row],[예상 작업]]","v":{"v":0,"d":"₩0"}},{"$f":"INDEX(매개_변수[],MATCH(ProjectDetails[[#This Row],[프로젝트 유형]],매개_변수[프로젝트 유형],0),MATCH(ProjectDetails[[#Headers],[디자인 전문가]],매개_변수[#Headers],0))*INDEX('프로젝트 매개 변수'!$B$12:$H$12,1,MATCH(ProjectDetails[[#Headers],[디자인 전문가]],매개_변수[#Headers],0))*ProjectDetails[[#This Row],[예상 작업]]","v":{"v":0,"d":"₩0"}},{"$f":"INDEX(매개_변수[],MATCH(ProjectDetails[[#This Row],[프로젝트 유형]],매개_변수[프로젝트 유형],0),MATCH(ProjectDetails[[#Headers],[이벤트 인력]],매개_변수[#Headers],0))*INDEX('프로젝트 매개 변수'!$B$12:$H$12,1,MATCH(ProjectDetails[[#Headers],[이벤트 인력]],매개_변수[#Headers],0))*ProjectDetails[[#This Row],[예상 작업]]","v":{"v":1200,"d":"₩1,200"}},{"$f":"INDEX(매개_변수[],MATCH(ProjectDetails[[#This Row],[프로젝트 유형]],매개_변수[프로젝트 유형],0),MATCH(ProjectDetails[[#Headers],[관리 인력]],매개_변수[#Headers],0))*INDEX('프로젝트 매개 변수'!$B$12:$H$12,1,MATCH(ProjectDetails[[#Headers],[관리 인력]],매개_변수[#Headers],0))*ProjectDetails[[#This Row],[예상 작업]]","v":{"v":900,"d":"₩900"}},{"$f":"INDEX(매개_변수[],MATCH(ProjectDetails[[#This Row],[프로젝트 유형]],매개_변수[프로젝트 유형],0),MATCH(ProjectDetails[[#Headers],[계정 관리자]],매개_변수[#Headers],0))*INDEX('프로젝트 매개 변수'!$B$12:$H$12,1,MATCH(ProjectDetails[[#Headers],[계정 관리자]],매개_변수[#Headers],0))*ProjectDetails[[#This Row],[실제 작업]]","v":{"v":5220,"d":"₩5,220"}},{"$f":"INDEX(매개_변수[],MATCH(ProjectDetails[[#This Row],[프로젝트 유형]],매개_변수[프로젝트 유형],0),MATCH(ProjectDetails[[#Headers],[프로젝트 관리자]],매개_변수[#Headers],0))*INDEX('프로젝트 매개 변수'!$B$12:$H$12,1,MATCH(ProjectDetails[[#Headers],[프로젝트 관리자]],매개_변수[#Headers],0))*ProjectDetails[[#This Row],[실제 작업]]","v":{"v":10440,"d":"₩10,440"}},{"$f":"INDEX(매개_변수[],MATCH(ProjectDetails[[#This Row],[프로젝트 유형]],매개_변수[프로젝트 유형],0),MATCH(ProjectDetails[[#Headers],[전략 관리자]],매개_변수[#Headers],0))*INDEX('프로젝트 매개 변수'!$B$12:$H$12,1,MATCH(ProjectDetails[[#Headers],[전략 관리자]],매개_변수[#Headers],0))*ProjectDetails[[#This Row],[실제 작업]]","v":{"v":0,"d":"₩0"}},{"$f":"INDEX(매개_변수[],MATCH(ProjectDetails[[#This Row],[프로젝트 유형]],매개_변수[프로젝트 유형],0),MATCH(ProjectDetails[[#Headers],[디자인 전문가]],매개_변수[#Headers],0))*INDEX('프로젝트 매개 변수'!$B$12:$H$12,1,MATCH(ProjectDetails[[#Headers],[디자인 전문가]],매개_변수[#Headers],0))*ProjectDetails[[#This Row],[실제 작업]]","v":{"v":0,"d":"₩0"}},{"$f":"INDEX(매개_변수[],MATCH(ProjectDetails[[#This Row],[프로젝트 유형]],매개_변수[프로젝트 유형],0),MATCH(ProjectDetails[[#Headers],[이벤트 인력]],매개_변수[#Headers],0))*INDEX('프로젝트 매개 변수'!$B$12:$H$12,1,MATCH(ProjectDetails[[#Headers],[이벤트 인력]],매개_변수[#Headers],0))*ProjectDetails[[#This Row],[실제 작업]]","v":{"v":1160,"d":"₩1,160"}},{"$f":"INDEX(매개_변수[],MATCH(ProjectDetails[[#This Row],[프로젝트 유형]],매개_변수[프로젝트 유형],0),MATCH(ProjectDetails[[#Headers],[관리 인력]],매개_변수[#Headers],0))*INDEX('프로젝트 매개 변수'!$B$12:$H$12,1,MATCH(ProjectDetails[[#Headers],[관리 인력]],매개_변수[#Headers],0))*ProjectDetails[[#This Row],[실제 작업]]","v":{"v":870,"d":"₩870"}}]
[null,"프로젝트 5","이벤트 인력 관리",{"$f":"DATE(YEAR(TODAY())+4,8,11)","v":"2026-08-11"},{"$f":"DATE(YEAR(TODAY())+4,8,21)","v":"2026-08-21"},{"$f":"DATE(YEAR(TODAY())+4,9,14)","v":"2026-09-14"},{"$f":"DATE(YEAR(TODAY())+4,9,25)","v":"2026-09-25"},250,255,{"$f":"DAYS360(ProjectDetails[[#This Row],[예상 시작]],ProjectDetails[[#This Row],[예상 완료]],FALSE)","v":10},{"$f":"DAYS360(ProjectDetails[[#This Row],[실제 시작]],ProjectDetails[[#This Row],[실제 완료]],FALSE)","v":11},{"$f":"INDEX(매개_변수[],MATCH(ProjectDetails[[#This Row],[프로젝트 유형]],매개_변수[프로젝트 유형],0),MATCH(ProjectDetails[[#Headers],[계정 관리자]],매개_변수[#Headers],0))*INDEX('프로젝트 매개 변수'!$B$12:$H$12,1,MATCH(ProjectDetails[[#Headers],[계정 관리자]],매개_변수[#Headers],0))*ProjectDetails[[#This Row],[예상 작업]]","v":{"v":9000,"d":"₩9,000"}},{"$f":"INDEX(매개_변수[],MATCH(ProjectDetails[[#This Row],[프로젝트 유형]],매개_변수[프로젝트 유형],0),MATCH(ProjectDetails[[#Headers],[프로젝트 관리자]],매개_변수[#Headers],0))*INDEX('프로젝트 매개 변수'!$B$12:$H$12,1,MATCH(ProjectDetails[[#Headers],[프로젝트 관리자]],매개_변수[#Headers],0))*ProjectDetails[[#This Row],[예상 작업]]","v":{"v":3000,"d":"₩3,000"}},{"$f":"INDEX(매개_변수[],MATCH(ProjectDetails[[#This Row],[프로젝트 유형]],매개_변수[프로젝트 유형],0),MATCH(ProjectDetails[[#Headers],[전략 관리자]],매개_변수[#Headers],0))*INDEX('프로젝트 매개 변수'!$B$12:$H$12,1,MATCH(ProjectDetails[[#Headers],[전략 관리자]],매개_변수[#Headers],0))*ProjectDetails[[#This Row],[예상 작업]]","v":{"v":0,"d":"₩0"}},{"$f":"INDEX(매개_변수[],MATCH(ProjectDetails[[#This Row],[프로젝트 유형]],매개_변수[프로젝트 유형],0),MATCH(ProjectDetails[[#Headers],[디자인 전문가]],매개_변수[#Headers],0))*INDEX('프로젝트 매개 변수'!$B$12:$H$12,1,MATCH(ProjectDetails[[#Headers],[디자인 전문가]],매개_변수[#Headers],0))*ProjectDetails[[#This Row],[예상 작업]]","v":{"v":0,"d":"₩0"}},{"$f":"INDEX(매개_변수[],MATCH(ProjectDetails[[#This Row],[프로젝트 유형]],매개_변수[프로젝트 유형],0),MATCH(ProjectDetails[[#Headers],[이벤트 인력]],매개_변수[#Headers],0))*INDEX('프로젝트 매개 변수'!$B$12:$H$12,1,MATCH(ProjectDetails[[#Headers],[이벤트 인력]],매개_변수[#Headers],0))*ProjectDetails[[#This Row],[예상 작업]]","v":{"v":12000,"d":"₩12,000"}},{"$f":"INDEX(매개_변수[],MATCH(ProjectDetails[[#This Row],[프로젝트 유형]],매개_변수[프로젝트 유형],0),MATCH(ProjectDetails[[#Headers],[관리 인력]],매개_변수[#Headers],0))*INDEX('프로젝트 매개 변수'!$B$12:$H$12,1,MATCH(ProjectDetails[[#Headers],[관리 인력]],매개_변수[#Headers],0))*ProjectDetails[[#This Row],[예상 작업]]","v":{"v":1500,"d":"₩1,500"}},{"$f":"INDEX(매개_변수[],MATCH(ProjectDetails[[#This Row],[프로젝트 유형]],매개_변수[프로젝트 유형],0),MATCH(ProjectDetails[[#Headers],[계정 관리자]],매개_변수[#Headers],0))*INDEX('프로젝트 매개 변수'!$B$12:$H$12,1,MATCH(ProjectDetails[[#Headers],[계정 관리자]],매개_변수[#Headers],0))*ProjectDetails[[#This Row],[실제 작업]]","v":{"v":9180,"d":"₩9,180"}},{"$f":"INDEX(매개_변수[],MATCH(ProjectDetails[[#This Row],[프로젝트 유형]],매개_변수[프로젝트 유형],0),MATCH(ProjectDetails[[#Headers],[프로젝트 관리자]],매개_변수[#Headers],0))*INDEX('프로젝트 매개 변수'!$B$12:$H$12,1,MATCH(ProjectDetails[[#Headers],[프로젝트 관리자]],매개_변수[#Headers],0))*ProjectDetails[[#This Row],[실제 작업]]","v":{"v":3060,"d":"₩3,060"}},{"$f":"INDEX(매개_변수[],MATCH(ProjectDetails[[#This Row],[프로젝트 유형]],매개_변수[프로젝트 유형],0),MATCH(ProjectDetails[[#Headers],[전략 관리자]],매개_변수[#Headers],0))*INDEX('프로젝트 매개 변수'!$B$12:$H$12,1,MATCH(ProjectDetails[[#Headers],[전략 관리자]],매개_변수[#Headers],0))*ProjectDetails[[#This Row],[실제 작업]]","v":{"v":0,"d":"₩0"}},{"$f":"INDEX(매개_변수[],MATCH(ProjectDetails[[#This Row],[프로젝트 유형]],매개_변수[프로젝트 유형],0),MATCH(ProjectDetails[[#Headers],[디자인 전문가]],매개_변수[#Headers],0))*INDEX('프로젝트 매개 변수'!$B$12:$H$12,1,MATCH(ProjectDetails[[#Headers],[디자인 전문가]],매개_변수[#Headers],0))*ProjectDetails[[#This Row],[실제 작업]]","v":{"v":0,"d":"₩0"}},{"$f":"INDEX(매개_변수[],MATCH(ProjectDetails[[#This Row],[프로젝트 유형]],매개_변수[프로젝트 유형],0),MATCH(ProjectDetails[[#Headers],[이벤트 인력]],매개_변수[#Headers],0))*INDEX('프로젝트 매개 변수'!$B$12:$H$12,1,MATCH(ProjectDetails[[#Headers],[이벤트 인력]],매개_변수[#Headers],0))*ProjectDetails[[#This Row],[실제 작업]]","v":{"v":12240,"d":"₩12,240"}},{"$f":"INDEX(매개_변수[],MATCH(ProjectDetails[[#This Row],[프로젝트 유형]],매개_변수[프로젝트 유형],0),MATCH(ProjectDetails[[#Headers],[관리 인력]],매개_변수[#Headers],0))*INDEX('프로젝트 매개 변수'!$B$12:$H$12,1,MATCH(ProjectDetails[[#Headers],[관리 인력]],매개_변수[#Headers],0))*ProjectDetails[[#This Row],[실제 작업]]","v":{"v":1530,"d":"₩1,530"}}]
[null,"합계",{"$nulls":5},{"$f":"SUBTOTAL(109,ProjectDetails[예상 작업])","v":1500},{"$f":"SUBTOTAL(109,ProjectDetails[실제 작업])","v":1510},{"$f":"SUBTOTAL(109,ProjectDetails[예상 기간])","v":225},{"$f":"SUBTOTAL(109,ProjectDetails[실제 기간])","v":597}]
{"$rows_left_out":1}
{"sheet":"프로젝트 합계","index":3,"n_rows":10,"n_cols":14,"rows_kept":10}
[null,{"$f":"'프로젝트 매개 변수'!B1","v":"회사 이름"}]
[null,"이벤트 관리 프로젝트 관리표"]
[null,{"$f":"'프로젝트 매개 변수'!B3","v":"회사 이름 기밀"}]
["오른쪽 셀에서 시작되는 피벗테이블은 자동으로 업데이트됩니다.\n정보\n오른쪽 피벗테이블을 새로 고치려면 피벗 테이블을 선택(피벗 테이블 내에서 아무 셀이나 선택)하고, 피벗 테이블 도구 | 분석 리본 메뉴 탭에서 새로 고침을 선택하거나 피벗테이블의 아무 셀에서나 SHIFT + F10 키를 누른 다음 ㅐ로 고침을 선택합니다.","프로젝트 이름","계정 관리자 예상","프로젝트 관리자 예상","전략 관리자 예상","디자인 전문가 예상","이벤트 인력 예상","관리 인력 예상","계정 관리자 실제","프로젝트 관리자 실제","전략 관리자 실제","디자인 전문가 실제","이벤트 인력 실제","관리 인력 실제"]
[null,"프로젝트 1",{"v":7200,"d":"₩7,200.00"},{"v":2400,"d":"₩2,400.00"},{"v":18000,"d":"₩18,000.00"},{"v":0,"d":"₩0.00"},{"v":0,"d":"₩0.00"},{"v":1200,"d":"₩1,200.00"},{"v":7920,"d":"₩7,920.00"},{"v":2640,"d":"₩2,640.00"},{"v":19800,"d":"₩19,800.00"},{"v":0,"d":"₩0.00"},{"v":0,"d":"₩0.00"},{"v":1320,"d":"₩1,320.00"}]
[null,"프로젝트 2",{"v":14400,"d":"₩14,400.00"},{"v":24000,"d":"₩24,000.00"},{"v":6000,"d":"₩6,000.00"},{"v":4000,"d":"₩4,000.00"},{"v":0,"d":"₩0.00"},{"v":2400,"d":"₩2,400.00"},{"v":14040,"d":"₩14,040.00"},{"v":23400,"d":"₩23,400.00"},{"v":5850,"d":"₩5,850.00"},{"v":3900,"d":"₩3,900.00"},{"v":0,"d":"₩0.00"},{"v":2340,"d":"₩2,340.00"}]
[null,"프로젝트 3",{"v":18000,"d":"₩18,000.00"},{"v":12000,"d":"₩12,000.00"},{"v":0,"d":"₩0.00"},{"v":25000,"d":"₩25,000.00"},{"v":0,"d":"₩0.00"},{"v":3000,"d":"₩3,000.00"},{"v":18000,"d":"₩18,000.00"},{"v":12000,"d":"₩12,000.00"},{"v":0,"d":"₩0.00"},{"v":25000,"d":"₩25,000.00"},{"v":0,"d":"₩0.00"},{"v":3000,"d":"₩3,000.00"}]
[null,"프로젝트 4",{"v":5400,"d":"₩5,400.00"},{"v":10800,"d":"₩10,800.00"},{"v":0,"d":"₩0.00"},{"v":0,"d":"₩0.00"},{"v":1200,"d":"₩1,200.00"},{"v":900,"d":"₩900.00"},{"v":5220,"d":"₩5,220.00"},{"v":10440,"d":"₩10,440.00"},{"v":0,"d":"₩0.00"},{"v":0,"d":"₩0.00"},{"v":1160,"d":"₩1,160.00"},{"v":870,"d":"₩870.00"}]
[null,"프로젝트 5",{"v":9000,"d":"₩9,000.00"},{"v":3000,"d":"₩3,000.00"},{"v":0,"d":"₩0.00"},{"v":0,"d":"₩0.00"},{"v":12000,"d":"₩12,000.00"},{"v":1500,"d":"₩1,500.00"},{"v":9180,"d":"₩9,180.00"},{"v":3060,"d":"₩3,060.00"},{"v":0,"d":"₩0.00"},{"v":0,"d":"₩0.00"},{"v":12240,"d":"₩12,240.00"},{"v":1530,"d":"₩1,530.00"}]
[null,"총합계",{"v":54000,"d":"₩54,000.00"},{"v":52200,"d":"₩52,200.00"},{"v":24000,"d":"₩24,000.00"},{"v":29000,"d":"₩29,000.00"},{"v":13200,"d":"₩13,200.00"},{"v":9000,"d":"₩9,000.00"},{"v":54360,"d":"₩54,360.00"},{"v":51540,"d":"₩51,540.00"},{"v":25650,"d":"₩25,650.00"},{"v":28900,"d":"₩28,900.00"},{"v":13400,"d":"₩13,400.00"},{"v":9060,"d":"₩9,060.00"}]