{"text_format":"3","workbook":"xlsx","n_sheets":4,"sheets":["이벤트","달력","인쇄 버전","관리자"],"not_rendered":{"defined_names":18},"read":"whole","date_system":"1900"}

{"sheet":"이벤트","index":0,"n_rows":38,"n_cols":5,"rows_kept":38}
[]
[null,"월간 커뮤니티"]
[null,"이벤트 플래너"]
[]
[]
[]
[]
[null,"날짜","요일","월","이벤트 이름"]
[null,"2016-07-01",{"$f":"IF(ISBLANK(tblEvents[[#This Row],[날짜]]),\"\",UPPER(TEXT(tblEvents[[#This Row],[날짜]],\"aaa\")))","v":"금"},{"$f":"IF(ISBLANK(tblEvents[[#This Row],[날짜]]),\"\",UPPER(TEXT(tblEvents[[#This Row],[날짜]],\"m월\")))","v":"7월"},"커뮤니티 가든"]
[null,"2016-07-01",{"$f":"IF(ISBLANK(tblEvents[[#This Row],[날짜]]),\"\",UPPER(TEXT(tblEvents[[#This Row],[날짜]],\"aaa\")))","v":"금"},{"$f":"IF(ISBLANK(tblEvents[[#This Row],[날짜]]),\"\",UPPER(TEXT(tblEvents[[#This Row],[날짜]],\"m월\")))","v":"7월"},"시의회"]
[null,"2016-07-02",{"$f":"IF(ISBLANK(tblEvents[[#This Row],[날짜]]),\"\",UPPER(TEXT(tblEvents[[#This Row],[날짜]],\"aaa\")))","v":"토"},{"$f":"IF(ISBLANK(tblEvents[[#This Row],[날짜]]),\"\",UPPER(TEXT(tblEvents[[#This Row],[날짜]],\"m월\")))","v":"7월"},"커뮤니티 가든"]
[null,"2016-07-03",{"$f":"IF(ISBLANK(tblEvents[[#This Row],[날짜]]),\"\",UPPER(TEXT(tblEvents[[#This Row],[날짜]],\"aaa\")))","v":"일"},{"$f":"IF(ISBLANK(tblEvents[[#This Row],[날짜]]),\"\",UPPER(TEXT(tblEvents[[#This Row],[날짜]],\"m월\")))","v":"7월"},"공원 영화 상영회"]
[null,"2016-07-08",{"$f":"IF(ISBLANK(tblEvents[[#This Row],[날짜]]),\"\",UPPER(TEXT(tblEvents[[#This Row],[날짜]],\"aaa\")))","v":"금"},{"$f":"IF(ISBLANK(tblEvents[[#This Row],[날짜]]),\"\",UPPER(TEXT(tblEvents[[#This Row],[날짜]],\"m월\")))","v":"7월"},"시의회"]
[null,"2016-07-11",{"$f":"IF(ISBLANK(tblEvents[[#This Row],[날짜]]),\"\",UPPER(TEXT(tblEvents[[#This Row],[날짜]],\"aaa\")))","v":"월"},{"$f":"IF(ISBLANK(tblEvents[[#This Row],[날짜]]),\"\",UPPER(TEXT(tblEvents[[#This Row],[날짜]],\"m월\")))","v":"7월"},"오찬 모임"]
[null,"2016-07-12",{"$f":"IF(ISBLANK(tblEvents[[#This Row],[날짜]]),\"\",UPPER(TEXT(tblEvents[[#This Row],[날짜]],\"aaa\")))","v":"화"},{"$f":"IF(ISBLANK(tblEvents[[#This Row],[날짜]]),\"\",UPPER(TEXT(tblEvents[[#This Row],[날짜]],\"m월\")))","v":"7월"},"골동품 전시회"]
[null,"2016-07-14",{"$f":"IF(ISBLANK(tblEvents[[#This Row],[날짜]]),\"\",UPPER(TEXT(tblEvents[[#This Row],[날짜]],\"aaa\")))","v":"목"},{"$f":"IF(ISBLANK(tblEvents[[#This Row],[날짜]]),\"\",UPPER(TEXT(tblEvents[[#This Row],[날짜]],\"m월\")))","v":"7월"},"커뮤니티 워크샵"]
[null,"2016-07-15",{"$f":"IF(ISBLANK(tblEvents[[#This Row],[날짜]]),\"\",UPPER(TEXT(tblEvents[[#This Row],[날짜]],\"aaa\")))","v":"금"},{"$f":"IF(ISBLANK(tblEvents[[#This Row],[날짜]]),\"\",UPPER(TEXT(tblEvents[[#This Row],[날짜]],\"m월\")))","v":"7월"},"시의회"]
[null,"2016-07-19",{"$f":"IF(ISBLANK(tblEvents[[#This Row],[날짜]]),\"\",UPPER(TEXT(tblEvents[[#This Row],[날짜]],\"aaa\")))","v":"화"},{"$f":"IF(ISBLANK(tblEvents[[#This Row],[날짜]]),\"\",UPPER(TEXT(tblEvents[[#This Row],[날짜]],\"m월\")))","v":"7월"},"전략 계획 워크샵"]
[null,"2016-07-20",{"$f":"IF(ISBLANK(tblEvents[[#This Row],[날짜]]),\"\",UPPER(TEXT(tblEvents[[#This Row],[날짜]],\"aaa\")))","v":"수"},{"$f":"IF(ISBLANK(tblEvents[[#This Row],[날짜]]),\"\",UPPER(TEXT(tblEvents[[#This Row],[날짜]],\"m월\")))","v":"7월"},"공원 청소"]
[null,"2016-07-22",{"$f":"IF(ISBLANK(tblEvents[[#This Row],[날짜]]),\"\",UPPER(TEXT(tblEvents[[#This Row],[날짜]],\"aaa\")))","v":"금"},{"$f":"IF(ISBLANK(tblEvents[[#This Row],[날짜]]),\"\",UPPER(TEXT(tblEvents[[#This Row],[날짜]],\"m월\")))","v":"7월"},"시의회"]
{"$rows_left_out":19}
{"sheet":"달력","index":1,"n_rows":35,"n_cols":21,"rows_kept":35,"merged":[[1,5,1,11],[30,8,34,20]]}
[]
[null,null,2016,null,null,{"$f":"LOOKUP(MonthNum,tblMonths[숫자],tblMonths[월])","v":"7월"}]
[null,null,7,null,null,{"$f":"DATE(ViewYear,MonthNum,1)","v":"2016-07-01"},null,null,{"$f":"WEEKDAY(StartDate)","v":6}]
[null,null,"일",null,null,"월",null,null,"화",null,null,"수",null,null,"목",null,null,"금",null,null,"토"]
[]
[null,null,{"$f":"StartDate-(WEEKDAY(StartDate)-1)+{0;1;2;3;4;5}*7 +{1,2,3,4,5,6,7}-3+COLUMN(B1)","v":"2016-06-26"},null,null,{"$f":"StartDate-(WEEKDAY(StartDate)-1)+{0;1;2;3;4;5}*7 +{1,2,3,4,5,6,7}-3+COLUMN(C1)","v":"2016-06-27"},null,null,{"$f":"StartDate-(WEEKDAY(StartDate)-1)+{0;1;2;3;4;5}*7 +{1,2,3,4,5,6,7}-3+COLUMN(D1)","v":"2016-06-28"},null,null,{"$f":"StartDate-(WEEKDAY(StartDate)-1)+{0;1;2;3;4;5}*7 +{1,2,3,4,5,6,7}-3+COLUMN(E1)","v":"2016-06-29"},null,null,{"$f":"StartDate-(WEEKDAY(StartDate)-1)+{0;1;2;3;4;5}*7 +{1,2,3,4,5,6,7}-3+COLUMN(F1)","v":"2016-06-30"},null,null,{"$f":"StartDate-(WEEKDAY(StartDate)-1)+{0;1;2;3;4;5}*7 +{1,2,3,4,5,6,7}-3+COLUMN(G1)","v":"2016-07-01"},null,null,{"$f":"StartDate-(WEEKDAY(StartDate)-1)+{0;1;2;3;4;5}*7 +{1,2,3,4,5,6,7}-3+COLUMN(H1)","v":"2016-07-02"}]
[null,null,{"$f":"IFERROR(INDEX(tblEvents[],SMALL(IF(Dates=C$6,ROW(Dates)),ROW(1:1))-TableRowStart,4),\"\")","v":""},null,null,{"$f":"IFERROR(INDEX(tblEvents[],SMALL(IF(Dates=F$6,ROW(Dates)),ROW(1:1))-TableRowStart,4),\"\")","v":""},null,null,{"$f":"IFERROR(INDEX(tblEvents[],SMALL(IF(Dates=I$6,ROW(Dates)),ROW(1:1))-TableRowStart,4),\"\")","v":""},null,null,{"$f":"IFERROR(INDEX(tblEvents[],SMALL(IF(Dates=L$6,ROW(Dates)),ROW(1:1))-TableRowStart,4),\"\")","v":""},null,null,{"$f":"IFERROR(INDEX(tblEvents[],SMALL(IF(Dates=O$6,ROW(Dates)),ROW(1:1))-TableRowStart,4),\"\")","v":""},null,null,{"$f":"IFERROR(INDEX(tblEvents[],SMALL(IF(Dates=R$6,ROW(Dates)),ROW(1:1))-TableRowStart,4),\"\")","v":"커뮤니티 가든"},null,null,{"$f":"IFERROR(INDEX(tblEvents[],SMALL(IF(Dates=U$6,ROW(Dates)),ROW(1:1))-TableRowStart,4),\"\")","v":"커뮤니티 가든"}]
[null,null,{"$f":"IFERROR(INDEX(tblEvents[],SMALL(IF(Dates=C$6,ROW(Dates)),ROW(2:2))-TableRowStart,4),\"\")","v":""},null,null,{"$f":"IFERROR(INDEX(tblEvents[],SMALL(IF(Dates=F$6,ROW(Dates)),ROW(2:2))-TableRowStart,4),\"\")","v":""},null,null,{"$f":"IFERROR(INDEX(tblEvents[],SMALL(IF(Dates=I$6,ROW(Dates)),ROW(2:2))-TableRowStart,4),\"\")","v":""},null,null,{"$f":"IFERROR(INDEX(tblEvents[],SMALL(IF(Dates=L$6,ROW(Dates)),ROW(2:2))-TableRowStart,4),\"\")","v":""},null,null,{"$f":"IFERROR(INDEX(tblEvents[],SMALL(IF(Dates=O$6,ROW(Dates)),ROW(2:2))-TableRowStart,4),\"\")","v":""},null,null,{"$f":"IFERROR(INDEX(tblEvents[],SMALL(IF(Dates=R$6,ROW(Dates)),ROW(2:2))-TableRowStart,4),\"\")","v":"시의회"},null,null,{"$f":"IFERROR(INDEX(tblEvents[],SMALL(IF(Dates=U$6,ROW(Dates)),ROW(2:2))-TableRowStart,4),\"\")","v":""}]
[null,null,{"$f":"IFERROR(INDEX(tblEvents[],SMALL(IF(Dates=C$6,ROW(Dates)),ROW(3:3))-TableRowStart,4),\"\")","v":""},null,null,{"$f":"IFERROR(INDEX(tblEvents[],SMALL(IF(Dates=F$6,ROW(Dates)),ROW(3:3))-TableRowStart,4),\"\")","v":""},null,null,{"$f":"IFERROR(INDEX(tblEvents[],SMALL(IF(Dates=I$6,ROW(Dates)),ROW(3:3))-TableRowStart,4),\"\")","v":""},null,null,{"$f":"IFERROR(INDEX(tblEvents[],SMALL(IF(Dates=L$6,ROW(Dates)),ROW(3:3))-TableRowStart,4),\"\")","v":""},null,null,{"$f":"IFERROR(INDEX(tblEvents[],SMALL(IF(Dates=O$6,ROW(Dates)),ROW(3:3))-TableRowStart,4),\"\")","v":""},null,null,{"$f":"IFERROR(INDEX(tblEvents[],SMALL(IF(Dates=R$6,ROW(Dates)),ROW(3:3))-TableRowStart,4),\"\")","v":""},null,null,{"$f":"IFERROR(INDEX(tblEvents[],SMALL(IF(Dates=U$6,ROW(Dates)),ROW(3:3))-TableRowStart,4),\"\")","v":""}]
[null,null,{"$f":"IFERROR(INDEX(tblEvents[],SMALL(IF(Dates=C$6,ROW(Dates)),ROW(#REF!))-TableRowStart,4),\"\")","v":""},null,null,{"$f":"IFERROR(INDEX(tblEvents[],SMALL(IF(Dates=F$6,ROW(Dates)),ROW(#REF!))-TableRowStart,4),\"\")","v":""},null,null,{"$f":"IFERROR(INDEX(tblEvents[],SMALL(IF(Dates=I$6,ROW(Dates)),ROW(#REF!))-TableRowStart,4),\"\")","v":""},null,null,{"$f":"IFERROR(INDEX(tblEvents[],SMALL(IF(Dates=L$6,ROW(Dates)),ROW(#REF!))-TableRowStart,4),\"\")","v":""},null,null,{"$f":"IFERROR(INDEX(tblEvents[],SMALL(IF(Dates=O$6,ROW(Dates)),ROW(#REF!))-TableRowStart,4),\"\")","v":""},null,null,{"$f":"IFERROR(INDEX(tblEvents[],SMALL(IF(Dates=R$6,ROW(Dates)),ROW(#REF!))-TableRowStart,4),\"\")","v":""},null,null,{"$f":"IFERROR(INDEX(tblEvents[],SMALL(IF(Dates=U$6,ROW(Dates)),ROW(#REF!))-TableRowStart,4),\"\")","v":""}]
[null,null,{"$f":"U6+1","v":"2016-07-03"},null,null,{"$f":"C11+1","v":"2016-07-04"},null,null,{"$f":"F11+1","v":"2016-07-05"},null,null,{"$f":"I11+1","v":"2016-07-06"},null,null,{"$f":"L11+1","v":"2016-07-07"},null,null,{"$f":"O11+1","v":"2016-07-08"},null,null,{"$f":"R11+1","v":"2016-07-09"}]
[null,null,{"$f":"IFERROR(INDEX(tblEvents[],SMALL(IF(Dates=C$11,ROW(Dates)),ROW(1:1))-TableRowStart,4),\"\")","v":"공원 영화 상영회"},null,null,{"$f":"IFERROR(INDEX(tblEvents[],SMALL(IF(Dates=F$11,ROW(Dates)),ROW(1:1))-TableRowStart,4),\"\")","v":""},null,null,{"$f":"IFERROR(INDEX(tblEvents[],SMALL(IF(Dates=I$11,ROW(Dates)),ROW(1:1))-TableRowStart,4),\"\")","v":""},null,null,{"$f":"IFERROR(INDEX(tblEvents[],SMALL(IF(Dates=L$11,ROW(Dates)),ROW(1:1))-TableRowStart,4),\"\")","v":""},null,null,{"$f":"IFERROR(INDEX(tblEvents[],SMALL(IF(Dates=O$11,ROW(Dates)),ROW(1:1))-TableRowStart,4),\"\")","v":""},null,null,{"$f":"IFERROR(INDEX(tblEvents[],SMALL(IF(Dates=R$11,ROW(Dates)),ROW(1:1))-TableRowStart,4),\"\")","v":"시의회"},null,null,{"$f":"IFERROR(INDEX(tblEvents[],SMALL(IF(Dates=U$11,ROW(Dates)),ROW(1:1))-TableRowStart,4),\"\")","v":""}]
[null,null,{"$f":"IFERROR(INDEX(tblEvents[],SMALL(IF(Dates=C$11,ROW(Dates)),ROW(2:2))-TableRowStart,4),\"\")","v":""},null,null,{"$f":"IFERROR(INDEX(tblEvents[],SMALL(IF(Dates=F$11,ROW(Dates)),ROW(2:2))-TableRowStart,4),\"\")","v":""},null,null,{"$f":"IFERROR(INDEX(tblEvents[],SMALL(IF(Dates=I$11,ROW(Dates)),ROW(2:2))-TableRowStart,4),\"\")","v":""},null,null,{"$f":"IFERROR(INDEX(tblEvents[],SMALL(IF(Dates=L$11,ROW(Dates)),ROW(2:2))-TableRowStart,4),\"\")","v":""},null,null,{"$f":"IFERROR(INDEX(tblEvents[],SMALL(IF(Dates=O$11,ROW(Dates)),ROW(2:2))-TableRowStart,4),\"\")","v":""},null,null,{"$f":"IFERROR(INDEX(tblEvents[],SMALL(IF(Dates=R$11,ROW(Dates)),ROW(2:2))-TableRowStart,4),\"\")","v":""},null,null,{"$f":"IFERROR(INDEX(tblEvents[],SMALL(IF(Dates=U$11,ROW(Dates)),ROW(2:2))-TableRowStart,4),\"\")","v":""}]
[null,null,{"$f":"IFERROR(INDEX(tblEvents[],SMALL(IF(Dates=C$11,ROW(Dates)),ROW(3:3))-TableRowStart,4),\"\")","v":""},null,null,{"$f":"IFERROR(INDEX(tblEvents[],SMALL(IF(Dates=F$11,ROW(Dates)),ROW(3:3))-TableRowStart,4),\"\")","v":""},null,null,{"$f":"IFERROR(INDEX(tblEvents[],SMALL(IF(Dates=I$11,ROW(Dates)),ROW(3:3))-TableRowStart,4),\"\")","v":""},null,null,{"$f":"IFERROR(INDEX(tblEvents[],SMALL(IF(Dates=L$11,ROW(Dates)),ROW(3:3))-TableRowStart,4),\"\")","v":""},null,null,{"$f":"IFERROR(INDEX(tblEvents[],SMALL(IF(Dates=O$11,ROW(Dates)),ROW(3:3))-TableRowStart,4),\"\")","v":""},null,null,{"$f":"IFERROR(INDEX(tblEvents[],SMALL(IF(Dates=R$11,ROW(Dates)),ROW(3:3))-TableRowStart,4),\"\")","v":""},null,null,{"$f":"IFERROR(INDEX(tblEvents[],SMALL(IF(Dates=U$11,ROW(Dates)),ROW(3:3))-TableRowStart,4),\"\")","v":""}]
[null,null,{"$f":"IFERROR(INDEX(tblEvents[],SMALL(IF(Dates=C$11,ROW(Dates)),ROW(#REF!))-TableRowStart,4),\"\")","v":""},null,null,{"$f":"IFERROR(INDEX(tblEvents[],SMALL(IF(Dates=F$11,ROW(Dates)),ROW(#REF!))-TableRowStart,4),\"\")","v":""},null,null,{"$f":"IFERROR(INDEX(tblEvents[],SMALL(IF(Dates=I$11,ROW(Dates)),ROW(#REF!))-TableRowStart,4),\"\")","v":""},null,null,{"$f":"IFERROR(INDEX(tblEvents[],SMALL(IF(Dates=L$11,ROW(Dates)),ROW(#REF!))-TableRowStart,4),\"\")","v":""},null,null,{"$f":"IFERROR(INDEX(tblEvents[],SMALL(IF(Dates=O$11,ROW(Dates)),ROW(#REF!))-TableRowStart,4),\"\")","v":""},null,null,{"$f":"IFERROR(INDEX(tblEvents[],SMALL(IF(Dates=R$11,ROW(Dates)),ROW(#REF!))-TableRowStart,4),\"\")","v":""},null,null,{"$f":"IFERROR(INDEX(tblEvents[],SMALL(IF(Dates=U$11,ROW(Dates)),ROW(#REF!))-TableRowStart,4),\"\")","v":""}]
[null,null,{"$f":"U11+1","v":"2016-07-10"},null,null,{"$f":"C16+1","v":"2016-07-11"},null,null,{"$f":"F16+1","v":"2016-07-12"},null,null,{"$f":"I16+1","v":"2016-07-13"},null,null,{"$f":"L16+1","v":"2016-07-14"},null,null,{"$f":"O16+1","v":"2016-07-15"},null,null,{"$f":"R16+1","v":"2016-07-16"}]
[null,null,{"$f":"IFERROR(INDEX(tblEvents[],SMALL(IF(Dates=C$16,ROW(Dates)),ROW(1:1))-TableRowStart,4),\"\")","v":""},null,null,{"$f":"IFERROR(INDEX(tblEvents[],SMALL(IF(Dates=F$16,ROW(Dates)),ROW(1:1))-TableRowStart,4),\"\")","v":"오찬 모임"},null,null,{"$f":"IFERROR(INDEX(tblEvents[],SMALL(IF(Dates=I$16,ROW(Dates)),ROW(1:1))-TableRowStart,4),\"\")","v":"골동품 전시회"},null,null,{"$f":"IFERROR(INDEX(tblEvents[],SMALL(IF(Dates=L$16,ROW(Dates)),ROW(1:1))-TableRowStart,4),\"\")","v":""},null,null,{"$f":"IFERROR(INDEX(tblEvents[],SMALL(IF(Dates=O$16,ROW(Dates)),ROW(1:1))-TableRowStart,4),\"\")","v":"커뮤니티 워크샵"},null,null,{"$f":"IFERROR(INDEX(tblEvents[],SMALL(IF(Dates=R$16,ROW(Dates)),ROW(1:1))-TableRowStart,4),\"\")","v":"시의회"},null,null,{"$f":"IFERROR(INDEX(tblEvents[],SMALL(IF(Dates=U$16,ROW(Dates)),ROW(1:1))-TableRowStart,4),\"\")","v":""}]
[null,null,{"$f":"IFERROR(INDEX(tblEvents[],SMALL(IF(Dates=C$16,ROW(Dates)),ROW(2:2))-TableRowStart,4),\"\")","v":""},null,null,{"$f":"IFERROR(INDEX(tblEvents[],SMALL(IF(Dates=F$16,ROW(Dates)),ROW(2:2))-TableRowStart,4),\"\")","v":""},null,null,{"$f":"IFERROR(INDEX(tblEvents[],SMALL(IF(Dates=I$16,ROW(Dates)),ROW(2:2))-TableRowStart,4),\"\")","v":""},null,null,{"$f":"IFERROR(INDEX(tblEvents[],SMALL(IF(Dates=L$16,ROW(Dates)),ROW(2:2))-TableRowStart,4),\"\")","v":""},null,null,{"$f":"IFERROR(INDEX(tblEvents[],SMALL(IF(Dates=O$16,ROW(Dates)),ROW(2:2))-TableRowStart,4),\"\")","v":""},null,null,{"$f":"IFERROR(INDEX(tblEvents[],SMALL(IF(Dates=R$16,ROW(Dates)),ROW(2:2))-TableRowStart,4),\"\")","v":""},null,null,{"$f":"IFERROR(INDEX(tblEvents[],SMALL(IF(Dates=U$16,ROW(Dates)),ROW(2:2))-TableRowStart,4),\"\")","v":""}]
[null,null,{"$f":"IFERROR(INDEX(tblEvents[],SMALL(IF(Dates=C$16,ROW(Dates)),ROW(3:3))-TableRowStart,4),\"\")","v":""},null,null,{"$f":"IFERROR(INDEX(tblEvents[],SMALL(IF(Dates=F$16,ROW(Dates)),ROW(3:3))-TableRowStart,4),\"\")","v":""},null,null,{"$f":"IFERROR(INDEX(tblEvents[],SMALL(IF(Dates=I$16,ROW(Dates)),ROW(3:3))-TableRowStart,4),\"\")","v":""},null,null,{"$f":"IFERROR(INDEX(tblEvents[],SMALL(IF(Dates=L$16,ROW(Dates)),ROW(3:3))-TableRowStart,4),\"\")","v":""},null,null,{"$f":"IFERROR(INDEX(tblEvents[],SMALL(IF(Dates=O$16,ROW(Dates)),ROW(3:3))-TableRowStart,4),\"\")","v":""},null,null,{"$f":"IFERROR(INDEX(tblEvents[],SMALL(IF(Dates=R$16,ROW(Dates)),ROW(3:3))-TableRowStart,4),\"\")","v":""},null,null,{"$f":"IFERROR(INDEX(tblEvents[],SMALL(IF(Dates=U$16,ROW(Dates)),ROW(3:3))-TableRowStart,4),\"\")","v":""}]
[null,null,{"$f":"IFERROR(INDEX(tblEvents[],SMALL(IF(Dates=C$16,ROW(Dates)),ROW(#REF!))-TableRowStart,4),\"\")","v":""},null,null,{"$f":"IFERROR(INDEX(tblEvents[],SMALL(IF(Dates=F$16,ROW(Dates)),ROW(#REF!))-TableRowStart,4),\"\")","v":""},null,null,{"$f":"IFERROR(INDEX(tblEvents[],SMALL(IF(Dates=I$16,ROW(Dates)),ROW(#REF!))-TableRowStart,4),\"\")","v":""},null,null,{"$f":"IFERROR(INDEX(tblEvents[],SMALL(IF(Dates=L$16,ROW(Dates)),ROW(#REF!))-TableRowStart,4),\"\")","v":""},null,null,{"$f":"IFERROR(INDEX(tblEvents[],SMALL(IF(Dates=O$16,ROW(Dates)),ROW(#REF!))-TableRowStart,4),\"\")","v":""},null,null,{"$f":"IFERROR(INDEX(tblEvents[],SMALL(IF(Dates=R$16,ROW(Dates)),ROW(#REF!))-TableRowStart,4),\"\")","v":""},null,null,{"$f":"IFERROR(INDEX(tblEvents[],SMALL(IF(Dates=U$16,ROW(Dates)),ROW(#REF!))-TableRowStart,4),\"\")","v":""}]
{"$rows_left_out":16}
{"sheet":"인쇄 버전","index":2,"n_rows":35,"n_cols":21,"rows_kept":35,"merged":[[1,5,1,11],[30,8,34,20]]}
[]
[null,null,{"$f":"ViewYear","v":2016},null,null,{"$f":"ViewMonth","v":"7월"},{"$f":"달력!G2","v":0},{"$f":"달력!H2","v":0},{"$f":"달력!I2","v":0},{"$f":"달력!J2","v":0},{"$f":"달력!K2","v":0},{"$f":"달력!L2","v":0}]
[]
[null,null,"일",null,null,"월",null,null,"화",null,null,"수",null,null,"목",null,null,"금",null,null,"토"]
[]
[null,null,{"$f":"달력!C6","v":"2016-06-26"},{"$f":"달력!D6","v":0},{"$f":"달력!E6","v":0},{"$f":"달력!F6","v":"2016-06-27"},{"$f":"달력!G6","v":0},{"$f":"달력!H6","v":0},{"$f":"달력!I6","v":"2016-06-28"},{"$f":"달력!J6","v":0},{"$f":"달력!K6","v":0},{"$f":"달력!L6","v":"2016-06-29"},{"$f":"달력!M6","v":0},{"$f":"달력!N6","v":0},{"$f":"달력!O6","v":"2016-06-30"},{"$f":"달력!P6","v":0},{"$f":"달력!Q6","v":0},{"$f":"달력!R6","v":"2016-07-01"},{"$f":"달력!S6","v":0},{"$f":"달력!T6","v":0},{"$f":"달력!U6","v":"2016-07-02"}]
[null,null,{"$f":"달력!C7","v":""},{"$f":"달력!D7","v":0},{"$f":"달력!E7","v":0},{"$f":"달력!F7","v":""},{"$f":"달력!G7","v":0},{"$f":"달력!H7","v":0},{"$f":"달력!I7","v":""},{"$f":"달력!J7","v":0},{"$f":"달력!K7","v":0},{"$f":"달력!L7","v":""},{"$f":"달력!M7","v":0},{"$f":"달력!N7","v":0},{"$f":"달력!O7","v":""},{"$f":"달력!P7","v":0},{"$f":"달력!Q7","v":0},{"$f":"달력!R7","v":"커뮤니티 가든"},{"$f":"달력!S7","v":0},{"$f":"달력!T7","v":0},{"$f":"달력!U7","v":"커뮤니티 가든"}]
[null,null,{"$f":"달력!C8","v":""},{"$f":"달력!D8","v":"00:00:00"},{"$f":"달력!E8","v":"00:00:00"},{"$f":"달력!F8","v":""},{"$f":"달력!G8","v":"00:00:00"},{"$f":"달력!H8","v":"00:00:00"},{"$f":"달력!I8","v":""},{"$f":"달력!J8","v":"00:00:00"},{"$f":"달력!K8","v":"00:00:00"},{"$f":"달력!L8","v":""},{"$f":"달력!M8","v":"00:00:00"},{"$f":"달력!N8","v":"00:00:00"},{"$f":"달력!O8","v":""},{"$f":"달력!P8","v":"00:00:00"},{"$f":"달력!Q8","v":"00:00:00"},{"$f":"달력!R8","v":"시의회"},{"$f":"달력!S8","v":"00:00:00"},{"$f":"달력!T8","v":"00:00:00"},{"$f":"달력!U8","v":""}]
[null,null,{"$f":"달력!C9","v":""},{"$f":"달력!D9","v":0},{"$f":"달력!E9","v":0},{"$f":"달력!F9","v":""},{"$f":"달력!G9","v":0},{"$f":"달력!H9","v":0},{"$f":"달력!I9","v":""},{"$f":"달력!J9","v":0},{"$f":"달력!K9","v":0},{"$f":"달력!L9","v":""},{"$f":"달력!M9","v":0},{"$f":"달력!N9","v":0},{"$f":"달력!O9","v":""},{"$f":"달력!P9","v":0},{"$f":"달력!Q9","v":0},{"$f":"달력!R9","v":""},{"$f":"달력!S9","v":0},{"$f":"달력!T9","v":0},{"$f":"달력!U9","v":""}]
[null,null,{"$f":"달력!C10","v":""},{"$f":"달력!D10","v":0},{"$f":"달력!E10","v":0},{"$f":"달력!F10","v":""},{"$f":"달력!G10","v":0},{"$f":"달력!H10","v":0},{"$f":"달력!I10","v":""},{"$f":"달력!J10","v":0},{"$f":"달력!K10","v":0},{"$f":"달력!L10","v":""},{"$f":"달력!M10","v":0},{"$f":"달력!N10","v":0},{"$f":"달력!O10","v":""},{"$f":"달력!P10","v":0},{"$f":"달력!Q10","v":0},{"$f":"달력!R10","v":""},{"$f":"달력!S10","v":0},{"$f":"달력!T10","v":0},{"$f":"달력!U10","v":""}]
[null,null,{"$f":"달력!C11","v":"2016-07-03"},{"$f":"달력!D11","v":0},{"$f":"달력!E11","v":0},{"$f":"달력!F11","v":"2016-07-04"},{"$f":"달력!G11","v":0},{"$f":"달력!H11","v":0},{"$f":"달력!I11","v":"2016-07-05"},{"$f":"달력!J11","v":0},{"$f":"달력!K11","v":0},{"$f":"달력!L11","v":"2016-07-06"},{"$f":"달력!M11","v":0},{"$f":"달력!N11","v":0},{"$f":"달력!O11","v":"2016-07-07"},{"$f":"달력!P11","v":0},{"$f":"달력!Q11","v":0},{"$f":"달력!R11","v":"2016-07-08"},{"$f":"달력!S11","v":0},{"$f":"달력!T11","v":0},{"$f":"달력!U11","v":"2016-07-09"}]
[null,null,{"$f":"달력!C12","v":"공원 영화 상영회"},{"$f":"달력!D12","v":0},{"$f":"달력!E12","v":0},{"$f":"달력!F12","v":""},{"$f":"달력!G12","v":0},{"$f":"달력!H12","v":0},{"$f":"달력!I12","v":""},{"$f":"달력!J12","v":0},{"$f":"달력!K12","v":0},{"$f":"달력!L12","v":""},{"$f":"달력!M12","v":0},{"$f":"달력!N12","v":0},{"$f":"달력!O12","v":""},{"$f":"달력!P12","v":0},{"$f":"달력!Q12","v":0},{"$f":"달력!R12","v":"시의회"},{"$f":"달력!S12","v":0},{"$f":"달력!T12","v":0},{"$f":"달력!U12","v":""}]
[null,null,{"$f":"달력!C13","v":""},{"$f":"달력!D13","v":0},{"$f":"달력!E13","v":0},{"$f":"달력!F13","v":""},{"$f":"달력!G13","v":0},{"$f":"달력!H13","v":0},{"$f":"달력!I13","v":""},{"$f":"달력!J13","v":0},{"$f":"달력!K13","v":0},{"$f":"달력!L13","v":""},{"$f":"달력!M13","v":0},{"$f":"달력!N13","v":0},{"$f":"달력!O13","v":""},{"$f":"달력!P13","v":0},{"$f":"달력!Q13","v":0},{"$f":"달력!R13","v":""},{"$f":"달력!S13","v":0},{"$f":"달력!T13","v":0},{"$f":"달력!U13","v":""}]
[null,null,{"$f":"달력!C14","v":""},{"$f":"달력!D14","v":0},{"$f":"달력!E14","v":0},{"$f":"달력!F14","v":""},{"$f":"달력!G14","v":0},{"$f":"달력!H14","v":0},{"$f":"달력!I14","v":""},{"$f":"달력!J14","v":0},{"$f":"달력!K14","v":0},{"$f":"달력!L14","v":""},{"$f":"달력!M14","v":0},{"$f":"달력!N14","v":0},{"$f":"달력!O14","v":""},{"$f":"달력!P14","v":0},{"$f":"달력!Q14","v":0},{"$f":"달력!R14","v":""},{"$f":"달력!S14","v":0},{"$f":"달력!T14","v":0},{"$f":"달력!U14","v":""}]
[null,null,{"$f":"달력!C15","v":""},{"$f":"달력!D15","v":0},{"$f":"달력!E15","v":0},{"$f":"달력!F15","v":""},{"$f":"달력!G15","v":0},{"$f":"달력!H15","v":0},{"$f":"달력!I15","v":""},{"$f":"달력!J15","v":0},{"$f":"달력!K15","v":0},{"$f":"달력!L15","v":""},{"$f":"달력!M15","v":0},{"$f":"달력!N15","v":0},{"$f":"달력!O15","v":""},{"$f":"달력!P15","v":0},{"$f":"달력!Q15","v":0},{"$f":"달력!R15","v":""},{"$f":"달력!S15","v":0},{"$f":"달력!T15","v":0},{"$f":"달력!U15","v":""}]
[null,null,{"$f":"달력!C16","v":"2016-07-10"},{"$f":"달력!D16","v":0},{"$f":"달력!E16","v":0},{"$f":"달력!F16","v":"2016-07-11"},{"$f":"달력!G16","v":0},{"$f":"달력!H16","v":0},{"$f":"달력!I16","v":"2016-07-12"},{"$f":"달력!J16","v":0},{"$f":"달력!K16","v":0},{"$f":"달력!L16","v":"2016-07-13"},{"$f":"달력!M16","v":0},{"$f":"달력!N16","v":0},{"$f":"달력!O16","v":"2016-07-14"},{"$f":"달력!P16","v":0},{"$f":"달력!Q16","v":0},{"$f":"달력!R16","v":"2016-07-15"},{"$f":"달력!S16","v":0},{"$f":"달력!T16","v":0},{"$f":"달력!U16","v":"2016-07-16"}]
[null,null,{"$f":"달력!C17","v":""},{"$f":"달력!D17","v":0},{"$f":"달력!E17","v":0},{"$f":"달력!F17","v":"오찬 모임"},{"$f":"달력!G17","v":0},{"$f":"달력!H17","v":0},{"$f":"달력!I17","v":"골동품 전시회"},{"$f":"달력!J17","v":0},{"$f":"달력!K17","v":0},{"$f":"달력!L17","v":""},{"$f":"달력!M17","v":0},{"$f":"달력!N17","v":0},{"$f":"달력!O17","v":"커뮤니티 워크샵"},{"$f":"달력!P17","v":0},{"$f":"달력!Q17","v":0},{"$f":"달력!R17","v":"시의회"},{"$f":"달력!S17","v":0},{"$f":"달력!T17","v":0},{"$f":"달력!U17","v":""}]
[null,null,{"$f":"달력!C18","v":""},{"$f":"달력!D18","v":0},{"$f":"달력!E18","v":0},{"$f":"달력!F18","v":""},{"$f":"달력!G18","v":0},{"$f":"달력!H18","v":0},{"$f":"달력!I18","v":""},{"$f":"달력!J18","v":0},{"$f":"달력!K18","v":0},{"$f":"달력!L18","v":""},{"$f":"달력!M18","v":0},{"$f":"달력!N18","v":0},{"$f":"달력!O18","v":""},{"$f":"달력!P18","v":0},{"$f":"달력!Q18","v":0},{"$f":"달력!R18","v":""},{"$f":"달력!S18","v":0},{"$f":"달력!T18","v":0},{"$f":"달력!U18","v":""}]
[null,null,{"$f":"달력!C19","v":""},{"$f":"달력!D19","v":0},{"$f":"달력!E19","v":0},{"$f":"달력!F19","v":""},{"$f":"달력!G19","v":0},{"$f":"달력!H19","v":0},{"$f":"달력!I19","v":""},{"$f":"달력!J19","v":0},{"$f":"달력!K19","v":0},{"$f":"달력!L19","v":""},{"$f":"달력!M19","v":0},{"$f":"달력!N19","v":0},{"$f":"달력!O19","v":""},{"$f":"달력!P19","v":0},{"$f":"달력!Q19","v":0},{"$f":"달력!R19","v":""},{"$f":"달력!S19","v":0},{"$f":"달력!T19","v":0},{"$f":"달력!U19","v":""}]
[null,null,{"$f":"달력!C20","v":""},{"$f":"달력!D20","v":0},{"$f":"달력!E20","v":0},{"$f":"달력!F20","v":""},{"$f":"달력!G20","v":0},{"$f":"달력!H20","v":0},{"$f":"달력!I20","v":""},{"$f":"달력!J20","v":0},{"$f":"달력!K20","v":0},{"$f":"달력!L20","v":""},{"$f":"달력!M20","v":0},{"$f":"달력!N20","v":0},{"$f":"달력!O20","v":""},{"$f":"달력!P20","v":0},{"$f":"달력!Q20","v":0},{"$f":"달력!R20","v":""},{"$f":"달력!S20","v":0},{"$f":"달력!T20","v":0},{"$f":"달력!U20","v":""}]
{"$rows_left_out":16}
{"sheet":"관리자","index":3,"n_rows":14,"n_cols":3,"rows_kept":14,"hidden":true}
[]
[null,"월","숫자"]
[null,"1월",1]
[null,"2월",2]
[null,"3월",3]
[null,"4월",4]
[null,"5월",5]
[null,"6월",6]
[null,"7월",7]
[null,"8월",8]
[null,"9월",9]
[null,"10월",10]
[null,"11월",11]
[null,"12월",12]