{"text_format":"3","workbook":"xlsx","n_sheets":9,"sheets":["요약","과목 1","과목 2","과목 3","과목 4","과목 5","과목 6","과목 7","평점 테이블"],"not_rendered":{"defined_names":9},"read":"whole","date_system":"1900"}

{"sheet":"요약","index":0,"n_rows":12,"n_cols":7,"rows_kept":12,"merged":[[1,1,1,2]]}
[]
[null,"학교 이름",null,"    이름:",null," 학기/연도:"]
[]
[null,"과목명","이수 학점","현재 점수(백분율)","학점","평균 평점","가중 평점"]
[null,"과목1",{"v":3,"d":"3.0"},{"$f":"'과목 1'!D$36","v":{"v":0.8661764705882353,"d":"86.62%"}},{"$f":"IF(D5<>\"\",HLOOKUP(D5,'평점 테이블'!$C$5:$O$7,2),\"\")","v":"B"},{"$f":"IF(D5<>\"\",HLOOKUP(D5,'평점 테이블'!$C$5:$O$7,3),\"\")","v":{"v":3,"d":"3.00"}},{"$f":"IF(F5<>\"\",F5*C5/(SUM($C$5:$C$11)), \"\")","v":{"v":0.5625,"d":"0.56"}}]
[null,"과목2",{"v":4,"d":"4.0"},{"$f":"'과목 2'!D$36","v":""},{"$f":"IF(D6<>\"\",HLOOKUP(D6,'평점 테이블'!$C$5:$O$7,2),\"\")","v":""},{"$f":"IF(D6<>\"\",HLOOKUP(D6,'평점 테이블'!$C$5:$O$7,3),\"\")","v":""},""]
[null,"과목3",{"v":2,"d":"2.0"},{"$f":"'과목 3'!D$36","v":""},{"$f":"IF(D7<>\"\",HLOOKUP(D7,'평점 테이블'!$C$5:$O$7,2),\"\")","v":""},{"$f":"IF(D7<>\"\",HLOOKUP(D7,'평점 테이블'!$C$5:$O$7,3),\"\")","v":""},""]
[null,"과목4",{"v":4,"d":"4.0"},{"$f":"'과목 4'!D$36","v":""},{"$f":"IF(D8<>\"\",HLOOKUP(D8,'평점 테이블'!$C$5:$O$7,2),\"\")","v":""},{"$f":"IF(D8<>\"\",HLOOKUP(D8,'평점 테이블'!$C$5:$O$7,3),\"\")","v":""},""]
[null,"과목5",{"v":1,"d":"1.0"},{"$f":"'과목 5'!D$36","v":""},{"$f":"IF(D9<>\"\",HLOOKUP(D9,'평점 테이블'!$C$5:$O$7,2),\"\")","v":""},{"$f":"IF(D9<>\"\",HLOOKUP(D9,'평점 테이블'!$C$5:$O$7,3),\"\")","v":""},""]
[null,"과목6",{"v":1,"d":"1.0"},{"$f":"'과목 6'!D$36","v":""},{"$f":"IF(D10<>\"\",HLOOKUP(D10,'평점 테이블'!$C$5:$O$7,2),\"\")","v":""},{"$f":"IF(D10<>\"\",HLOOKUP(D10,'평점 테이블'!$C$5:$O$7,3),\"\")","v":""},""]
[null,"과목7",{"v":1,"d":"1.0"},{"$f":"'과목 7'!D$36","v":""},{"$f":"IF(D11<>\"\",HLOOKUP(D11,'평점 테이블'!$C$5:$O$7,2),\"\")","v":""},{"$f":"IF(D11<>\"\",HLOOKUP(D11,'평점 테이블'!$C$5:$O$7,3),\"\")","v":""},""]
[null,"합계",{"$f":"SUM(C5:C11)","v":16},{"$f":"AVERAGE(D5:D11)","v":{"v":0.8661764705882353,"d":"86.62%"}},{"$f":"IF(D12<>\"\",HLOOKUP(D12,'평점 테이블'!$C$5:$O$7,2),\"\")","v":"B"},{"$f":"AVERAGE(F5:F11)","v":{"v":3,"d":"3.00"}},{"$f":"SUM(G5:G11)","v":{"v":0.5625,"d":"0.56"}}]

{"sheet":"과목 1","index":1,"n_rows":38,"n_cols":8,"rows_kept":38,"merged":[[1,1,1,2]]}
[]
[null,{"$f":"요약!B5","v":"과목1"}]
[null,"교수:",null,null,"총 예상 점수(백분율)",null,null,{"$f":"IF(SUM($C$35:$H$35) <> 0,SUM($C$34:$H$34)/SUM($C$35:$H$35),\"\")","v":{"v":0.8661764705882353,"d":"86.62%"}}]
[null,"전자 메일:",null,null,"현재 성적",null,null,{"$f":"SUM($C$34:$H$34)","v":{"v":0.17323529411764707,"d":"17.32%"}}]
[]
[null,"과제","숙제","에세이","퀴즈","프로젝트","중간고사","기말고사"]
[null,"가중치",{"v":0.1,"d":"10.0%"},{"v":0.1,"d":"10.0%"},{"v":0.15,"d":"15.0%"},{"v":0.15,"d":"15.0%"},{"v":0.2,"d":"20.0%"},{"v":0.3,"d":"30.0%"}]
[null,"첫 번째 숙제",{"v":0.8823529411764706,"d":"0.88"}]
[null,"WWII 페이퍼",null,0.85]
{"$rows_empty":24}
[null,"총점",{"$f":"IF(COUNT(C8:C33) <> 0,AVERAGE(C8:C33) *C7, \"\")","v":{"v":0.08823529411764706,"d":"0.0882"}},{"v":0.085,"d":"0.0850"},"","","",""]
[null,"총 예상 점수",{"$f":"IF(COUNT(C8:C33)<>0,C7,\"\")","v":0.1},0.1,"","","",""]
[null,"총 예상 점수(백분율)",null,{"$f":"IF(SUM($C$35:$H$35) <> 0,SUM($C$34:$H$34)/SUM($C$35:$H$35),\"\")","v":{"v":0.8661764705882353,"d":"86.62%"}}]
[null,"점수 입력 시:","만점 대비 자신의 점수를 입력하십시오(예: 15/17)."]
[null,null,"받은 점수를 백분율로 입력하십시오(예: 85%)."]

{"sheet":"과목 2","index":2,"n_rows":38,"n_cols":8,"rows_kept":38,"merged":[[1,1,1,2]]}
[]
[null,{"$f":"요약!B6","v":"과목2"}]
[null,"교수:",null,null,"총 예상 점수(백분율)",null,null,{"$f":"IF(SUM($C$35:$H$35) <> 0,SUM($C$34:$H$34)/SUM($C$35:$H$35),\"\")","v":""}]
[null,"전자 메일:",null,null,"현재 성적",null,null,{"$f":"SUM($C$34:$H$34)","v":{"v":0,"d":"0.00%"}}]
[]
[null,"과제","숙제","에세이","퀴즈","프로젝트","중간고사","기말고사"]
[null,"가중치",{"v":0.1,"d":"10.0%"},{"v":0.1,"d":"10.0%"},{"v":0.15,"d":"15.0%"},{"v":0.15,"d":"15.0%"},{"v":0.2,"d":"20.0%"},{"v":0.3,"d":"30.0%"}]
{"$rows_empty":26}
[null,"총점",{"$f":"IF(COUNT(C8:C33) <> 0,AVERAGE(C8:C33) *C7, \"\")","v":""},"","","","",""]
[null,"총 예상 점수",{"$f":"IF(COUNT(C8:C33)<>0,C7,\"\")","v":""},"","","","",""]
[null,"총 예상 점수(백분율)",null,{"$f":"IF(SUM($C$35:$H$35) <> 0,SUM($C$34:$H$34)/SUM($C$35:$H$35),\"\")","v":""}]
[null,"점수 입력 시:","만점 대비 자신의 점수를 입력하십시오(예: 15/17)."]
[null,null,"받은 점수를 입력하십시오(예: 85%)."]

{"sheet":"과목 3","index":3,"n_rows":38,"n_cols":8,"rows_kept":38,"merged":[[1,1,1,2]]}
[]
[null,{"$f":"요약!B7","v":"과목3"}]
[null,"교수:",null,null,"총 예상 점수(백분율)",null,null,{"$f":"IF(SUM($C$35:$H$35) <> 0,SUM($C$34:$H$34)/SUM($C$35:$H$35),\"\")","v":""}]
[null,"전자 메일:",null,null,"현재 성적",null,null,{"$f":"SUM($C$34:$H$34)","v":{"v":0,"d":"0.00%"}}]
[]
[null,"과제","숙제","에세이","퀴즈","프로젝트","중간고사","기말고사"]
[null,"가중치",{"v":0.1,"d":"10.0%"},{"v":0.1,"d":"10.0%"},{"v":0.15,"d":"15.0%"},{"v":0.15,"d":"15.0%"},{"v":0.2,"d":"20.0%"},{"v":0.3,"d":"30.0%"}]
{"$rows_empty":26}
[null,"총점",{"$f":"IF(COUNT(C8:C33) <> 0,AVERAGE(C8:C33) *C7, \"\")","v":""},"","","","",""]
[null,"총 예상 점수",{"$f":"IF(COUNT(C8:C33)<>0,C7,\"\")","v":""},"","","","",""]
[null,"총 예상 점수(백분율)",null,{"$f":"IF(SUM($C$35:$H$35) <> 0,SUM($C$34:$H$34)/SUM($C$35:$H$35),\"\")","v":""}]
[null,"점수 입력 시:","만점 대비 자신의 점수를 입력하십시오(예: 15/17)."]
[null,null,"받은 점수를 백분율로 입력하십시오(예: 85%)."]

{"sheet":"과목 4","index":4,"n_rows":38,"n_cols":8,"rows_kept":38,"merged":[[1,1,1,2]]}
[]
[null,{"$f":"요약!B8","v":"과목4"}]
[null,"교수:",null,null,"총 예상 점수(백분율)"]
[null,"전자 메일:",null,null,"현재 성적",null,null,{"$f":"SUM($C$34:$H$34)","v":{"v":0,"d":"0.00%"}}]
[]
[null,"과제","숙제","에세이","퀴즈","프로젝트","중간고사","기말고사"]
[null,"가중치",{"v":0.1,"d":"10.0%"},{"v":0.1,"d":"10.0%"},{"v":0.15,"d":"15.0%"},{"v":0.15,"d":"15.0%"},{"v":0.2,"d":"20.0%"},{"v":0.3,"d":"30.0%"}]
{"$rows_empty":26}
[null,"총점",{"$f":"IF(COUNT(C8:C33) <> 0,AVERAGE(C8:C33) *C7, \"\")","v":""},"","","","",""]
[null,"총 예상 점수",{"$f":"IF(COUNT(C8:C33)<>0,C7,\"\")","v":""},"","","","",""]
[null,"총 예상 점수(백분율)",null,{"$f":"IF(SUM($C$35:$H$35) <> 0,SUM($C$34:$H$34)/SUM($C$35:$H$35),\"\")","v":""}]
[null,"점수 입력 시:","만점 대비 자신의 점수를 입력하십시오(예: 15/17)."]
[null,null,"받은 점수를 백분율로 입력하십시오(예: 85%)."]

{"sheet":"과목 5","index":5,"n_rows":38,"n_cols":8,"rows_kept":38,"merged":[[1,1,1,2]]}
[]
[null,{"$f":"요약!B9","v":"과목5"}]
[null,"교수:",null,null,"총 예상 점수(백분율)",null,null,{"$f":"IF(SUM($C$35:$H$35) <> 0,SUM($C$34:$H$34)/SUM($C$35:$H$35),\"\")","v":""}]
[null,"전자 메일:",null,null,"현재 성적",null,null,{"$f":"SUM($C$34:$H$34)","v":{"v":0,"d":"0.00%"}}]
[]
[null,"과제","숙제","에세이","퀴즈","프로젝트","중간고사","기말고사"]
[null,"가중치",{"v":0.1,"d":"10.0%"},{"v":0.1,"d":"10.0%"},{"v":0.15,"d":"15.0%"},{"v":0.15,"d":"15.0%"},{"v":0.2,"d":"20.0%"},{"v":0.3,"d":"30.0%"}]
{"$rows_empty":26}
[null,"총점",{"$f":"IF(COUNT(C8:C33) <> 0,AVERAGE(C8:C33) *C7, \"\")","v":""},"","","","",""]
[null,"총 예상 점수",{"$f":"IF(COUNT(C8:C33)<>0,C7,\"\")","v":""},"","","","",""]
[null,"총 예상 점수(백분율)",null,{"$f":"IF(SUM($C$35:$H$35) <> 0,SUM($C$34:$H$34)/SUM($C$35:$H$35),\"\")","v":""}]
[null,"점수 입력 시:","만점 대비 자신의 점수를 입력하십시오(예: 15/17)."]
[null,null,"받은 점수를 백분율로 입력하십시오(예: 85%)."]

{"sheet":"과목 6","index":6,"n_rows":38,"n_cols":8,"rows_kept":38,"merged":[[1,1,1,2]]}
[]
[null,{"$f":"요약!B10","v":"과목6"}]
[null,"교수:",null,null,"총 예상 점수(백분율)",null,null,{"$f":"IF(SUM($C$35:$H$35) <> 0,SUM($C$34:$H$34)/SUM($C$35:$H$35),\"\")","v":""}]
[null,"전자 메일:",null,null,"현재 성적",null,null,{"$f":"SUM($C$34:$H$34)","v":{"v":0,"d":"0.00%"}}]
[]
[null,"과제","숙제","에세이","퀴즈","프로젝트","중간고사","기말고사"]
[null,"가중치",{"v":0.1,"d":"10.0%"},{"v":0.1,"d":"10.0%"},{"v":0.15,"d":"15.0%"},{"v":0.15,"d":"15.0%"},{"v":0.2,"d":"20.0%"},{"v":0.3,"d":"30.0%"}]
{"$rows_empty":26}
[null,"총점",{"$f":"IF(COUNT(C8:C33) <> 0,AVERAGE(C8:C33) *C7, \"\")","v":""},"","","","",""]
[null,"총 예상 점수",{"$f":"IF(COUNT(C8:C33)<>0,C7,\"\")","v":""},"","","","",""]
[null,"총 예상 점수(백분율)",null,{"$f":"IF(SUM($C$35:$H$35) <> 0,SUM($C$34:$H$34)/SUM($C$35:$H$35),\"\")","v":""},{"$f":"IF(SUM($C$35:$H$35) <> 0,SUM($C$34:$H$34)/SUM($C$35:$H$35),\"\")","v":""}]
[null,"점수 입력 시:","만점 대비 자신의 점수를 입력하십시오(예: 15/17)."]
[null,null,"받은 점수를 백분율로 입력하십시오(예: 85%)."]

{"sheet":"과목 7","index":7,"n_rows":38,"n_cols":8,"rows_kept":38,"merged":[[1,1,1,2]]}
[]
[null,{"$f":"요약!B11","v":"과목7"}]
[null,"교수:",null,null,"총 예상 점수(백분율)",null,null,{"$f":"IF(SUM($C$35:$H$35) <> 0,SUM($C$34:$H$34)/SUM($C$35:$H$35),\"\")","v":""}]
[null,"전자 메일:",null,null,"현재 성적",null,null,{"$f":"SUM($C$34:$H$34)","v":{"v":0,"d":"0.00%"}}]
[]
[null,"과제","숙제","에세이","퀴즈","프로젝트","중간고사","기말고사"]
[null,"가중치",{"v":0.1,"d":"10.0%"},{"v":0.1,"d":"10.0%"},{"v":0.15,"d":"15.0%"},{"v":0.15,"d":"15.0%"},{"v":0.2,"d":"20.0%"},{"v":0.3,"d":"30.0%"}]
{"$rows_empty":26}
[null,"총점",{"$f":"IF(COUNT(C8:C33) <> 0,AVERAGE(C8:C33) *C7, \"\")","v":""},"","","","",""]
[null,"총 예상 점수",{"$f":"IF(COUNT(C8:C33)<>0,C7,\"\")","v":""},"","","","",""]
[null,"총 예상 점수(백분율)",null,{"$f":"IF(SUM($C$35:$H$35) <> 0,SUM($C$34:$H$34)/SUM($C$35:$H$35),\"\")","v":""}]
[null,"점수 입력 시:","만점 대비 자신의 점수를 입력하십시오(예: 15/17)."]
[null,null,"받은 점수를 백분율로 입력하십시오(예: 85%)."]

{"sheet":"평점 테이블","index":8,"n_rows":7,"n_cols":15,"rows_kept":7}
[]
[]
[]
[null,"성적 및 평점 테이블"]
[null,"평균",{"v":0,"d":"0%"},{"v":0.6,"d":"60%"},{"v":0.63,"d":"63%"},{"v":0.67,"d":"67%"},{"v":0.7,"d":"70%"},{"v":0.73,"d":"73%"},{"v":0.77,"d":"77%"},{"v":0.8,"d":"80%"},{"v":0.83,"d":"83%"},{"v":0.87,"d":"87%"},{"v":0.9,"d":"90%"},{"v":0.93,"d":"93%"},{"v":0.97,"d":"97%"}]
[null,"학점","F","D-","D","D+","C-","C","C+","B-","B","B+","A-","A","A+"]
[null,"평균 평점",{"v":0,"d":"0.00"},0.67,{"v":1,"d":"1.00"},1.33,1.67,{"v":2,"d":"2.00"},2.33,2.67,{"v":3,"d":"3.00"},3.33,3.67,{"v":4,"d":"4.00"},{"v":4,"d":"4.00"}]