{"text_format":"3","workbook":"xlsx","n_sheets":3,"sheets":["減価償却一覧","償却率","使い方"],"not_rendered":{"defined_names":4,"comments":1},"read":"whole","date_system":"1900"}

{"sheet":"減価償却一覧","index":0,"n_rows":28,"n_cols":27,"rows_kept":28,"merged":[[0,0,0,26],[4,0,4,7],[4,8,5,9],[4,10,5,10],[4,11,5,11],[4,12,5,12],[4,13,5,13],[4,14,5,14],[4,15,5,15],[4,16,5,16],[4,17,5,17],[4,18,5,18],[4,19,5,19],[4,20,5,20],[4,21,4,22],[4,23,5,23],[4,24,5,25],[4,26,5,26],[5,0,5,5],[5,6,5,7],[6,0,6,5],[6,6,6,7],[6,24,6,25],[7,0,7,5],[7,6,7,7],[7,24,7,25],[8,0,8,5],[8,6,8,7],[8,24,8,25],[9,0,9,5],[9,6,9,7],[9,24,9,25],[10,0,10,5],[10,6,10,7],[10,24,10,25],[11,0,11,5],[11,6,11,7],[11,24,11,25],[12,0,12,5],[12,6,12,7],[12,24,12,25],[13,0,13,5],[13,6,13,7],[13,24,13,25],[14,0,14,5],[14,6,14,7],[14,24,14,25],[15,0,15,5],[15,6,15,7],[15,24,15,25],[16,0,16,5],[16,6,16,7],[16,24,16,25],[17,0,17,5],[17,6,17,7],[17,24,17,25],[18,0,18,5],[18,6,18,7],[18,24,18,25],[19,0,19,5],[19,6,19,7],[19,24,19,25],[20,0,20,5],[20,6,20,7],[20,24,20,25],[21,0,21,5],[21,6,21,7],[21,24,21,25],[22,0,22,5],[22,6,22,7],[22,24,22,25],[23,0,23,5],[23,6,23,7],[23,24,23,25],[24,0,24,5],[24,6,24,7],[24,24,24,25],[25,0,25,5],[25,6,25,7],[25,24,25,25],[26,0,26,5],[26,6,26,7],[26,24,26,25],[27,0,27,5],[27,6,27,7],[27,24,27,25]]}
["減価償却一覧表"]
["自",15,"年",4,"月",1,"日"]
["至",16,"年",3,"月",31,"日",{"$nulls":18},"No."]
[]
["資産名称",{"$nulls":7},"取得\n年月",null,"償却法","残存\n率","数量","単価","取得価額","期首簿価","償却\n基準価額","耐用\n年数","償却率","経過\n月数","当期普通\n償却高","特別又は割増償却",null,"処分除却\n高","当期計",null,"当期末\n簿価"]
["品目",{"$nulls":5},"内訳",{"$nulls":14},"内訳","償却高"]
["車両運搬費",{"$nulls":5},"クライン",null,15,6,"定率法",null,{"v":1,"d":"1 "},{"v":3000000,"d":"3,000,000 "},{"$f":"IF(OR(M7=\"\",N7=\"\"),\"\",M7*N7)","v":{"v":3000000,"d":"3,000,000 "}},{"v":3000000,"d":"3,000,000 "},{"$f":"IF(OR(O7=\"\",P7=\"\"),\"\",IF(K7=\"定率法\",P7,IF(AND(K7=\"定額法\",L7<>\"\"),O7-O7*L7,\"\")))","v":{"v":3000000,"d":"3,000,000 "}},{"v":6,"d":"6 "},{"$f":"IF(OR(K7=\"\",R7=\"\",ISNA(VLOOKUP(R7,償却率!$B$2:$D$101,1,FALSE))),\"\",INDEX(償却率!$C$3:$D$101,MATCH(R7,償却率!$B$3:$B$101,0),MATCH(K7,償却率!$C$2:$D$2,0)))","v":0.319},{"v":6,"d":"6 "},{"$f":"IF(OR(Q7=\"\",S7=\"\",T7=\"\"),\"\",Q7*S7*T7/12)","v":{"v":478500,"d":"478,500 "}},{"$nulls":3},{"$f":"IF(AND(U7=\"\",W7=\"\",X7=\"\"),\"\",IF(U7=\"\",W7+X7,U7+W7+X7))","v":{"v":478500,"d":"478,500 "}},null,{"$f":"IF(OR(P7=\"\",Y7=\"\"),\"\",P7-Y7)","v":{"v":2521500,"d":"2,521,500 "}}]
["事務所建物",{"$nulls":5},"鉄筋",null,15,1,"定額法",{"v":0.1,"d":"10%"},{"v":1,"d":"1 "},{"v":50000000,"d":"50,000,000 "},{"v":50000000,"d":"50,000,000 "},{"v":49775000,"d":"49,775,000 "},{"$f":"IF(OR(O8=\"\",P8=\"\"),\"\",IF(K8=\"定率法\",P8,IF(AND(K8=\"定額法\",L8<>\"\"),O8-O8*L8,\"\")))","v":{"v":45000000,"d":"45,000,000 "}},{"v":50,"d":"50 "},{"$f":"IF(OR(K8=\"\",R8=\"\",ISNA(VLOOKUP(R8,償却率!$B$2:$D$101,1,FALSE))),\"\",INDEX(償却率!$C$3:$D$101,MATCH(R8,償却率!$B$3:$B$101,0),MATCH(K8,償却率!$C$2:$D$2,0)))","v":0.02},{"v":12,"d":"12 "},{"$f":"IF(OR(Q8=\"\",S8=\"\",T8=\"\"),\"\",Q8*S8*T8/12)","v":{"v":900000,"d":"900,000 "}},{"$nulls":3},{"$f":"IF(AND(U8=\"\",W8=\"\",X8=\"\"),\"\",IF(U8=\"\",W8+X8,U8+W8+X8))","v":{"v":900000,"d":"900,000 "}},null,{"$f":"IF(OR(P8=\"\",Y8=\"\"),\"\",P8-Y8)","v":{"v":48875000,"d":"48,875,000 "}}]
[{"$nulls":14},"",null,"",null,{"$f":"IF(OR(K9=\"\",R9=\"\",ISNA(VLOOKUP(R9,償却率!$B$2:$D$101,1,FALSE))),\"\",INDEX(償却率!$C$3:$D$101,MATCH(R9,償却率!$B$3:$B$101,0),MATCH(K9,償却率!$C$2:$D$2,0)))","v":""},null,"",{"$nulls":3},{"$f":"IF(AND(U9=\"\",W9=\"\",X9=\"\"),\"\",IF(U9=\"\",W9+X9,U9+W9+X9))","v":""},null,""]
[{"$nulls":14},"",null,"",null,{"$f":"IF(OR(K10=\"\",R10=\"\",ISNA(VLOOKUP(R10,償却率!$B$2:$D$101,1,FALSE))),\"\",INDEX(償却率!$C$3:$D$101,MATCH(R10,償却率!$B$3:$B$101,0),MATCH(K10,償却率!$C$2:$D$2,0)))","v":""},null,"",{"$nulls":3},{"$f":"IF(AND(U10=\"\",W10=\"\",X10=\"\"),\"\",IF(U10=\"\",W10+X10,U10+W10+X10))","v":""},null,""]
[{"$nulls":14},"",null,"",null,{"$f":"IF(OR(K11=\"\",R11=\"\",ISNA(VLOOKUP(R11,償却率!$B$2:$D$101,1,FALSE))),\"\",INDEX(償却率!$C$3:$D$101,MATCH(R11,償却率!$B$3:$B$101,0),MATCH(K11,償却率!$C$2:$D$2,0)))","v":""},null,"",{"$nulls":3},"",null,""]
[{"$nulls":14},"",null,"",null,{"$f":"IF(OR(K12=\"\",R12=\"\",ISNA(VLOOKUP(R12,償却率!$B$2:$D$101,1,FALSE))),\"\",INDEX(償却率!$C$3:$D$101,MATCH(R12,償却率!$B$3:$B$101,0),MATCH(K12,償却率!$C$2:$D$2,0)))","v":""},null,"",{"$nulls":3},"",null,""]
[{"$nulls":14},"",null,"",null,{"$f":"IF(OR(K13=\"\",R13=\"\",ISNA(VLOOKUP(R13,償却率!$B$2:$D$101,1,FALSE))),\"\",INDEX(償却率!$C$3:$D$101,MATCH(R13,償却率!$B$3:$B$101,0),MATCH(K13,償却率!$C$2:$D$2,0)))","v":""},null,"",{"$nulls":3},"",null,""]
[{"$nulls":14},"",null,"",null,{"$f":"IF(OR(K14=\"\",R14=\"\",ISNA(VLOOKUP(R14,償却率!$B$2:$D$101,1,FALSE))),\"\",INDEX(償却率!$C$3:$D$101,MATCH(R14,償却率!$B$3:$B$101,0),MATCH(K14,償却率!$C$2:$D$2,0)))","v":""},null,"",{"$nulls":3},"",null,""]
[{"$nulls":14},"",null,"",null,{"$f":"IF(OR(K15=\"\",R15=\"\",ISNA(VLOOKUP(R15,償却率!$B$2:$D$101,1,FALSE))),\"\",INDEX(償却率!$C$3:$D$101,MATCH(R15,償却率!$B$3:$B$101,0),MATCH(K15,償却率!$C$2:$D$2,0)))","v":""},null,"",{"$nulls":3},"",null,""]
[{"$nulls":14},"",null,"",null,{"$f":"IF(OR(K16=\"\",R16=\"\",ISNA(VLOOKUP(R16,償却率!$B$2:$D$101,1,FALSE))),\"\",INDEX(償却率!$C$3:$D$101,MATCH(R16,償却率!$B$3:$B$101,0),MATCH(K16,償却率!$C$2:$D$2,0)))","v":""},null,"",{"$nulls":3},"",null,""]
[{"$nulls":14},"",null,"",null,{"$f":"IF(OR(K17=\"\",R17=\"\",ISNA(VLOOKUP(R17,償却率!$B$2:$D$101,1,FALSE))),\"\",INDEX(償却率!$C$3:$D$101,MATCH(R17,償却率!$B$3:$B$101,0),MATCH(K17,償却率!$C$2:$D$2,0)))","v":""},null,"",{"$nulls":3},"",null,""]
[{"$nulls":14},"",null,"",null,{"$f":"IF(OR(K18=\"\",R18=\"\",ISNA(VLOOKUP(R18,償却率!$B$2:$D$101,1,FALSE))),\"\",INDEX(償却率!$C$3:$D$101,MATCH(R18,償却率!$B$3:$B$101,0),MATCH(K18,償却率!$C$2:$D$2,0)))","v":""},null,"",{"$nulls":3},"",null,""]
[{"$nulls":14},"",null,"",null,{"$f":"IF(OR(K19=\"\",R19=\"\",ISNA(VLOOKUP(R19,償却率!$B$2:$D$101,1,FALSE))),\"\",INDEX(償却率!$C$3:$D$101,MATCH(R19,償却率!$B$3:$B$101,0),MATCH(K19,償却率!$C$2:$D$2,0)))","v":""},null,"",{"$nulls":3},"",null,""]
[{"$nulls":14},"",null,"",null,{"$f":"IF(OR(K20=\"\",R20=\"\",ISNA(VLOOKUP(R20,償却率!$B$2:$D$101,1,FALSE))),\"\",INDEX(償却率!$C$3:$D$101,MATCH(R20,償却率!$B$3:$B$101,0),MATCH(K20,償却率!$C$2:$D$2,0)))","v":""},null,"",{"$nulls":3},"",null,""]
[{"$nulls":14},"",null,"",null,{"$f":"IF(OR(K21=\"\",R21=\"\",ISNA(VLOOKUP(R21,償却率!$B$2:$D$101,1,FALSE))),\"\",INDEX(償却率!$C$3:$D$101,MATCH(R21,償却率!$B$3:$B$101,0),MATCH(K21,償却率!$C$2:$D$2,0)))","v":""},null,"",{"$nulls":3},"",null,""]
[{"$nulls":14},"",null,"",null,{"$f":"IF(OR(K22=\"\",R22=\"\",ISNA(VLOOKUP(R22,償却率!$B$2:$D$101,1,FALSE))),\"\",INDEX(償却率!$C$3:$D$101,MATCH(R22,償却率!$B$3:$B$101,0),MATCH(K22,償却率!$C$2:$D$2,0)))","v":""},null,"",{"$nulls":3},"",null,""]
[{"$nulls":14},"",null,"",null,{"$f":"IF(OR(K23=\"\",R23=\"\",ISNA(VLOOKUP(R23,償却率!$B$2:$D$101,1,FALSE))),\"\",INDEX(償却率!$C$3:$D$101,MATCH(R23,償却率!$B$3:$B$101,0),MATCH(K23,償却率!$C$2:$D$2,0)))","v":""},null,"",{"$nulls":3},"",null,""]
[{"$nulls":14},"",null,"",null,{"$f":"IF(OR(K24=\"\",R24=\"\",ISNA(VLOOKUP(R24,償却率!$B$2:$D$101,1,FALSE))),\"\",INDEX(償却率!$C$3:$D$101,MATCH(R24,償却率!$B$3:$B$101,0),MATCH(K24,償却率!$C$2:$D$2,0)))","v":""},null,"",{"$nulls":3},"",null,""]
[{"$nulls":14},"",null,"",null,{"$f":"IF(OR(K25=\"\",R25=\"\",ISNA(VLOOKUP(R25,償却率!$B$2:$D$101,1,FALSE))),\"\",INDEX(償却率!$C$3:$D$101,MATCH(R25,償却率!$B$3:$B$101,0),MATCH(K25,償却率!$C$2:$D$2,0)))","v":""},null,"",{"$nulls":3},"",null,""]
[{"$nulls":14},"",null,"",null,{"$f":"IF(OR(K26=\"\",R26=\"\",ISNA(VLOOKUP(R26,償却率!$B$2:$D$101,1,FALSE))),\"\",INDEX(償却率!$C$3:$D$101,MATCH(R26,償却率!$B$3:$B$101,0),MATCH(K26,償却率!$C$2:$D$2,0)))","v":""},null,"",{"$nulls":3},"",null,""]
[{"$nulls":14},"",null,"",null,{"$f":"IF(OR(K27=\"\",R27=\"\",ISNA(VLOOKUP(R27,償却率!$B$2:$D$101,1,FALSE))),\"\",INDEX(償却率!$C$3:$D$101,MATCH(R27,償却率!$B$3:$B$101,0),MATCH(K27,償却率!$C$2:$D$2,0)))","v":""},null,"",{"$nulls":3},"",null,""]
[{"$nulls":14},"",null,"",null,{"$f":"IF(OR(K28=\"\",R28=\"\",ISNA(VLOOKUP(R28,償却率!$B$2:$D$101,1,FALSE))),\"\",INDEX(償却率!$C$3:$D$101,MATCH(R28,償却率!$B$3:$B$101,0),MATCH(K28,償却率!$C$2:$D$2,0)))","v":""},null,"",{"$nulls":3},"",null,""]

{"sheet":"償却率","index":1,"n_rows":101,"n_cols":4,"rows_kept":101}
[]
[null,"耐用年数","定額法","定率法"]
[null,2,0.5,0.684]
[null,3,0.333,0.536]
[null,4,0.25,0.438]
[null,5,0.2,0.369]
[null,6,0.166,0.319]
[null,7,0.142,0.28]
[null,8,0.125,0.25]
[null,9,0.111,0.226]
[null,10,0.1,0.206]
[null,11,0.09,0.189]
[null,12,0.083,0.175]
[null,13,0.076,0.162]
[null,14,0.071,0.152]
[null,15,0.066,0.142]
[null,16,0.062,0.134]
[null,17,0.058,0.127]
[null,18,0.055,0.12]
[null,19,0.052,0.114]
[null,20,0.05,0.109]
[null,21,0.048,0.104]
[null,22,0.046,0.099]
[null,23,0.044,0.095]
[null,24,0.042,0.092]
[null,25,0.04,0.088]
[null,26,0.039,0.085]
[null,27,0.037,0.082]
[null,28,0.036,0.079]
[null,29,0.035,0.076]
[null,30,0.034,0.074]
[null,31,0.033,0.072]
[null,32,0.032,0.069]
[null,33,0.031,0.067]
[null,34,0.03,0.066]
[null,35,0.029,0.064]
[null,36,0.028,0.062]
[null,37,0.027,0.06]
[null,38,0.027,0.059]
[null,39,0.026,0.057]
[null,40,0.025,0.056]
[null,41,0.025,0.055]
[null,42,0.024,0.053]
[null,43,0.024,0.052]
[null,44,0.023,0.051]
[null,45,0.023,0.05]
[null,46,0.022,0.049]
[null,47,0.022,0.048]
[null,48,0.021,0.047]
[null,49,0.021,0.046]
[null,50,0.02,0.045]
[null,51,0.02,0.044]
[null,52,0.02,0.043]
[null,53,0.019,0.043]
[null,54,0.019,0.042]
[null,55,0.019,0.041]
[null,56,0.018,0.04]
[null,57,0.018,0.04]
[null,58,0.018,0.039]
[null,59,0.017,0.038]
[null,60,0.017,0.038]
[null,61,0.017,0.037]
[null,62,0.017,0.036]
[null,63,0.016,0.036]
[null,64,0.016,0.035]
[null,65,0.016,0.035]
[null,66,0.016,0.034]
[null,67,0.015,0.034]
[null,68,0.015,0.033]
[null,69,0.015,0.033]
[null,70,0.015,0.032]
[null,71,0.014,0.032]
[null,72,0.014,0.032]
[null,73,0.014,0.031]
[null,74,0.014,0.031]
[null,75,0.014,0.03]
[null,76,0.014,0.03]
[null,77,0.013,0.03]
[null,78,0.013,0.029]
[null,79,0.013,0.029]
[null,80,0.013,0.028]
[null,81,0.013,0.028]
[null,82,0.013,0.028]
[null,83,0.012,0.027]
[null,84,0.012,0.027]
[null,85,0.012,0.026]
[null,86,0.012,0.026]
[null,87,0.012,0.026]
[null,88,0.012,0.026]
[null,89,0.012,0.026]
[null,90,0.012,0.025]
[null,91,0.011,0.025]
[null,92,0.011,0.025]
[null,93,0.011,0.025]
[null,94,0.011,0.024]
[null,95,0.011,0.024]
[null,96,0.011,0.024]
[null,97,0.011,0.023]
[null,98,0.011,0.023]
[null,99,0.011,0.023]
[null,100,0.01,0.023]

{"sheet":"使い方","index":2,"n_rows":28,"n_cols":27,"rows_kept":28,"merged":[[0,0,0,26],[4,0,4,7],[4,8,5,9],[4,10,5,10],[4,11,5,11],[4,12,5,12],[4,13,5,13],[4,14,5,14],[4,15,5,15],[4,16,5,16],[4,17,5,17],[4,18,5,18],[4,19,5,19],[4,20,5,20],[4,21,4,22],[4,23,5,23],[4,24,5,25],[4,26,5,26],[5,0,5,5],[5,6,5,7],[6,0,6,5],[6,6,6,7],[6,24,6,25],[7,0,7,5],[7,6,7,7],[7,24,7,25],[8,0,8,5],[8,6,8,7],[8,24,8,25],[9,0,9,5],[9,6,9,7],[9,24,9,25],[10,0,10,5],[10,6,10,7],[10,24,10,25],[11,0,11,5],[11,6,11,7],[11,24,11,25],[12,0,12,5],[12,6,12,7],[12,24,12,25],[13,0,13,5],[13,6,13,7],[13,24,13,25],[14,0,14,5],[14,6,14,7],[14,24,14,25],[15,0,15,5],[15,6,15,7],[15,24,15,25],[16,0,16,5],[16,6,16,7],[16,24,16,25],[17,0,17,5],[17,6,17,7],[17,24,17,25],[18,0,18,5],[18,6,18,7],[18,24,18,25],[19,0,19,5],[19,6,19,7],[19,24,19,25],[20,0,20,5],[20,6,20,7],[20,24,20,25],[21,0,21,5],[21,6,21,7],[21,24,21,25],[22,0,22,5],[22,6,22,7],[22,24,22,25],[23,0,23,5],[23,6,23,7],[23,24,23,25],[24,0,24,5],[24,6,24,7],[24,24,24,25],[25,0,25,5],[25,6,25,7],[25,24,25,25],[26,0,26,5],[26,6,26,7],[26,24,26,25],[27,0,27,5],[27,6,27,7],[27,24,27,25]]}
["減価償却一覧表"]
["自",15,"年",4,"月",1,"日"]
["至",16,"年",3,"月",31,"日",{"$nulls":18},"No."]
[]
["資産名称",{"$nulls":7},"取得\n年月",null,"償却法","残存\n率","数量","単価","取得価額","期首簿価","償却\n基準価額","耐用\n年数","償却率","経過\n月数","当期普通\n償却高","特別又は割増償却",null,"処分除却\n高","当期計",null,"当期末\n簿価"]
["品目",{"$nulls":5},"内訳",{"$nulls":14},"内訳","償却高"]
["車両運搬費",{"$nulls":5},"クライン",null,15,6,"定率法",null,{"v":1,"d":"1 "},{"v":3000000,"d":"3,000,000 "},{"$f":"IF(OR(M7=\"\",N7=\"\"),\"\",M7*N7)","v":{"v":3000000,"d":"3,000,000 "}},{"v":3000000,"d":"3,000,000 "},{"$f":"IF(OR(O7=\"\",P7=\"\"),\"\",IF(K7=\"定率法\",P7,IF(AND(K7=\"定額法\",L7<>\"\"),O7-O7*L7,\"\")))","v":{"v":3000000,"d":"3,000,000 "}},{"v":6,"d":"6 "},{"$f":"IF(OR(K7=\"\",R7=\"\",ISNA(VLOOKUP(R7,償却率!$B$2:$D$101,1,FALSE))),\"\",INDEX(償却率!$C$3:$D$101,MATCH(R7,償却率!$B$3:$B$101,0),MATCH(K7,償却率!$C$2:$D$2,0)))","v":0.319},{"v":6,"d":"6 "},{"$f":"IF(OR(Q7=\"\",S7=\"\",T7=\"\"),\"\",Q7*S7*T7/12)","v":{"v":478500,"d":"478,500 "}},{"$nulls":3},{"$f":"IF(AND(U7=\"\",W7=\"\",X7=\"\"),\"\",IF(U7=\"\",W7+X7,U7+W7+X7))","v":{"v":478500,"d":"478,500 "}},null,{"$f":"IF(OR(P7=\"\",Y7=\"\"),\"\",P7-Y7)","v":{"v":2521500,"d":"2,521,500 "}}]
["事務所建物",{"$nulls":5},"鉄筋",null,15,1,"定額法",{"v":0.1,"d":"10%"},{"v":1,"d":"1 "},{"v":50000000,"d":"50,000,000 "},{"v":50000000,"d":"50,000,000 "},{"v":47300000,"d":"47,300,000 "},{"$f":"IF(OR(O8=\"\",P8=\"\"),\"\",IF(K8=\"定率法\",P8,IF(AND(K8=\"定額法\",L8<>\"\"),O8-O8*L8,\"\")))","v":{"v":45000000,"d":"45,000,000 "}},{"v":50,"d":"50 "},{"$f":"IF(OR(K8=\"\",R8=\"\",ISNA(VLOOKUP(R8,償却率!$B$2:$D$101,1,FALSE))),\"\",INDEX(償却率!$C$3:$D$101,MATCH(R8,償却率!$B$3:$B$101,0),MATCH(K8,償却率!$C$2:$D$2,0)))","v":0.02},{"v":12,"d":"12 "},{"$f":"IF(OR(Q8=\"\",S8=\"\",T8=\"\"),\"\",Q8*S8*T8/12)","v":{"v":900000,"d":"900,000 "}},{"$nulls":3},{"$f":"IF(AND(U8=\"\",W8=\"\",X8=\"\"),\"\",IF(U8=\"\",W8+X8,U8+W8+X8))","v":{"v":900000,"d":"900,000 "}},null,{"$f":"IF(OR(P8=\"\",Y8=\"\"),\"\",P8-Y8)","v":{"v":46400000,"d":"46,400,000 "}}]
[{"$nulls":10},"定率法",{"v":0.1,"d":"10%"},null,null,"",{"v":5000000,"d":"5,000,000 "},"",null,{"$f":"IF(OR(K9=\"\",R9=\"\",ISNA(VLOOKUP(R9,償却率!$B$2:$D$101,1,FALSE))),\"\",INDEX(償却率!$C$3:$D$101,MATCH(R9,償却率!$B$3:$B$101,0),MATCH(K9,償却率!$C$2:$D$2,0)))","v":""},{"v":3,"d":"3 "},"",{"$nulls":3},{"$f":"IF(AND(U9=\"\",W9=\"\",X9=\"\"),\"\",IF(U9=\"\",W9+X9,U9+W9+X9))","v":""},null,""]
[{"$nulls":10},"定額法",{"$nulls":3},"",null,"",null,{"$f":"IF(OR(K10=\"\",R10=\"\",ISNA(VLOOKUP(R10,償却率!$B$2:$D$101,1,FALSE))),\"\",INDEX(償却率!$C$3:$D$101,MATCH(R10,償却率!$B$3:$B$101,0),MATCH(K10,償却率!$C$2:$D$2,0)))","v":""},null,"",{"$nulls":3},{"$f":"IF(AND(U10=\"\",W10=\"\",X10=\"\"),\"\",IF(U10=\"\",W10+X10,U10+W10+X10))","v":""},null,""]
[{"$nulls":14},"",null,"",null,{"$f":"IF(OR(K11=\"\",R11=\"\",ISNA(VLOOKUP(R11,償却率!$B$2:$D$101,1,FALSE))),\"\",INDEX(償却率!$C$3:$D$101,MATCH(R11,償却率!$B$3:$B$101,0),MATCH(K11,償却率!$C$2:$D$2,0)))","v":""},null,"",{"$nulls":3},"",null,""]
[{"$nulls":14},"",null,"",null,{"$f":"IF(OR(K12=\"\",R12=\"\",ISNA(VLOOKUP(R12,償却率!$B$2:$D$101,1,FALSE))),\"\",INDEX(償却率!$C$3:$D$101,MATCH(R12,償却率!$B$3:$B$101,0),MATCH(K12,償却率!$C$2:$D$2,0)))","v":""},null,"",{"$nulls":3},"",null,""]
[{"$nulls":14},"",null,"",null,{"$f":"IF(OR(K13=\"\",R13=\"\",ISNA(VLOOKUP(R13,償却率!$B$2:$D$101,1,FALSE))),\"\",INDEX(償却率!$C$3:$D$101,MATCH(R13,償却率!$B$3:$B$101,0),MATCH(K13,償却率!$C$2:$D$2,0)))","v":""},null,"",{"$nulls":3},"",null,""]
[{"$nulls":14},"",null,"",null,{"$f":"IF(OR(K14=\"\",R14=\"\",ISNA(VLOOKUP(R14,償却率!$B$2:$D$101,1,FALSE))),\"\",INDEX(償却率!$C$3:$D$101,MATCH(R14,償却率!$B$3:$B$101,0),MATCH(K14,償却率!$C$2:$D$2,0)))","v":""},null,"",{"$nulls":3},"",null,""]
[{"$nulls":14},"",null,"",null,{"$f":"IF(OR(K15=\"\",R15=\"\",ISNA(VLOOKUP(R15,償却率!$B$2:$D$101,1,FALSE))),\"\",INDEX(償却率!$C$3:$D$101,MATCH(R15,償却率!$B$3:$B$101,0),MATCH(K15,償却率!$C$2:$D$2,0)))","v":""},null,"",{"$nulls":3},"",null,""]
[{"$nulls":14},"",null,"",null,{"$f":"IF(OR(K16=\"\",R16=\"\",ISNA(VLOOKUP(R16,償却率!$B$2:$D$101,1,FALSE))),\"\",INDEX(償却率!$C$3:$D$101,MATCH(R16,償却率!$B$3:$B$101,0),MATCH(K16,償却率!$C$2:$D$2,0)))","v":""},null,"",{"$nulls":3},"",null,""]
[{"$nulls":14},"",null,"",null,{"$f":"IF(OR(K17=\"\",R17=\"\",ISNA(VLOOKUP(R17,償却率!$B$2:$D$101,1,FALSE))),\"\",INDEX(償却率!$C$3:$D$101,MATCH(R17,償却率!$B$3:$B$101,0),MATCH(K17,償却率!$C$2:$D$2,0)))","v":""},null,"",{"$nulls":3},"",null,""]
[{"$nulls":14},"",null,"",null,{"$f":"IF(OR(K18=\"\",R18=\"\",ISNA(VLOOKUP(R18,償却率!$B$2:$D$101,1,FALSE))),\"\",INDEX(償却率!$C$3:$D$101,MATCH(R18,償却率!$B$3:$B$101,0),MATCH(K18,償却率!$C$2:$D$2,0)))","v":""},null,"",{"$nulls":3},"",null,""]
[{"$nulls":14},"",null,"",null,{"$f":"IF(OR(K19=\"\",R19=\"\",ISNA(VLOOKUP(R19,償却率!$B$2:$D$101,1,FALSE))),\"\",INDEX(償却率!$C$3:$D$101,MATCH(R19,償却率!$B$3:$B$101,0),MATCH(K19,償却率!$C$2:$D$2,0)))","v":""},null,"",{"$nulls":3},"",null,""]
[{"$nulls":14},"",null,"",null,{"$f":"IF(OR(K20=\"\",R20=\"\",ISNA(VLOOKUP(R20,償却率!$B$2:$D$101,1,FALSE))),\"\",INDEX(償却率!$C$3:$D$101,MATCH(R20,償却率!$B$3:$B$101,0),MATCH(K20,償却率!$C$2:$D$2,0)))","v":""},null,"",{"$nulls":3},"",null,""]
[{"$nulls":14},"",null,"",null,{"$f":"IF(OR(K21=\"\",R21=\"\",ISNA(VLOOKUP(R21,償却率!$B$2:$D$101,1,FALSE))),\"\",INDEX(償却率!$C$3:$D$101,MATCH(R21,償却率!$B$3:$B$101,0),MATCH(K21,償却率!$C$2:$D$2,0)))","v":""},null,"",{"$nulls":3},"",null,""]
[{"$nulls":14},"",null,"",null,{"$f":"IF(OR(K22=\"\",R22=\"\",ISNA(VLOOKUP(R22,償却率!$B$2:$D$101,1,FALSE))),\"\",INDEX(償却率!$C$3:$D$101,MATCH(R22,償却率!$B$3:$B$101,0),MATCH(K22,償却率!$C$2:$D$2,0)))","v":""},null,"",{"$nulls":3},"",null,""]
[{"$nulls":14},"",null,"",null,{"$f":"IF(OR(K23=\"\",R23=\"\",ISNA(VLOOKUP(R23,償却率!$B$2:$D$101,1,FALSE))),\"\",INDEX(償却率!$C$3:$D$101,MATCH(R23,償却率!$B$3:$B$101,0),MATCH(K23,償却率!$C$2:$D$2,0)))","v":""},null,"",{"$nulls":3},"",null,""]
[{"$nulls":14},"",null,"",null,{"$f":"IF(OR(K24=\"\",R24=\"\",ISNA(VLOOKUP(R24,償却率!$B$2:$D$101,1,FALSE))),\"\",INDEX(償却率!$C$3:$D$101,MATCH(R24,償却率!$B$3:$B$101,0),MATCH(K24,償却率!$C$2:$D$2,0)))","v":""},null,"",{"$nulls":3},"",null,""]
[{"$nulls":14},"",null,"",null,{"$f":"IF(OR(K25=\"\",R25=\"\",ISNA(VLOOKUP(R25,償却率!$B$2:$D$101,1,FALSE))),\"\",INDEX(償却率!$C$3:$D$101,MATCH(R25,償却率!$B$3:$B$101,0),MATCH(K25,償却率!$C$2:$D$2,0)))","v":""},null,"",{"$nulls":3},"",null,""]
[{"$nulls":14},"",null,"",null,{"$f":"IF(OR(K26=\"\",R26=\"\",ISNA(VLOOKUP(R26,償却率!$B$2:$D$101,1,FALSE))),\"\",INDEX(償却率!$C$3:$D$101,MATCH(R26,償却率!$B$3:$B$101,0),MATCH(K26,償却率!$C$2:$D$2,0)))","v":""},null,"",{"$nulls":3},"",null,""]
[{"$nulls":14},"",null,"",null,{"$f":"IF(OR(K27=\"\",R27=\"\",ISNA(VLOOKUP(R27,償却率!$B$2:$D$101,1,FALSE))),\"\",INDEX(償却率!$C$3:$D$101,MATCH(R27,償却率!$B$3:$B$101,0),MATCH(K27,償却率!$C$2:$D$2,0)))","v":""},null,"",{"$nulls":3},"",null,""]
[{"$nulls":14},"",null,"",null,{"$f":"IF(OR(K28=\"\",R28=\"\",ISNA(VLOOKUP(R28,償却率!$B$2:$D$101,1,FALSE))),\"\",INDEX(償却率!$C$3:$D$101,MATCH(R28,償却率!$B$3:$B$101,0),MATCH(K28,償却率!$C$2:$D$2,0)))","v":""},null,"",{"$nulls":3},"",null,""]