{"text_format":"3","workbook":"xlsx","n_sheets":3,"sheets":["勘定元帳(売掛金）","摘要一覧","使い方"],"not_rendered":{"defined_names":3,"comments":1},"read":"whole","date_system":"1900"}

{"sheet":"勘定元帳(売掛金）","index":0,"n_rows":43,"n_cols":13,"rows_kept":43,"merged":[[0,1,0,2],[1,8,1,11],[3,10,3,11],[4,0,5,0],[4,1,5,1],[4,2,4,5],[4,6,5,7],[4,8,5,8],[4,9,4,10],[4,11,5,11],[4,12,5,12],[5,3,5,5],[6,3,6,5],[6,6,6,7],[7,3,7,5],[7,6,7,7],[8,3,8,5],[8,6,8,7],[9,3,9,5],[9,6,9,7],[10,3,10,5],[10,6,10,7],[11,3,11,5],[11,6,11,7],[12,3,12,5],[12,6,12,7],[13,3,13,5],[13,6,13,7],[14,3,14,5],[14,6,14,7],[15,3,15,5],[15,6,15,7],[16,3,16,5],[16,6,16,7],[17,3,17,5],[17,6,17,7],[18,3,18,5],[18,6,18,7],[19,3,19,5],[19,6,19,7],[20,3,20,5],[20,6,20,7],[21,3,21,5],[21,6,21,7],[22,3,22,5],[22,6,22,7],[23,3,23,5],[23,6,23,7],[24,3,24,5],[24,6,24,7],[25,3,25,5],[25,6,25,7],[26,3,26,5],[26,6,26,7],[27,3,27,5],[27,6,27,7],[28,3,28,5],[28,6,28,7],[29,3,29,5],[29,6,29,7],[30,3,30,5],[30,6,30,7],[31,3,31,5],[31,6,31,7],[32,3,32,5],[32,6,32,7],[33,3,33,5],[33,6,33,7],[34,3,34,5],[34,6,34,7],[35,3,35,5],[35,6,35,7],[36,3,36,5],[36,6,36,7],[37,3,37,5],[37,6,37,7],[38,3,38,5],[38,6,38,7],[39,3,39,5],[39,6,39,7],[40,3,40,5],[40,6,40,7],[41,3,41,5],[41,6,41,7],[42,3,42,5],[42,6,42,7]]}
["No.",1]
[{"$nulls":3},2004,"年",4,"月",null,"売掛金元帳"]
[]
[{"$nulls":10},"消費税率設定",null,{"v":0.05,"d":"5%"}]
["月","日","摘要",{"$nulls":3},"数　量",null,"単　価","売　上",null,"入金額","差引残高"]
[null,null,"コード",{"$nulls":6},"税抜売上額","消費税"]
[{"$f":"IF(B7=\"\",\"\",$F$2)","v":4},1,1,{"$f":"IF(C7=\"\",\"\",IF(ISNA(VLOOKUP(C7,摘要一覧!$B$5:$D$54,2,FALSE)),\"未登録\",VLOOKUP(C7,摘要一覧!$B$5:$D$54,2,FALSE)))","v":"前期繰越"},{"$nulls":4},{"$f":"IF(OR(C7=\"\",ISNA(VLOOKUP(C7,摘要一覧!$B$5:$D$54,3,FALSE))),\"\",IF(VLOOKUP(C7,摘要一覧!$B$5:$D$54,3,FALSE)=\"\",\"\",VLOOKUP(C7,摘要一覧!$B$5:$D$54,3,FALSE)))","v":""},{"$f":"IF(OR(G7=\"\",I7=\"\"),\"\",G7*I7)","v":""},{"$f":"IF(J7=\"\",\"\",ROUNDDOWN(J7*$M$4,0))","v":""},null,{"v":15000,"d":"15,000 "}]
[{"$f":"IF(B8=\"\",\"\",$F$2)","v":4},1,100,{"$f":"IF(C8=\"\",\"\",IF(ISNA(VLOOKUP(C8,摘要一覧!$B$5:$D$54,2,FALSE)),\"未登録\",VLOOKUP(C8,摘要一覧!$B$5:$D$54,2,FALSE)))","v":"パソコン"},null,null,{"v":6,"d":"6 "},null,{"$f":"IF(OR(C8=\"\",ISNA(VLOOKUP(C8,摘要一覧!$B$5:$D$54,3,FALSE))),\"\",IF(VLOOKUP(C8,摘要一覧!$B$5:$D$54,3,FALSE)=\"\",\"\",VLOOKUP(C8,摘要一覧!$B$5:$D$54,3,FALSE)))","v":{"v":120000,"d":"120,000 "}},{"$f":"IF(OR(G8=\"\",I8=\"\"),\"\",G8*I8)","v":{"v":720000,"d":"720,000 "}},{"$f":"IF(J8=\"\",\"\",ROUNDDOWN(J8*$M$4,0))","v":{"v":36000,"d":"36,000 "}},null,{"$f":"IF(AND(J8=\"\",L8=\"\"),\"\",IF(AND(J8=\"\",L8<>\"\"),M7-L8,M7+J8+K8-L8))","v":{"v":771000,"d":"771,000 "}}]
[4,2,101,{"$f":"IF(C9=\"\",\"\",IF(ISNA(VLOOKUP(C9,摘要一覧!$B$5:$D$54,2,FALSE)),\"未登録\",VLOOKUP(C9,摘要一覧!$B$5:$D$54,2,FALSE)))","v":"プリンタ"},null,null,{"v":5,"d":"5 "},null,{"$f":"IF(OR(C9=\"\",ISNA(VLOOKUP(C9,摘要一覧!$B$5:$D$54,3,FALSE))),\"\",IF(VLOOKUP(C9,摘要一覧!$B$5:$D$54,3,FALSE)=\"\",\"\",VLOOKUP(C9,摘要一覧!$B$5:$D$54,3,FALSE)))","v":{"v":38000,"d":"38,000 "}},{"v":190000,"d":"190,000 "},{"v":9500,"d":"9,500 "},null,{"$f":"IF(AND(J9=\"\",L9=\"\"),\"\",IF(AND(J9=\"\",L9<>\"\"),M8-L9,M8+J9+K9-L9))","v":{"v":970500,"d":"970,500 "}}]
[4,10,5,{"$f":"IF(C10=\"\",\"\",IF(ISNA(VLOOKUP(C10,摘要一覧!$B$5:$D$54,2,FALSE)),\"未登録\",VLOOKUP(C10,摘要一覧!$B$5:$D$54,2,FALSE)))","v":"当座預金"},{"$nulls":4},{"$f":"IF(OR(C10=\"\",ISNA(VLOOKUP(C10,摘要一覧!$B$5:$D$54,3,FALSE))),\"\",IF(VLOOKUP(C10,摘要一覧!$B$5:$D$54,3,FALSE)=\"\",\"\",VLOOKUP(C10,摘要一覧!$B$5:$D$54,3,FALSE)))","v":""},"","",{"v":500000,"d":"500,000 "},{"v":470500,"d":"470,500 "}]
["",null,null,{"$f":"IF(C11=\"\",\"\",IF(ISNA(VLOOKUP(C11,摘要一覧!$B$5:$D$54,2,FALSE)),\"未登録\",VLOOKUP(C11,摘要一覧!$B$5:$D$54,2,FALSE)))","v":""},{"$nulls":4},{"$f":"IF(OR(C11=\"\",ISNA(VLOOKUP(C11,摘要一覧!$B$5:$D$54,3,FALSE))),\"\",IF(VLOOKUP(C11,摘要一覧!$B$5:$D$54,3,FALSE)=\"\",\"\",VLOOKUP(C11,摘要一覧!$B$5:$D$54,3,FALSE)))","v":""},"","",null,""]
["",null,null,{"$f":"IF(C12=\"\",\"\",IF(ISNA(VLOOKUP(C12,摘要一覧!$B$5:$D$54,2,FALSE)),\"未登録\",VLOOKUP(C12,摘要一覧!$B$5:$D$54,2,FALSE)))","v":""},{"$nulls":4},{"$f":"IF(OR(C12=\"\",ISNA(VLOOKUP(C12,摘要一覧!$B$5:$D$54,3,FALSE))),\"\",IF(VLOOKUP(C12,摘要一覧!$B$5:$D$54,3,FALSE)=\"\",\"\",VLOOKUP(C12,摘要一覧!$B$5:$D$54,3,FALSE)))","v":""},"","",null,""]
["",null,null,{"$f":"IF(C13=\"\",\"\",IF(ISNA(VLOOKUP(C13,摘要一覧!$B$5:$D$54,2,FALSE)),\"未登録\",VLOOKUP(C13,摘要一覧!$B$5:$D$54,2,FALSE)))","v":""},{"$nulls":4},{"$f":"IF(OR(C13=\"\",ISNA(VLOOKUP(C13,摘要一覧!$B$5:$D$54,3,FALSE))),\"\",IF(VLOOKUP(C13,摘要一覧!$B$5:$D$54,3,FALSE)=\"\",\"\",VLOOKUP(C13,摘要一覧!$B$5:$D$54,3,FALSE)))","v":""},"","",null,""]
["",null,null,{"$f":"IF(C14=\"\",\"\",IF(ISNA(VLOOKUP(C14,摘要一覧!$B$5:$D$54,2,FALSE)),\"未登録\",VLOOKUP(C14,摘要一覧!$B$5:$D$54,2,FALSE)))","v":""},{"$nulls":4},{"$f":"IF(OR(C14=\"\",ISNA(VLOOKUP(C14,摘要一覧!$B$5:$D$54,3,FALSE))),\"\",IF(VLOOKUP(C14,摘要一覧!$B$5:$D$54,3,FALSE)=\"\",\"\",VLOOKUP(C14,摘要一覧!$B$5:$D$54,3,FALSE)))","v":""},"","",null,""]
["",null,null,{"$f":"IF(C15=\"\",\"\",IF(ISNA(VLOOKUP(C15,摘要一覧!$B$5:$D$54,2,FALSE)),\"未登録\",VLOOKUP(C15,摘要一覧!$B$5:$D$54,2,FALSE)))","v":""},{"$nulls":4},{"$f":"IF(OR(C15=\"\",ISNA(VLOOKUP(C15,摘要一覧!$B$5:$D$54,3,FALSE))),\"\",IF(VLOOKUP(C15,摘要一覧!$B$5:$D$54,3,FALSE)=\"\",\"\",VLOOKUP(C15,摘要一覧!$B$5:$D$54,3,FALSE)))","v":""},"","",null,""]
["",null,null,{"$f":"IF(C16=\"\",\"\",IF(ISNA(VLOOKUP(C16,摘要一覧!$B$5:$D$54,2,FALSE)),\"未登録\",VLOOKUP(C16,摘要一覧!$B$5:$D$54,2,FALSE)))","v":""},{"$nulls":4},{"$f":"IF(OR(C16=\"\",ISNA(VLOOKUP(C16,摘要一覧!$B$5:$D$54,3,FALSE))),\"\",IF(VLOOKUP(C16,摘要一覧!$B$5:$D$54,3,FALSE)=\"\",\"\",VLOOKUP(C16,摘要一覧!$B$5:$D$54,3,FALSE)))","v":""},"","",null,""]
["",null,null,{"$f":"IF(C17=\"\",\"\",IF(ISNA(VLOOKUP(C17,摘要一覧!$B$5:$D$54,2,FALSE)),\"未登録\",VLOOKUP(C17,摘要一覧!$B$5:$D$54,2,FALSE)))","v":""},{"$nulls":4},{"$f":"IF(OR(C17=\"\",ISNA(VLOOKUP(C17,摘要一覧!$B$5:$D$54,3,FALSE))),\"\",IF(VLOOKUP(C17,摘要一覧!$B$5:$D$54,3,FALSE)=\"\",\"\",VLOOKUP(C17,摘要一覧!$B$5:$D$54,3,FALSE)))","v":""},"","",null,""]
["",null,null,{"$f":"IF(C18=\"\",\"\",IF(ISNA(VLOOKUP(C18,摘要一覧!$B$5:$D$54,2,FALSE)),\"未登録\",VLOOKUP(C18,摘要一覧!$B$5:$D$54,2,FALSE)))","v":""},{"$nulls":4},{"$f":"IF(OR(C18=\"\",ISNA(VLOOKUP(C18,摘要一覧!$B$5:$D$54,3,FALSE))),\"\",IF(VLOOKUP(C18,摘要一覧!$B$5:$D$54,3,FALSE)=\"\",\"\",VLOOKUP(C18,摘要一覧!$B$5:$D$54,3,FALSE)))","v":""},"","",null,""]
["",null,null,{"$f":"IF(C19=\"\",\"\",IF(ISNA(VLOOKUP(C19,摘要一覧!$B$5:$D$54,2,FALSE)),\"未登録\",VLOOKUP(C19,摘要一覧!$B$5:$D$54,2,FALSE)))","v":""},{"$nulls":4},{"$f":"IF(OR(C19=\"\",ISNA(VLOOKUP(C19,摘要一覧!$B$5:$D$54,3,FALSE))),\"\",IF(VLOOKUP(C19,摘要一覧!$B$5:$D$54,3,FALSE)=\"\",\"\",VLOOKUP(C19,摘要一覧!$B$5:$D$54,3,FALSE)))","v":""},"","",null,""]
["",null,null,{"$f":"IF(C20=\"\",\"\",IF(ISNA(VLOOKUP(C20,摘要一覧!$B$5:$D$54,2,FALSE)),\"未登録\",VLOOKUP(C20,摘要一覧!$B$5:$D$54,2,FALSE)))","v":""},{"$nulls":4},{"$f":"IF(OR(C20=\"\",ISNA(VLOOKUP(C20,摘要一覧!$B$5:$D$54,3,FALSE))),\"\",IF(VLOOKUP(C20,摘要一覧!$B$5:$D$54,3,FALSE)=\"\",\"\",VLOOKUP(C20,摘要一覧!$B$5:$D$54,3,FALSE)))","v":""},"","",null,""]
["",null,null,{"$f":"IF(C21=\"\",\"\",IF(ISNA(VLOOKUP(C21,摘要一覧!$B$5:$D$54,2,FALSE)),\"未登録\",VLOOKUP(C21,摘要一覧!$B$5:$D$54,2,FALSE)))","v":""},{"$nulls":4},{"$f":"IF(OR(C21=\"\",ISNA(VLOOKUP(C21,摘要一覧!$B$5:$D$54,3,FALSE))),\"\",IF(VLOOKUP(C21,摘要一覧!$B$5:$D$54,3,FALSE)=\"\",\"\",VLOOKUP(C21,摘要一覧!$B$5:$D$54,3,FALSE)))","v":""},"","",null,""]
["",null,null,{"$f":"IF(C22=\"\",\"\",IF(ISNA(VLOOKUP(C22,摘要一覧!$B$5:$D$54,2,FALSE)),\"未登録\",VLOOKUP(C22,摘要一覧!$B$5:$D$54,2,FALSE)))","v":""},{"$nulls":4},{"$f":"IF(OR(C22=\"\",ISNA(VLOOKUP(C22,摘要一覧!$B$5:$D$54,3,FALSE))),\"\",IF(VLOOKUP(C22,摘要一覧!$B$5:$D$54,3,FALSE)=\"\",\"\",VLOOKUP(C22,摘要一覧!$B$5:$D$54,3,FALSE)))","v":""},"","",null,""]
["",null,null,{"$f":"IF(C23=\"\",\"\",IF(ISNA(VLOOKUP(C23,摘要一覧!$B$5:$D$54,2,FALSE)),\"未登録\",VLOOKUP(C23,摘要一覧!$B$5:$D$54,2,FALSE)))","v":""},{"$nulls":4},{"$f":"IF(OR(C23=\"\",ISNA(VLOOKUP(C23,摘要一覧!$B$5:$D$54,3,FALSE))),\"\",IF(VLOOKUP(C23,摘要一覧!$B$5:$D$54,3,FALSE)=\"\",\"\",VLOOKUP(C23,摘要一覧!$B$5:$D$54,3,FALSE)))","v":""},"","",null,""]
["",null,null,{"$f":"IF(C24=\"\",\"\",IF(ISNA(VLOOKUP(C24,摘要一覧!$B$5:$D$54,2,FALSE)),\"未登録\",VLOOKUP(C24,摘要一覧!$B$5:$D$54,2,FALSE)))","v":""},{"$nulls":4},{"$f":"IF(OR(C24=\"\",ISNA(VLOOKUP(C24,摘要一覧!$B$5:$D$54,3,FALSE))),\"\",IF(VLOOKUP(C24,摘要一覧!$B$5:$D$54,3,FALSE)=\"\",\"\",VLOOKUP(C24,摘要一覧!$B$5:$D$54,3,FALSE)))","v":""},"","",null,""]
["",null,null,{"$f":"IF(C25=\"\",\"\",IF(ISNA(VLOOKUP(C25,摘要一覧!$B$5:$D$54,2,FALSE)),\"未登録\",VLOOKUP(C25,摘要一覧!$B$5:$D$54,2,FALSE)))","v":""},{"$nulls":4},{"$f":"IF(OR(C25=\"\",ISNA(VLOOKUP(C25,摘要一覧!$B$5:$D$54,3,FALSE))),\"\",IF(VLOOKUP(C25,摘要一覧!$B$5:$D$54,3,FALSE)=\"\",\"\",VLOOKUP(C25,摘要一覧!$B$5:$D$54,3,FALSE)))","v":""},"","",null,""]
["",null,null,{"$f":"IF(C26=\"\",\"\",IF(ISNA(VLOOKUP(C26,摘要一覧!$B$5:$D$54,2,FALSE)),\"未登録\",VLOOKUP(C26,摘要一覧!$B$5:$D$54,2,FALSE)))","v":""},{"$nulls":4},{"$f":"IF(OR(C26=\"\",ISNA(VLOOKUP(C26,摘要一覧!$B$5:$D$54,3,FALSE))),\"\",IF(VLOOKUP(C26,摘要一覧!$B$5:$D$54,3,FALSE)=\"\",\"\",VLOOKUP(C26,摘要一覧!$B$5:$D$54,3,FALSE)))","v":""},"","",null,""]
["",null,null,{"$f":"IF(C27=\"\",\"\",IF(ISNA(VLOOKUP(C27,摘要一覧!$B$5:$D$54,2,FALSE)),\"未登録\",VLOOKUP(C27,摘要一覧!$B$5:$D$54,2,FALSE)))","v":""},{"$nulls":4},{"$f":"IF(OR(C27=\"\",ISNA(VLOOKUP(C27,摘要一覧!$B$5:$D$54,3,FALSE))),\"\",IF(VLOOKUP(C27,摘要一覧!$B$5:$D$54,3,FALSE)=\"\",\"\",VLOOKUP(C27,摘要一覧!$B$5:$D$54,3,FALSE)))","v":""},"","",null,""]
["",null,null,{"$f":"IF(C28=\"\",\"\",IF(ISNA(VLOOKUP(C28,摘要一覧!$B$5:$D$54,2,FALSE)),\"未登録\",VLOOKUP(C28,摘要一覧!$B$5:$D$54,2,FALSE)))","v":""},{"$nulls":4},{"$f":"IF(OR(C28=\"\",ISNA(VLOOKUP(C28,摘要一覧!$B$5:$D$54,3,FALSE))),\"\",IF(VLOOKUP(C28,摘要一覧!$B$5:$D$54,3,FALSE)=\"\",\"\",VLOOKUP(C28,摘要一覧!$B$5:$D$54,3,FALSE)))","v":""},"","",null,""]
["",null,null,{"$f":"IF(C29=\"\",\"\",IF(ISNA(VLOOKUP(C29,摘要一覧!$B$5:$D$54,2,FALSE)),\"未登録\",VLOOKUP(C29,摘要一覧!$B$5:$D$54,2,FALSE)))","v":""},{"$nulls":4},{"$f":"IF(OR(C29=\"\",ISNA(VLOOKUP(C29,摘要一覧!$B$5:$D$54,3,FALSE))),\"\",IF(VLOOKUP(C29,摘要一覧!$B$5:$D$54,3,FALSE)=\"\",\"\",VLOOKUP(C29,摘要一覧!$B$5:$D$54,3,FALSE)))","v":""},"","",null,""]
["",null,null,{"$f":"IF(C30=\"\",\"\",IF(ISNA(VLOOKUP(C30,摘要一覧!$B$5:$D$54,2,FALSE)),\"未登録\",VLOOKUP(C30,摘要一覧!$B$5:$D$54,2,FALSE)))","v":""},{"$nulls":4},{"$f":"IF(OR(C30=\"\",ISNA(VLOOKUP(C30,摘要一覧!$B$5:$D$54,3,FALSE))),\"\",IF(VLOOKUP(C30,摘要一覧!$B$5:$D$54,3,FALSE)=\"\",\"\",VLOOKUP(C30,摘要一覧!$B$5:$D$54,3,FALSE)))","v":""},"","",null,""]
{"$rows_left_out":14}
{"sheet":"摘要一覧","index":1,"n_rows":12,"n_cols":4,"rows_kept":12,"merged":[[3,1,3,3]]}
[null,"※コードNOと摘要、単価を、セルB5からセルD54に設定したコードマスターを入力してください。"]
[null,"コードNOは重複しないように設定してください。"]
[]
[null,"コードマスター"]
[null,"コードNO","摘要","単価"]
[null,1,"前期繰越"]
[null,2,"前月繰越"]
[null,3,"手形"]
[null,4,"現金"]
[null,5,"当座預金"]
[null,100,"パソコン",{"v":120000,"d":"120,000 "}]
[null,101,"プリンタ",{"v":38000,"d":"38,000 "}]

{"sheet":"使い方","index":2,"n_rows":43,"n_cols":13,"rows_kept":43,"merged":[[0,1,0,2],[1,8,1,11],[3,10,3,11],[4,0,5,0],[4,1,5,1],[4,2,4,5],[4,6,5,7],[4,8,5,8],[4,9,4,10],[4,11,5,11],[4,12,5,12],[5,3,5,5],[6,3,6,5],[6,6,6,7],[7,3,7,5],[7,6,7,7],[8,3,8,5],[8,6,8,7],[9,3,9,5],[9,6,9,7],[10,3,10,5],[10,6,10,7],[11,3,11,5],[11,6,11,7],[12,3,12,5],[12,6,12,7],[13,3,13,5],[13,6,13,7],[14,3,14,5],[14,6,14,7],[15,3,15,5],[15,6,15,7],[16,3,16,5],[16,6,16,7],[17,3,17,5],[17,6,17,7],[18,3,18,5],[18,6,18,7],[19,3,19,5],[19,6,19,7],[20,3,20,5],[20,6,20,7],[21,3,21,5],[21,6,21,7],[22,3,22,5],[22,6,22,7],[23,3,23,5],[23,6,23,7],[24,3,24,5],[24,6,24,7],[25,3,25,5],[25,6,25,7],[26,3,26,5],[26,6,26,7],[27,3,27,5],[27,6,27,7],[28,3,28,5],[28,6,28,7],[29,3,29,5],[29,6,29,7],[30,3,30,5],[30,6,30,7],[31,3,31,5],[31,6,31,7],[32,3,32,5],[32,6,32,7],[33,3,33,5],[33,6,33,7],[34,3,34,5],[34,6,34,7],[35,3,35,5],[35,6,35,7],[36,3,36,5],[36,6,36,7],[37,3,37,5],[37,6,37,7],[38,3,38,5],[38,6,38,7],[39,3,39,5],[39,6,39,7],[40,3,40,5],[40,6,40,7],[41,3,41,5],[41,6,41,7],[42,3,42,5],[42,6,42,7]]}
["No.",1]
[{"$nulls":3},2004,"年",4,"月",null,"売掛金元帳"]
[]
[{"$nulls":10},"消費税率設定",null,{"v":0.05,"d":"5%"}]
["月","日","摘要",{"$nulls":3},"数　量",null,"単　価","売　上",null,"入金額","差引残高"]
[null,null,"コード",{"$nulls":6},"税抜売上額","消費税"]
[{"$f":"IF(B7=\"\",\"\",$F$2)","v":4},10,1,{"$f":"IF(C7=\"\",\"\",IF(ISNA(VLOOKUP(C7,摘要一覧!$B$5:$D$54,2,FALSE)),\"未登録\",VLOOKUP(C7,摘要一覧!$B$5:$D$54,2,FALSE)))","v":"前期繰越"},{"$nulls":4},{"$f":"IF(OR(C7=\"\",ISNA(VLOOKUP(C7,摘要一覧!$B$5:$D$54,3,FALSE))),\"\",IF(VLOOKUP(C7,摘要一覧!$B$5:$D$54,3,FALSE)=\"\",\"\",VLOOKUP(C7,摘要一覧!$B$5:$D$54,3,FALSE)))","v":""},{"$f":"IF(OR(G7=\"\",I7=\"\"),\"\",G7*I7)","v":""},{"$f":"IF(J7=\"\",\"\",ROUNDDOWN(J7*$M$4,0))","v":""},null,{"v":15000,"d":"15,000 "}]
[4,1,100,{"$f":"IF(C8=\"\",\"\",IF(ISNA(VLOOKUP(C8,摘要一覧!$B$5:$D$54,2,FALSE)),\"未登録\",VLOOKUP(C8,摘要一覧!$B$5:$D$54,2,FALSE)))","v":"パソコン"},null,null,{"v":6,"d":"6 "},null,{"$f":"IF(OR(C8=\"\",ISNA(VLOOKUP(C8,摘要一覧!$B$5:$D$54,3,FALSE))),\"\",IF(VLOOKUP(C8,摘要一覧!$B$5:$D$54,3,FALSE)=\"\",\"\",VLOOKUP(C8,摘要一覧!$B$5:$D$54,3,FALSE)))","v":{"v":120000,"d":"120,000 "}},{"$f":"IF(OR(G8=\"\",I8=\"\"),\"\",G8*I8)","v":{"v":720000,"d":"720,000 "}},{"$f":"IF(J8=\"\",\"\",ROUNDDOWN(J8*$M$4,0))","v":{"v":36000,"d":"36,000 "}},null,{"$f":"IF(AND(J8=\"\",L8=\"\"),\"\",IF(AND(J8=\"\",L8<>\"\"),M7-L8,M7+J8+K8-L8))","v":{"v":771000,"d":"771,000 "}}]
[4,2,101,{"$f":"IF(C9=\"\",\"\",IF(ISNA(VLOOKUP(C9,摘要一覧!$B$5:$D$54,2,FALSE)),\"未登録\",VLOOKUP(C9,摘要一覧!$B$5:$D$54,2,FALSE)))","v":"プリンタ"},null,null,{"v":5,"d":"5 "},null,{"$f":"IF(OR(C9=\"\",ISNA(VLOOKUP(C9,摘要一覧!$B$5:$D$54,3,FALSE))),\"\",IF(VLOOKUP(C9,摘要一覧!$B$5:$D$54,3,FALSE)=\"\",\"\",VLOOKUP(C9,摘要一覧!$B$5:$D$54,3,FALSE)))","v":{"v":38000,"d":"38,000 "}},{"v":190000,"d":"190,000 "},{"v":9500,"d":"9,500 "},null,{"$f":"IF(AND(J9=\"\",L9=\"\"),\"\",IF(AND(J9=\"\",L9<>\"\"),M8-L9,M8+J9+K9-L9))","v":{"v":970500,"d":"970,500 "}}]
["",null,5,{"$f":"IF(C10=\"\",\"\",IF(ISNA(VLOOKUP(C10,摘要一覧!$B$5:$D$54,2,FALSE)),\"未登録\",VLOOKUP(C10,摘要一覧!$B$5:$D$54,2,FALSE)))","v":"当座預金"},{"$nulls":4},{"$f":"IF(OR(C10=\"\",ISNA(VLOOKUP(C10,摘要一覧!$B$5:$D$54,3,FALSE))),\"\",IF(VLOOKUP(C10,摘要一覧!$B$5:$D$54,3,FALSE)=\"\",\"\",VLOOKUP(C10,摘要一覧!$B$5:$D$54,3,FALSE)))","v":""},"","",{"v":500000,"d":"500,000 "},{"v":470500,"d":"470,500 "}]
["",null,105,{"$f":"IF(C11=\"\",\"\",IF(ISNA(VLOOKUP(C11,摘要一覧!$B$5:$D$54,2,FALSE)),\"未登録\",VLOOKUP(C11,摘要一覧!$B$5:$D$54,2,FALSE)))","v":"未登録"},{"$nulls":4},{"$f":"IF(OR(C11=\"\",ISNA(VLOOKUP(C11,摘要一覧!$B$5:$D$54,3,FALSE))),\"\",IF(VLOOKUP(C11,摘要一覧!$B$5:$D$54,3,FALSE)=\"\",\"\",VLOOKUP(C11,摘要一覧!$B$5:$D$54,3,FALSE)))","v":""},"","",null,""]
["",null,null,{"$f":"IF(C12=\"\",\"\",IF(ISNA(VLOOKUP(C12,摘要一覧!$B$5:$D$54,2,FALSE)),\"未登録\",VLOOKUP(C12,摘要一覧!$B$5:$D$54,2,FALSE)))","v":""},{"$nulls":4},{"$f":"IF(OR(C12=\"\",ISNA(VLOOKUP(C12,摘要一覧!$B$5:$D$54,3,FALSE))),\"\",IF(VLOOKUP(C12,摘要一覧!$B$5:$D$54,3,FALSE)=\"\",\"\",VLOOKUP(C12,摘要一覧!$B$5:$D$54,3,FALSE)))","v":""},"","",null,""]
["",null,null,{"$f":"IF(C13=\"\",\"\",IF(ISNA(VLOOKUP(C13,摘要一覧!$B$5:$D$54,2,FALSE)),\"未登録\",VLOOKUP(C13,摘要一覧!$B$5:$D$54,2,FALSE)))","v":""},{"$nulls":4},{"$f":"IF(OR(C13=\"\",ISNA(VLOOKUP(C13,摘要一覧!$B$5:$D$54,3,FALSE))),\"\",IF(VLOOKUP(C13,摘要一覧!$B$5:$D$54,3,FALSE)=\"\",\"\",VLOOKUP(C13,摘要一覧!$B$5:$D$54,3,FALSE)))","v":""},"","",null,""]
["",null,null,{"$f":"IF(C14=\"\",\"\",IF(ISNA(VLOOKUP(C14,摘要一覧!$B$5:$D$54,2,FALSE)),\"未登録\",VLOOKUP(C14,摘要一覧!$B$5:$D$54,2,FALSE)))","v":""},{"$nulls":4},{"$f":"IF(OR(C14=\"\",ISNA(VLOOKUP(C14,摘要一覧!$B$5:$D$54,3,FALSE))),\"\",IF(VLOOKUP(C14,摘要一覧!$B$5:$D$54,3,FALSE)=\"\",\"\",VLOOKUP(C14,摘要一覧!$B$5:$D$54,3,FALSE)))","v":""},"","",null,""]
["",null,null,{"$f":"IF(C15=\"\",\"\",IF(ISNA(VLOOKUP(C15,摘要一覧!$B$5:$D$54,2,FALSE)),\"未登録\",VLOOKUP(C15,摘要一覧!$B$5:$D$54,2,FALSE)))","v":""},{"$nulls":4},{"$f":"IF(OR(C15=\"\",ISNA(VLOOKUP(C15,摘要一覧!$B$5:$D$54,3,FALSE))),\"\",IF(VLOOKUP(C15,摘要一覧!$B$5:$D$54,3,FALSE)=\"\",\"\",VLOOKUP(C15,摘要一覧!$B$5:$D$54,3,FALSE)))","v":""},"","",null,""]
["",null,null,{"$f":"IF(C16=\"\",\"\",IF(ISNA(VLOOKUP(C16,摘要一覧!$B$5:$D$54,2,FALSE)),\"未登録\",VLOOKUP(C16,摘要一覧!$B$5:$D$54,2,FALSE)))","v":""},{"$nulls":4},{"$f":"IF(OR(C16=\"\",ISNA(VLOOKUP(C16,摘要一覧!$B$5:$D$54,3,FALSE))),\"\",IF(VLOOKUP(C16,摘要一覧!$B$5:$D$54,3,FALSE)=\"\",\"\",VLOOKUP(C16,摘要一覧!$B$5:$D$54,3,FALSE)))","v":""},"","",null,""]
["",null,null,{"$f":"IF(C17=\"\",\"\",IF(ISNA(VLOOKUP(C17,摘要一覧!$B$5:$D$54,2,FALSE)),\"未登録\",VLOOKUP(C17,摘要一覧!$B$5:$D$54,2,FALSE)))","v":""},{"$nulls":4},{"$f":"IF(OR(C17=\"\",ISNA(VLOOKUP(C17,摘要一覧!$B$5:$D$54,3,FALSE))),\"\",IF(VLOOKUP(C17,摘要一覧!$B$5:$D$54,3,FALSE)=\"\",\"\",VLOOKUP(C17,摘要一覧!$B$5:$D$54,3,FALSE)))","v":""},"","",null,""]
["",null,null,{"$f":"IF(C18=\"\",\"\",IF(ISNA(VLOOKUP(C18,摘要一覧!$B$5:$D$54,2,FALSE)),\"未登録\",VLOOKUP(C18,摘要一覧!$B$5:$D$54,2,FALSE)))","v":""},{"$nulls":4},{"$f":"IF(OR(C18=\"\",ISNA(VLOOKUP(C18,摘要一覧!$B$5:$D$54,3,FALSE))),\"\",IF(VLOOKUP(C18,摘要一覧!$B$5:$D$54,3,FALSE)=\"\",\"\",VLOOKUP(C18,摘要一覧!$B$5:$D$54,3,FALSE)))","v":""},"","",null,""]
["",null,null,{"$f":"IF(C19=\"\",\"\",IF(ISNA(VLOOKUP(C19,摘要一覧!$B$5:$D$54,2,FALSE)),\"未登録\",VLOOKUP(C19,摘要一覧!$B$5:$D$54,2,FALSE)))","v":""},{"$nulls":4},{"$f":"IF(OR(C19=\"\",ISNA(VLOOKUP(C19,摘要一覧!$B$5:$D$54,3,FALSE))),\"\",IF(VLOOKUP(C19,摘要一覧!$B$5:$D$54,3,FALSE)=\"\",\"\",VLOOKUP(C19,摘要一覧!$B$5:$D$54,3,FALSE)))","v":""},"","",null,""]
["",null,null,{"$f":"IF(C20=\"\",\"\",IF(ISNA(VLOOKUP(C20,摘要一覧!$B$5:$D$54,2,FALSE)),\"未登録\",VLOOKUP(C20,摘要一覧!$B$5:$D$54,2,FALSE)))","v":""},{"$nulls":4},{"$f":"IF(OR(C20=\"\",ISNA(VLOOKUP(C20,摘要一覧!$B$5:$D$54,3,FALSE))),\"\",IF(VLOOKUP(C20,摘要一覧!$B$5:$D$54,3,FALSE)=\"\",\"\",VLOOKUP(C20,摘要一覧!$B$5:$D$54,3,FALSE)))","v":""},"","",null,""]
["",null,null,{"$f":"IF(C21=\"\",\"\",IF(ISNA(VLOOKUP(C21,摘要一覧!$B$5:$D$54,2,FALSE)),\"未登録\",VLOOKUP(C21,摘要一覧!$B$5:$D$54,2,FALSE)))","v":""},{"$nulls":4},{"$f":"IF(OR(C21=\"\",ISNA(VLOOKUP(C21,摘要一覧!$B$5:$D$54,3,FALSE))),\"\",IF(VLOOKUP(C21,摘要一覧!$B$5:$D$54,3,FALSE)=\"\",\"\",VLOOKUP(C21,摘要一覧!$B$5:$D$54,3,FALSE)))","v":""},"","",null,""]
["",null,null,{"$f":"IF(C22=\"\",\"\",IF(ISNA(VLOOKUP(C22,摘要一覧!$B$5:$D$54,2,FALSE)),\"未登録\",VLOOKUP(C22,摘要一覧!$B$5:$D$54,2,FALSE)))","v":""},{"$nulls":4},{"$f":"IF(OR(C22=\"\",ISNA(VLOOKUP(C22,摘要一覧!$B$5:$D$54,3,FALSE))),\"\",IF(VLOOKUP(C22,摘要一覧!$B$5:$D$54,3,FALSE)=\"\",\"\",VLOOKUP(C22,摘要一覧!$B$5:$D$54,3,FALSE)))","v":""},"","",null,""]
["",null,null,{"$f":"IF(C23=\"\",\"\",IF(ISNA(VLOOKUP(C23,摘要一覧!$B$5:$D$54,2,FALSE)),\"未登録\",VLOOKUP(C23,摘要一覧!$B$5:$D$54,2,FALSE)))","v":""},{"$nulls":4},{"$f":"IF(OR(C23=\"\",ISNA(VLOOKUP(C23,摘要一覧!$B$5:$D$54,3,FALSE))),\"\",IF(VLOOKUP(C23,摘要一覧!$B$5:$D$54,3,FALSE)=\"\",\"\",VLOOKUP(C23,摘要一覧!$B$5:$D$54,3,FALSE)))","v":""},"","",null,""]
["",null,null,{"$f":"IF(C24=\"\",\"\",IF(ISNA(VLOOKUP(C24,摘要一覧!$B$5:$D$54,2,FALSE)),\"未登録\",VLOOKUP(C24,摘要一覧!$B$5:$D$54,2,FALSE)))","v":""},{"$nulls":4},{"$f":"IF(OR(C24=\"\",ISNA(VLOOKUP(C24,摘要一覧!$B$5:$D$54,3,FALSE))),\"\",IF(VLOOKUP(C24,摘要一覧!$B$5:$D$54,3,FALSE)=\"\",\"\",VLOOKUP(C24,摘要一覧!$B$5:$D$54,3,FALSE)))","v":""},"","",null,""]
["",null,null,{"$f":"IF(C25=\"\",\"\",IF(ISNA(VLOOKUP(C25,摘要一覧!$B$5:$D$54,2,FALSE)),\"未登録\",VLOOKUP(C25,摘要一覧!$B$5:$D$54,2,FALSE)))","v":""},{"$nulls":4},{"$f":"IF(OR(C25=\"\",ISNA(VLOOKUP(C25,摘要一覧!$B$5:$D$54,3,FALSE))),\"\",IF(VLOOKUP(C25,摘要一覧!$B$5:$D$54,3,FALSE)=\"\",\"\",VLOOKUP(C25,摘要一覧!$B$5:$D$54,3,FALSE)))","v":""},"","",null,""]
["",null,null,{"$f":"IF(C26=\"\",\"\",IF(ISNA(VLOOKUP(C26,摘要一覧!$B$5:$D$54,2,FALSE)),\"未登録\",VLOOKUP(C26,摘要一覧!$B$5:$D$54,2,FALSE)))","v":""},{"$nulls":4},{"$f":"IF(OR(C26=\"\",ISNA(VLOOKUP(C26,摘要一覧!$B$5:$D$54,3,FALSE))),\"\",IF(VLOOKUP(C26,摘要一覧!$B$5:$D$54,3,FALSE)=\"\",\"\",VLOOKUP(C26,摘要一覧!$B$5:$D$54,3,FALSE)))","v":""},"","",null,""]
["",null,null,{"$f":"IF(C27=\"\",\"\",IF(ISNA(VLOOKUP(C27,摘要一覧!$B$5:$D$54,2,FALSE)),\"未登録\",VLOOKUP(C27,摘要一覧!$B$5:$D$54,2,FALSE)))","v":""},{"$nulls":4},{"$f":"IF(OR(C27=\"\",ISNA(VLOOKUP(C27,摘要一覧!$B$5:$D$54,3,FALSE))),\"\",IF(VLOOKUP(C27,摘要一覧!$B$5:$D$54,3,FALSE)=\"\",\"\",VLOOKUP(C27,摘要一覧!$B$5:$D$54,3,FALSE)))","v":""},"","",null,""]
["",null,null,{"$f":"IF(C28=\"\",\"\",IF(ISNA(VLOOKUP(C28,摘要一覧!$B$5:$D$54,2,FALSE)),\"未登録\",VLOOKUP(C28,摘要一覧!$B$5:$D$54,2,FALSE)))","v":""},{"$nulls":4},{"$f":"IF(OR(C28=\"\",ISNA(VLOOKUP(C28,摘要一覧!$B$5:$D$54,3,FALSE))),\"\",IF(VLOOKUP(C28,摘要一覧!$B$5:$D$54,3,FALSE)=\"\",\"\",VLOOKUP(C28,摘要一覧!$B$5:$D$54,3,FALSE)))","v":""},"","",null,""]
["",null,null,{"$f":"IF(C29=\"\",\"\",IF(ISNA(VLOOKUP(C29,摘要一覧!$B$5:$D$54,2,FALSE)),\"未登録\",VLOOKUP(C29,摘要一覧!$B$5:$D$54,2,FALSE)))","v":""},{"$nulls":4},{"$f":"IF(OR(C29=\"\",ISNA(VLOOKUP(C29,摘要一覧!$B$5:$D$54,3,FALSE))),\"\",IF(VLOOKUP(C29,摘要一覧!$B$5:$D$54,3,FALSE)=\"\",\"\",VLOOKUP(C29,摘要一覧!$B$5:$D$54,3,FALSE)))","v":""},"","",null,""]
["",null,null,{"$f":"IF(C30=\"\",\"\",IF(ISNA(VLOOKUP(C30,摘要一覧!$B$5:$D$54,2,FALSE)),\"未登録\",VLOOKUP(C30,摘要一覧!$B$5:$D$54,2,FALSE)))","v":""},{"$nulls":4},{"$f":"IF(OR(C30=\"\",ISNA(VLOOKUP(C30,摘要一覧!$B$5:$D$54,3,FALSE))),\"\",IF(VLOOKUP(C30,摘要一覧!$B$5:$D$54,3,FALSE)=\"\",\"\",VLOOKUP(C30,摘要一覧!$B$5:$D$54,3,FALSE)))","v":""},"","",null,""]
{"$rows_left_out":13}