{"text_format":"3","workbook":"xlsx","n_sheets":9,"sheets":["全科目","科目 1","科目 2","科目 3","科目 4","科目 5","科目 6","科目 7","GPA 表"],"not_rendered":{"defined_names":8},"read":"whole","date_system":"1900"}

{"sheet":"全科目","index":0,"n_rows":12,"n_cols":7,"rows_kept":12,"merged":[[1,1,1,2]]}
[]
[null,"大学名",null,"氏名:",null,"学期/年度:"]
[]
[null,"科目","履修時間","履修率","5 段階評価","平均GPA","GPA"]
[null,"科目 1",{"v":3,"d":"3.0"},{"$f":"'科目 1'!D$36","v":{"v":0.8661764705882353,"d":"86.62%"}},{"$f":"IF(D5<>\"\",HLOOKUP(D5,'GPA 表'!$C$5:$O$7,2),\"\")","v":"B"},{"$f":"IF(D5<>\"\",HLOOKUP(D5,'GPA 表'!$C$5:$O$7,3),\"\")","v":{"v":3,"d":"3.00"}},{"$f":"IF(F5<>\"\",F5*C5/(SUM($C$5:$C$11)), \"\")","v":{"v":0.5625,"d":"0.56"}}]
[null,"科目 2",{"v":4,"d":"4.0"},{"$f":"'科目 2'!D$36","v":""},{"$f":"IF(D6<>\"\",HLOOKUP(D6,'GPA 表'!$C$5:$O$7,2),\"\")","v":""},{"$f":"IF(D6<>\"\",HLOOKUP(D6,'GPA 表'!$C$5:$O$7,3),\"\")","v":""},""]
[null,"科目 3",{"v":2,"d":"2.0"},{"$f":"'科目 3'!D$36","v":""},{"$f":"IF(D7<>\"\",HLOOKUP(D7,'GPA 表'!$C$5:$O$7,2),\"\")","v":""},{"$f":"IF(D7<>\"\",HLOOKUP(D7,'GPA 表'!$C$5:$O$7,3),\"\")","v":""},""]
[null,"科目 4",{"v":4,"d":"4.0"},{"$f":"'科目 4'!D$36","v":""},{"$f":"IF(D8<>\"\",HLOOKUP(D8,'GPA 表'!$C$5:$O$7,2),\"\")","v":""},{"$f":"IF(D8<>\"\",HLOOKUP(D8,'GPA 表'!$C$5:$O$7,3),\"\")","v":""},""]
[null,"科目 5",{"v":1,"d":"1.0"},{"$f":"'科目 5'!D$36","v":""},{"$f":"IF(D9<>\"\",HLOOKUP(D9,'GPA 表'!$C$5:$O$7,2),\"\")","v":""},{"$f":"IF(D9<>\"\",HLOOKUP(D9,'GPA 表'!$C$5:$O$7,3),\"\")","v":""},""]
[null,"科目 6",{"v":1,"d":"1.0"},{"$f":"'科目 6'!D$36","v":""},{"$f":"IF(D10<>\"\",HLOOKUP(D10,'GPA 表'!$C$5:$O$7,2),\"\")","v":""},{"$f":"IF(D10<>\"\",HLOOKUP(D10,'GPA 表'!$C$5:$O$7,3),\"\")","v":""},""]
[null,"科目 7",{"v":1,"d":"1.0"},{"$f":"'科目 7'!D$36","v":""},{"$f":"IF(D11<>\"\",HLOOKUP(D11,'GPA 表'!$C$5:$O$7,2),\"\")","v":""},{"$f":"IF(D11<>\"\",HLOOKUP(D11,'GPA 表'!$C$5:$O$7,3),\"\")","v":""},""]
[null,"合計",{"$f":"SUM(C5:C11)","v":16},{"$f":"AVERAGE(D5:D11)","v":{"v":0.8661764705882353,"d":"86.62%"}},{"$f":"IF(D12<>\"\",HLOOKUP(D12,'GPA 表'!$C$5:$O$7,2),\"\")","v":"B"},{"$f":"AVERAGE(F5:F11)","v":{"v":3,"d":"3.00"}},{"$f":"SUM(G5:G11)","v":{"v":0.5625,"d":"0.56"}}]

{"sheet":"科目 1","index":1,"n_rows":38,"n_cols":8,"rows_kept":38,"merged":[[1,1,1,2]]}
[]
[null,{"$f":"全科目!B5","v":"科目 1"}]
[null,"教授 :",null,null,"得点率",null,null,{"$f":"IF(SUM($C$35:$H$35) <> 0,SUM($C$34:$H$34)/SUM($C$35:$H$35),\"\")","v":{"v":0.8661764705882353,"d":"86.62%"}}]
[null,"電子メール :",null,null,"現在の成績",null,null,{"$f":"SUM($C$34:$H$34)","v":{"v":0.17323529411764707,"d":"17.32%"}}]
[]
[null,"課題","宿題","小論文","小テスト","プロジェクト","中間試験","期末試験"]
[null,"比重",{"v":0.1,"d":"10.0%"},{"v":0.1,"d":"10.0%"},{"v":0.15,"d":"15.0%"},{"v":0.15,"d":"15.0%"},{"v":0.2,"d":"20.0%"},{"v":0.3,"d":"30.0%"}]
[null,"最初の宿題",{"v":0.8823529411764706,"d":"0.88"}]
[null,"第二次世界大戦についての小論文",null,0.85]
{"$rows_empty":24}
[null,"合計点",{"$f":"IF(COUNT(C8:C33) <> 0,AVERAGE(C8:C33) *C7, \"\")","v":{"v":0.08823529411764706,"d":"0.0882"}},{"v":0.085,"d":"0.0850"},"","","",""]
[null,"満点",{"$f":"IF(COUNT(C8:C33)<>0,C7,\"\")","v":0.1},0.1,"","","",""]
[null,"得点率",null,{"$f":"IF(SUM($C$35:$H$35) <> 0,SUM($C$34:$H$34)/SUM($C$35:$H$35),\"\")","v":{"v":0.8661764705882353,"d":"86.62%"}}]
[null,"計算方法","満点中、何点獲得したかを入力します (例 : 15/17)。"]
[null,null,"得点率を入力します (例 : 85%)。"]

{"sheet":"科目 2","index":2,"n_rows":38,"n_cols":8,"rows_kept":38,"merged":[[1,1,1,2]]}
[]
[null,{"$f":"全科目!B6","v":"科目 2"}]
[null,"教授 :",null,null,"得点率",null,null,{"$f":"IF(SUM($C$35:$H$35) <> 0,SUM($C$34:$H$34)/SUM($C$35:$H$35),\"\")","v":""}]
[null,"電子メール :",null,null,"現在の成績",null,null,{"$f":"SUM($C$34:$H$34)","v":{"v":0,"d":"0.00%"}}]
[]
[null,"課題","宿題","小論文","小テスト","プロジェクト","中間試験","期末試験"]
[null,"比重",{"v":0.1,"d":"10.0%"},{"v":0.1,"d":"10.0%"},{"v":0.15,"d":"15.0%"},{"v":0.15,"d":"15.0%"},{"v":0.2,"d":"20.0%"},{"v":0.3,"d":"30.0%"}]
{"$rows_empty":26}
[null,"合計点",{"$f":"IF(COUNT(C8:C33) <> 0,AVERAGE(C8:C33) *C7, \"\")","v":""},"","","","",""]
[null,"満点",{"$f":"IF(COUNT(C8:C33)<>0,C7,\"\")","v":""},"","","","",""]
[null,"得点率",null,{"$f":"IF(SUM($C$35:$H$35) <> 0,SUM($C$34:$H$34)/SUM($C$35:$H$35),\"\")","v":""}]
[null,"計算方法","満点中、何点獲得したかを入力します (例 : 15/17)。"]
[null,null,"得点率を入力します (例 : 85%)。"]

{"sheet":"科目 3","index":3,"n_rows":38,"n_cols":8,"rows_kept":38,"merged":[[1,1,1,2]]}
[]
[null,{"$f":"全科目!B7","v":"科目 3"}]
[null,"教授 :",null,null,"得点率",null,null,{"$f":"IF(SUM($C$35:$H$35) <> 0,SUM($C$34:$H$34)/SUM($C$35:$H$35),\"\")","v":""}]
[null,"電子メール :",null,null,"現在の成績",null,null,{"$f":"SUM($C$34:$H$34)","v":{"v":0,"d":"0.00%"}}]
[]
[null,"課題","宿題","小論文","小テスト","プロジェクト","中間試験","期末試験"]
[null,"比重",{"v":0.1,"d":"10.0%"},{"v":0.1,"d":"10.0%"},{"v":0.15,"d":"15.0%"},{"v":0.15,"d":"15.0%"},{"v":0.2,"d":"20.0%"},{"v":0.3,"d":"30.0%"}]
{"$rows_empty":26}
[null,"合計点",{"$f":"IF(COUNT(C8:C33) <> 0,AVERAGE(C8:C33) *C7, \"\")","v":""},"","","","",""]
[null,"満点",{"$f":"IF(COUNT(C8:C33)<>0,C7,\"\")","v":""},"","","","",""]
[null,"得点率",null,{"$f":"IF(SUM($C$35:$H$35) <> 0,SUM($C$34:$H$34)/SUM($C$35:$H$35),\"\")","v":""}]
[null,"計算方法","満点中、何点獲得したかを入力します (例 : 15/17)。"]
[null,null,"得点率を入力します (例 : 85%)。"]

{"sheet":"科目 4","index":4,"n_rows":38,"n_cols":8,"rows_kept":38,"merged":[[1,1,1,2]]}
[]
[null,{"$f":"全科目!B8","v":"科目 4"}]
[null,"教授 :",null,null,"得点率",null,null,{"$f":"IF(SUM($C$35:$H$35) <> 0,SUM($C$34:$H$34)/SUM($C$35:$H$35),\"\")","v":""}]
[null,"電子メール :",null,null,"現在の成績",null,null,{"$f":"SUM($C$34:$H$34)","v":{"v":0,"d":"0.00%"}}]
[]
[null,"課題","宿題","小論文","小テスト","プロジェクト","中間試験","期末試験"]
[null,"比重",{"v":0.1,"d":"10.0%"},{"v":0.1,"d":"10.0%"},{"v":0.15,"d":"15.0%"},{"v":0.15,"d":"15.0%"},{"v":0.2,"d":"20.0%"},{"v":0.3,"d":"30.0%"}]
{"$rows_empty":26}
[null,"合計点",{"$f":"IF(COUNT(C8:C33) <> 0,AVERAGE(C8:C33) *C7, \"\")","v":""},"","","","",""]
[null,"満点",{"$f":"IF(COUNT(C8:C33)<>0,C7,\"\")","v":""},"","","","",""]
[null,"得点率",null,{"$f":"IF(SUM($C$35:$H$35) <> 0,SUM($C$34:$H$34)/SUM($C$35:$H$35),\"\")","v":""}]
[null,"計算方法","満点中、何点獲得したかを入力します (例 : 15/17)。"]
[null,null,"得点率を入力します (例 : 85%)。"]

{"sheet":"科目 5","index":5,"n_rows":38,"n_cols":8,"rows_kept":38,"merged":[[1,1,1,2]]}
[]
[null,{"$f":"全科目!B9","v":"科目 5"}]
[null,"教授 :",null,null,"得点率",null,null,{"$f":"IF(SUM($C$35:$H$35) <> 0,SUM($C$34:$H$34)/SUM($C$35:$H$35),\"\")","v":""}]
[null,"電子メール :",null,null,"現在の成績",null,null,{"$f":"SUM($C$34:$H$34)","v":{"v":0,"d":"0.00%"}}]
[]
[null,"課題","宿題","小論文","小テスト","プロジェクト","中間試験","期末試験"]
[null,"比重",{"v":0.1,"d":"10.0%"},{"v":0.1,"d":"10.0%"},{"v":0.15,"d":"15.0%"},{"v":0.15,"d":"15.0%"},{"v":0.2,"d":"20.0%"},{"v":0.3,"d":"30.0%"}]
{"$rows_empty":26}
[null,"合計点",{"$f":"IF(COUNT(C8:C33) <> 0,AVERAGE(C8:C33) *C7, \"\")","v":""},"","","","",""]
[null,"満点",{"$f":"IF(COUNT(C8:C33)<>0,C7,\"\")","v":""},"","","","",""]
[null,"得点率",null,{"$f":"IF(SUM($C$35:$H$35) <> 0,SUM($C$34:$H$34)/SUM($C$35:$H$35),\"\")","v":""}]
[null,"計算方法","満点中、何点獲得したかを入力します (例 : 15/17)。"]
[null,null,"得点率を入力します (例 : 85%)。"]

{"sheet":"科目 6","index":6,"n_rows":38,"n_cols":8,"rows_kept":38,"merged":[[1,1,1,2]]}
[]
[null,{"$f":"全科目!B10","v":"科目 6"}]
[null,"教授 :",null,null,"得点率",null,null,{"$f":"IF(SUM($C$35:$H$35) <> 0,SUM($C$34:$H$34)/SUM($C$35:$H$35),\"\")","v":""}]
[null,"電子メール :",null,null,"現在の成績",null,null,{"$f":"SUM($C$34:$H$34)","v":{"v":0,"d":"0.00%"}}]
[]
[null,"課題","宿題","小論文","小テスト","プロジェクト","中間試験","期末試験"]
[null,"比重",{"v":0.1,"d":"10.0%"},{"v":0.1,"d":"10.0%"},{"v":0.15,"d":"15.0%"},{"v":0.15,"d":"15.0%"},{"v":0.2,"d":"20.0%"},{"v":0.3,"d":"30.0%"}]
{"$rows_empty":26}
[null,"合計点",{"$f":"IF(COUNT(C8:C33) <> 0,AVERAGE(C8:C33) *C7, \"\")","v":""},"","","","",""]
[null,"満点",{"$f":"IF(COUNT(C8:C33)<>0,C7,\"\")","v":""},"","","","",""]
[null,"得点率",null,{"$f":"IF(SUM($C$35:$H$35) <> 0,SUM($C$34:$H$34)/SUM($C$35:$H$35),\"\")","v":""}]
[null,"計算方法","満点中、何点獲得したかを入力します (例 : 15/17)。"]
[null,null,"得点率を入力します (例 : 85%)。"]

{"sheet":"科目 7","index":7,"n_rows":38,"n_cols":8,"rows_kept":38,"merged":[[1,1,1,2]]}
[]
[null,{"$f":"全科目!B11","v":"科目 7"}]
[null,"教授 :",null,null,"得点率",null,null,{"$f":"IF(SUM($C$35:$H$35) <> 0,SUM($C$34:$H$34)/SUM($C$35:$H$35),\"\")","v":""}]
[null,"電子メール :",null,null,"現在の成績",null,null,{"$f":"SUM($C$34:$H$34)","v":{"v":0,"d":"0.00%"}}]
[]
[null,"課題","宿題","小論文","小テスト","プロジェクト","中間試験","期末試験"]
[null,"比重",{"v":0.1,"d":"10.0%"},{"v":0.1,"d":"10.0%"},{"v":0.15,"d":"15.0%"},{"v":0.15,"d":"15.0%"},{"v":0.2,"d":"20.0%"},{"v":0.3,"d":"30.0%"}]
{"$rows_empty":26}
[null,"合計点",{"$f":"IF(COUNT(C8:C33) <> 0,AVERAGE(C8:C33) *C7, \"\")","v":""},"","","","",""]
[null,"満点",{"$f":"IF(COUNT(C8:C33)<>0,C7,\"\")","v":""},"","","","",""]
[null,"得点率",null,{"$f":"IF(SUM($C$35:$H$35) <> 0,SUM($C$34:$H$34)/SUM($C$35:$H$35),\"\")","v":""}]
[null,"計算方法","満点中、何点獲得したかを入力します (例 : 15/17)。"]
[null,null,"得点率を入力します (例 : 85%)。"]

{"sheet":"GPA 表","index":8,"n_rows":7,"n_cols":15,"rows_kept":7}
[]
[]
[]
[null,"5 段階評価と GPA"]
[null,"平均",{"v":0,"d":"0%"},{"v":0.6,"d":"60%"},{"v":0.63,"d":"63%"},{"v":0.67,"d":"67%"},{"v":0.7,"d":"70%"},{"v":0.73,"d":"73%"},{"v":0.77,"d":"77%"},{"v":0.8,"d":"80%"},{"v":0.83,"d":"83%"},{"v":0.87,"d":"87%"},{"v":0.9,"d":"90%"},{"v":0.93,"d":"93%"},{"v":0.97,"d":"97%"}]
[null,"5 段階評価","F","D-","D","D+","C-","C","C+","B-","B","B+","A-","A","A+"]
[null,"平均GPA",{"v":0,"d":"0.00"},0.67,{"v":1,"d":"1.00"},1.33,1.67,{"v":2,"d":"2.00"},2.33,2.67,{"v":3,"d":"3.00"},3.33,3.67,{"v":4,"d":"4.00"},{"v":4,"d":"4.00"}]